module github.com/starskim/DDBOT

go 1.20

require (
	dario.cat/mergo v1.0.0
	github.com/Jeffail/gabs/v2 v2.7.0
	github.com/Mrs4s/MiraiGo v0.0.0-20231010012600-c025459da09e
	github.com/PuerkitoBio/goquery v1.8.1
	github.com/Sora233/sliceutil v0.0.0-20210120043858-459badd8d882
	github.com/alecthomas/kong v0.8.1
	github.com/davecgh/go-spew v1.1.2-0.20180830191138-d8f796af33cc
	github.com/dimchansky/utfbom v1.1.1
	github.com/ericpauley/go-quantize v0.0.0-20200331213906-ae555eb2afa4
	github.com/fsnotify/fsnotify v1.7.0
	github.com/ghodss/yaml v1.0.0
	github.com/gofrs/flock v0.8.1
	github.com/google/uuid v1.4.0
	github.com/guonaihong/gout v0.3.8
	github.com/hashicorp/golang-lru v1.0.2
	github.com/huandu/xstrings v1.4.0
	github.com/json-iterator/go v1.1.12
	github.com/lestrrat-go/file-rotatelogs v2.4.0+incompatible
	github.com/mitchellh/copystructure v1.2.0
	github.com/modern-go/gls v0.0.0-20220109145502-612d0167dce5
	github.com/nfnt/resize v0.0.0-20180221191011-83c6a9932646
	github.com/nobuf/cas v0.0.0-20211227073117-1f46a292d04a
	github.com/rifflock/lfshook v0.0.0-20180920164130-b9218ef580f5
	github.com/robfig/cron/v3 v3.0.1
	github.com/samber/lo v1.38.1
	github.com/shopspring/decimal v1.3.1
	github.com/sirupsen/logrus v1.9.3
	github.com/spf13/cast v1.5.1
	github.com/starskim/MiraiGo-Template v0.0.0-20231019102208-0e0f0f3e54bf
	github.com/stretchr/testify v1.8.4
	github.com/tidwall/buntdb v1.3.0
	github.com/tidwall/gjson v1.17.0
	go.uber.org/atomic v1.11.0
	golang.org/x/sync v0.4.0
	google.golang.org/protobuf v1.31.0
)

require (
	github.com/RomiChan/protobuf v0.1.1-0.20230204044148-2ed269a2e54d // indirect
	github.com/RomiChan/syncx v0.0.0-20221202055724-5f842c53020e // indirect
	github.com/andybalholm/brotli v1.0.6 // indirect
	github.com/andybalholm/cascadia v1.3.2 // indirect
	github.com/bytedance/sonic v1.10.2 // indirect
	github.com/chenzhuoyu/base64x v0.0.0-20230717121745-296ad89f973d // indirect
	github.com/chenzhuoyu/iasm v0.9.0 // indirect
	github.com/fumiama/imgsz v0.0.2 // indirect
	github.com/gabriel-vasile/mimetype v1.4.3 // indirect
	github.com/go-playground/locales v0.14.1 // indirect
	github.com/go-playground/universal-translator v0.18.1 // indirect
	github.com/go-playground/validator/v10 v10.15.5 // indirect
	github.com/goccy/go-json v0.10.2 // indirect
	github.com/google/go-querystring v1.1.0 // indirect
	github.com/hashicorp/hcl v1.0.0 // indirect
	github.com/jonboulle/clockwork v0.4.0 // indirect
	github.com/klauspost/cpuid/v2 v2.2.5 // indirect
	github.com/leodido/go-urn v1.2.4 // indirect
	github.com/lestrrat-go/strftime v1.0.6 // indirect
	github.com/magiconair/properties v1.8.7 // indirect
	github.com/mattn/go-colorable v0.1.13 // indirect
	github.com/mattn/go-isatty v0.0.20 // indirect
	github.com/mitchellh/mapstructure v1.5.0 // indirect
	github.com/mitchellh/reflectwalk v1.0.2 // indirect
	github.com/modern-go/concurrent v0.0.0-20180306012644-bacd9c7ef1dd // indirect
	github.com/modern-go/reflect2 v1.0.2 // indirect
	github.com/pelletier/go-toml/v2 v2.1.0 // indirect
	github.com/pierrec/lz4/v4 v4.1.18 // indirect
	github.com/pkg/errors v0.9.1 // indirect
	github.com/pmezard/go-difflib v1.0.1-0.20181226105442-5d4384ee4fb2 // indirect
	github.com/sagikazarmark/locafero v0.3.0 // indirect
	github.com/sagikazarmark/slog-shim v0.1.0 // indirect
	github.com/sourcegraph/conc v0.3.0 // indirect
	github.com/spf13/afero v1.10.0 // indirect
	github.com/spf13/pflag v1.0.5 // indirect
	github.com/spf13/viper v1.17.0 // indirect
	github.com/subosito/gotenv v1.6.0 // indirect
	github.com/tidwall/btree v1.7.0 // indirect
	github.com/tidwall/grect v0.1.4 // indirect
	github.com/tidwall/match v1.1.1 // indirect
	github.com/tidwall/pretty v1.2.1 // indirect
	github.com/tidwall/rtred v0.1.2 // indirect
	github.com/tidwall/tinyqueue v0.1.1 // indirect
	github.com/twitchyliquid64/golang-asm v0.15.1 // indirect
	go.uber.org/multierr v1.11.0 // indirect
	golang.org/x/arch v0.5.0 // indirect
	golang.org/x/crypto v0.14.0 // indirect
	golang.org/x/exp v0.0.0-20231006140011-7918f672742d // indirect
	golang.org/x/net v0.17.0 // indirect
	golang.org/x/sys v0.13.0 // indirect
	golang.org/x/text v0.13.0 // indirect
	gopkg.ilharper.com/x/isatty v1.1.1 // indirect
	gopkg.in/ini.v1 v1.67.0 // indirect
	gopkg.in/yaml.v2 v2.4.0 // indirect
	gopkg.in/yaml.v3 v3.0.1 // indirect
)
