<?xml version="1.0" encoding="UTF-8" standalone="no"?>
<!-- Created with Inkscape (http://www.inkscape.org/) -->

<svg
   width="512"
   height="512"
   viewBox="0 0 135.46666 135.46667"
   version="1.1"
   id="svg5"
   inkscape:export-filename="/home/tm85/bitmap.png"
   inkscape:export-xdpi="12.000001"
   inkscape:export-ydpi="12.000001"
   inkscape:version="1.1.1 (3bf5ae0d25, 2021-09-20)"
   sodipodi:docname="superthruster_off.ink.svg"
   xmlns:inkscape="http://www.inkscape.org/namespaces/inkscape"
   xmlns:sodipodi="http://sodipodi.sourceforge.net/DTD/sodipodi-0.dtd"
   xmlns="http://www.w3.org/2000/svg"
   xmlns:svg="http://www.w3.org/2000/svg">
  <sodipodi:namedview
     id="namedview7"
     pagecolor="#ffffff"
     bordercolor="#666666"
     borderopacity="1.0"
     inkscape:pageshadow="2"
     inkscape:pageopacity="0.0"
     inkscape:pagecheckerboard="0"
     inkscape:document-units="mm"
     showgrid="false"
     units="px"
     width="512px"
     showguides="true"
     inkscape:snap-object-midpoints="true"
     inkscape:snap-global="true"
     inkscape:guide-bbox="true"
     inkscape:zoom="2"
     inkscape:cx="287.75"
     inkscape:cy="246.75"
     inkscape:window-width="2548"
     inkscape:window-height="1412"
     inkscape:window-x="4"
     inkscape:window-y="20"
     inkscape:window-maximized="1"
     inkscape:current-layer="layer1">
    <sodipodi:guide
       position="67.733329,84.666669"
       orientation="1,0"
       id="guide352" />
  </sodipodi:namedview>
  <defs
     id="defs2">
    <inkscape:path-effect
       effect="fillet_chamfer"
       id="path-effect17083"
       is_visible="true"
       lpeversion="1"
       satellites_param="F,0,0,1,0,2.1166667,0,1 @ F,0,0,1,0,2.1166667,0,1 @ F,0,0,1,0,0,0,1 @ F,0,0,1,0,0,0,1"
       unit="px"
       method="auto"
       mode="F"
       radius="8"
       chamfer_steps="1"
       flexible="false"
       use_knot_distance="true"
       apply_no_radius="true"
       apply_with_radius="true"
       only_selected="false"
       hide_knots="false" />
    <inkscape:path-effect
       effect="fillet_chamfer"
       id="path-effect16803"
       is_visible="true"
       lpeversion="1"
       satellites_param="F,0,0,1,0,2.1166667,0,1 @ F,0,0,1,0,2.1166667,0,1 @ F,0,0,1,0,0,0,1 @ F,0,0,1,0,0,0,1"
       unit="px"
       method="auto"
       mode="F"
       radius="8"
       chamfer_steps="1"
       flexible="false"
       use_knot_distance="true"
       apply_no_radius="true"
       apply_with_radius="true"
       only_selected="false"
       hide_knots="false" />
    <inkscape:path-effect
       effect="fillet_chamfer"
       id="path-effect15774"
       is_visible="true"
       lpeversion="1"
       satellites_param="F,0,0,1,0,4.2333333,0,1 @ F,0,0,1,0,4.2333333,0,1 @ F,0,0,1,0,4.2333333,0,1 @ F,0,0,1,0,4.2333333,0,1"
       unit="px"
       method="auto"
       mode="F"
       radius="16"
       chamfer_steps="1"
       flexible="false"
       use_knot_distance="true"
       apply_no_radius="true"
       apply_with_radius="true"
       only_selected="false"
       hide_knots="false" />
    <inkscape:path-effect
       effect="fillet_chamfer"
       id="path-effect15612"
       is_visible="true"
       lpeversion="1"
       satellites_param="F,0,0,1,0,0,0,1 @ F,0,0,1,0,0,0,1 @ F,0,0,1,0,0,0,1 @ F,0,0,1,0,0,0,1"
       unit="px"
       method="auto"
       mode="F"
       radius="16"
       chamfer_steps="1"
       flexible="false"
       use_knot_distance="true"
       apply_no_radius="true"
       apply_with_radius="true"
       only_selected="false"
       hide_knots="false" />
    <inkscape:path-effect
       effect="fillet_chamfer"
       id="path-effect15006"
       is_visible="true"
       lpeversion="1"
       satellites_param="F,0,0,1,0,2.1166667,0,1 @ F,0,0,1,0,2.1166667,0,1 @ F,0,0,1,0,2.1166667,0,1 @ F,0,0,1,0,2.1166667,0,1"
       unit="px"
       method="auto"
       mode="F"
       radius="16"
       chamfer_steps="1"
       flexible="false"
       use_knot_distance="true"
       apply_no_radius="true"
       apply_with_radius="true"
       only_selected="false"
       hide_knots="false" />
    <inkscape:path-effect
       effect="fillet_chamfer"
       id="path-effect12397"
       is_visible="true"
       lpeversion="1"
       satellites_param="F,0,0,1,0,2.6458333,0,5 @ F,0,0,1,0,2.6458333,0,5 @ F,0,0,1,0,2.6458333,0,5 | F,0,0,1,0,2.6458333,0,5 @ F,0,0,1,0,2.6458333,0,5 @ F,0,0,1,0,2.6458333,0,5"
       unit="px"
       method="auto"
       mode="F"
       radius="10"
       chamfer_steps="5"
       flexible="false"
       use_knot_distance="true"
       apply_no_radius="true"
       apply_with_radius="true"
       only_selected="false"
       hide_knots="false" />
    <inkscape:path-effect
       effect="fillet_chamfer"
       id="path-effect12289"
       is_visible="true"
       lpeversion="1"
       satellites_param="C,0,0,1,0,2.6458333,0,5 @ C,0,0,1,0,2.6458333,0,5 @ C,0,0,1,0,2.6458333,0,5 | C,0,0,1,0,2.6458333,0,5 @ C,0,0,1,0,2.6458333,0,5 @ C,0,0,1,0,2.6458333,0,5"
       unit="px"
       method="auto"
       mode="F"
       radius="10"
       chamfer_steps="5"
       flexible="false"
       use_knot_distance="true"
       apply_no_radius="true"
       apply_with_radius="true"
       only_selected="false"
       hide_knots="false" />
    <inkscape:path-effect
       effect="fillet_chamfer"
       id="path-effect12074"
       is_visible="true"
       lpeversion="1"
       satellites_param="F,0,0,1,0,0,0,1 @ F,0,0,1,0,0,0,1 @ F,0,0,1,0,0,0,1"
       unit="px"
       method="auto"
       mode="F"
       radius="0"
       chamfer_steps="1"
       flexible="false"
       use_knot_distance="true"
       apply_no_radius="true"
       apply_with_radius="true"
       only_selected="false"
       hide_knots="false" />
  </defs>
  <g
     inkscape:groupmode="layer"
     id="layer2"
     inkscape:label="Thrusters"
     style="display:inline">
    <path
       id="path13665"
       style="display:inline;fill:#444444;stroke-width:0.241045"
       d="m 17.005965,1.5254129 c 0.05572,7.6523956 1.935406,15.1504561 5.082075,21.4197231 4.632186,9.2978 11.562024,15.964748 18.96236,20.489207 12.491065,7.331211 26.578425,9.117652 39.891553,5.681075 C 92.616216,46.033155 104.22709,38.757547 111.88465,25.837012 116.16757,18.620455 118.73599,9.3848452 118.5208,0 84.658316,0 50.795823,0 16.933333,0 c 0.0242,0.50847098 0.04842,1.0169419 0.07265,1.5254129 z" />
  </g>
  <g
     inkscape:label="Body"
     inkscape:groupmode="layer"
     id="layer1"
     style="display:inline">
    <rect
       style="fill:#888888;fill-opacity:1;stroke-width:0.229136"
       id="rect55"
       width="135.46666"
       height="101.6"
       x="0"
       y="33.866665"
       rx="33.866665"
       ry="33.866665" />
    <rect
       style="fill:#777777;fill-opacity:1;stroke-width:0.17889;stroke-miterlimit:4;stroke-dasharray:none"
       id="rect55-3"
       width="110.06668"
       height="76.199997"
       x="12.700001"
       y="46.566666"
       rx="21.166666"
       ry="21.166666" />
    <circle
       style="fill:#666666;fill-opacity:1;stroke-width:0.295625;stroke-miterlimit:4;stroke-dasharray:none"
       id="path4533"
       cx="67.73333"
       cy="84.666664"
       r="23.283333" />
    <path
       id="rect16402"
       style="fill:#444444;stroke-width:0.0200972"
       d="m 44.45,127 h 2.116666 a 2.1166667,2.1166667 45 0 1 2.116667,2.11667 l 0,6.35 h -6.35 v -6.35 A 2.1166667,2.1166667 135 0 1 44.45,127 Z"
       inkscape:path-effect="#path-effect16803"
       inkscape:original-d="m 42.333333,127 h 6.35 v 8.46667 h -6.35 z" />
    <path
       id="rect16402-0"
       style="display:inline;fill:#444444;stroke-width:0.0200972"
       d="m 88.9,127 h 2.116666 a 2.1166667,2.1166667 45 0 1 2.116667,2.11667 v 6.35 h -6.35 v -6.35 A 2.1166667,2.1166667 135 0 1 88.9,127 Z"
       inkscape:path-effect="#path-effect17083"
       inkscape:original-d="m 86.783333,127 h 6.35 v 8.46667 h -6.35 z" />
  </g>
</svg>
