{
  "meta": {
    "type": "trial",
    "title": "The Trial Period Review Form",
    "description": "The probationary period is an employee's initial period of employment in a regular or recurring position during which an employee is expected to adapt to the position and to demonstrate proficiencies in the techniques, procedures and skills inherent to the position."
  },
  "general": {
    "rows": [
      [
        {
          "type": "string",
          "name": "name",
          "label": "Name",
          "placeholder": "Name",
          "required": false,
          "value": ""
        },
        {
          "type": "date",
          "name": "completionAt",
          "label": "Date of form completion",
          "placeholder": "Fill date of form completion",
          "required": true,
          "value": ""
        }
      ],
      [
        {
          "type": "select",
          "name": "jobTitle",
          "label": "Position",
          "options": [
            {
              "label": "test position",
              "value": "test position"
            },
            {
              "label": "test position",
              "value": "test position"
            }
          ],
          "placeholder": "test",
          "required": true,
          "value": ""
        },
        {
          "type": "date",
          "name": "startAt",
          "label": "Evaluation Period Start",
          "placeholder": "Fill evaluation Period Start",
          "required": true,
          "value": ""
        }
      ],
      [
        {
          "type": "select",
          "name": "city",
          "label": "Location",
          "options": [
            {
              "label": "Odessa, UA",
              "value": "odessaUkraine"
            },
            {
              "label": "Kiev, UA",
              "value": "kievUkraine"
            }
          ],
          "placeholder": "Fill location",
          "required": true,
          "value": ""
        },
        {
          "type": "date",
          "name": "endAt",
          "label": "Evaluation Period End",
          "placeholder": "Fill evaluation Period End",
          "required": true,
          "value": ""
        }
      ],
      [
        {
          "type": "input",
          "name": "supervisor",
          "label": "Immediate Supervisor",
          "placeholder": "Fill Immediate Supervisor",
          "required": true,
          "value": ""
        },
        {
          "type": "date",
          "name": "meetingAt",
          "label": "Meeting Date",
          "placeholder": "Fill Meeting Date",
          "required": true,
          "value": ""
        }
      ]
    ]
  },
  "valuation": {
    "head": [
      [
        {
          "label": "Performance Traits",
          "description": ""
        },
        {
          "label": "B-Exceptional",
          "description": "Results clearly exceed most position requirements; consistent competent performance, including demanding situations or circumstances"
        },
        {
          "label": "C-Competent",
          "description": "Competent performance in most situations and circumstances"
        },
        {
          "label": "D-Marginal",
          "description": "Shows capability, but in a variable manner; improvement needed in key areas"
        },
        {
          "label": "Supervisor's Comments"
        }
      ]
    ],
    "rows": [
      [
        {
          "label": "Job Knowledge/Functional and Technical Skills",
          "name": "jobKnowledge",
          "description": [
            "Possessing and using skills \"required\" for the position.",
            "Achieving the \"required\" level of knowledge and skills in position-related areas.",
            "Keeping up to date in all relevant knowledge and skills areas to meet job requirements."
          ],
          "fields": [
            {
              "type": "radio",
              "name": "jobKnowledge",
              "input": "B",
              "value": "",
              "required": false
            },
            {
              "type": "radio",
              "name": "jobKnowledge",
              "input": "C",
              "value": "",
              "required": false
            },
            {
              "type": "radio",
              "name": "jobKnowledge",
              "input": "D",
              "value": "",
              "required": false
            },
            {
              "type": "textarea",
              "name": "comment",
              "value": "",
              "required": false
            }
          ]
        }
      ],
      [
        {
          "label": "Productivity and Quality of Work",
          "name": "productivity",
          "description": [
            "Consistently performing at a superior level, setting an example for others. Producing outstanding quantity of work while giving the proper attention to quality.",
            "Recognizing and taking initiative to resolve problems.",
            "Ability to work under pressure and learn from previous mistakes."
          ],
          "fields": [
            {
              "type": "radio",
              "name": "productivity",
              "input": "B",
              "value": "",
              "required": false
            },
            {
              "type": "radio",
              "name": "productivity",
              "input": "C",
              "value": "",
              "required": false
            },
            {
              "type": "radio",
              "name": "productivity",
              "input": "D",
              "value": "",
              "required": false
            },
            {
              "type": "textarea",
              "name": "comment",
              "value": "",
              "required": false
            }
          ]
        }
      ],
      [
        {
          "label": "Speed of Work",
          "name": "speedWork",
          "description": [
            "Ability to work at quick rates of speed, while producing accurate outcomes."
          ],
          "fields": [
            {
              "type": "radio",
              "name": "speedWork",
              "input": "B",
              "value": "",
              "required": false
            },
            {
              "type": "radio",
              "name": "speedWork",
              "input": "C",
              "value": "",
              "required": false
            },
            {
              "type": "radio",
              "name": "speedWork",
              "input": "D",
              "value": "",
              "required": false
            },
            {
              "type": "textarea",
              "name": "comment",
              "value": "",
              "required": false
            }
          ]
        }
      ],
      [
        {
          "label": "Time Management",
          "name": "timeManagement",
          "description": [
            "Ability to self-manage.",
            "Prioritization of multiple activities and assignments effectively.",
            "Planning consistently on a long and short term basis.",
            "Defining goals and monitors progress.",
            "Meeting commitments and deadlines consistently."
          ],
          "fields": [
            {
              "type": "radio",
              "name": "timeManagement",
              "input": "B",
              "value": "",
              "required": false
            },
            {
              "type": "radio",
              "name": "timeManagement",
              "input": "C",
              "value": "",
              "required": false
            },
            {
              "type": "radio",
              "name": "timeManagement",
              "input": "D",
              "value": "",
              "required": false
            },
            {
              "type": "textarea",
              "name": "comment",
              "value": "",
              "required": false
            }
          ]
        }
      ],
      [
        {
          "label": "Professional Attitude",
          "name": "professionalAttitude",
          "description": [
            "Effective work under pressure or in a crisis situation.",
            "Working beyond normal expectations when workload and deadlines require it.",
            "Punctual for work, meetings, appointments and reporting; when absent from work, informs the supervisor, and insures work assignments are completed",
            "Taking project decisions based on the understanding of the product, market and customer/users needs.",
            "Involving others team members as needed to ensure the quality and commitment of the decision."
          ],
          "fields": [
            {
              "type": "radio",
              "name": "professionalAttitude",
              "input": "B",
              "value": "",
              "required": false
            },
            {
              "type": "radio",
              "name": "professionalAttitude",
              "input": "C",
              "value": "",
              "required": false
            },
            {
              "type": "radio",
              "name": "professionalAttitude",
              "input": "D",
              "value": "",
              "required": false
            },
            {
              "type": "textarea",
              "name": "comment",
              "value": "",
              "required": false
            }
          ]
        }
      ],
      [
        {
          "label": "Leadership",
          "name": "leadership",
          "description": [
            "Inspiration and direction team members to higher levels of performance.",
            "Accepting accountability for group performance, identifying and resolving issues and problems areas.",
            "Establishing and monitoring department standards/policies.",
            "Providing the staff with information and ensure understanding of the overall company goals / decisions and culture.",
            " Creating a climate in which people want to do their best."
          ],
          "fields": [
            {
              "type": "radio",
              "name": "leadership",
              "input": "B",
              "value": "",
              "required": false
            },
            {
              "type": "radio",
              "name": "leadership",
              "input": "C",
              "value": "",
              "required": false
            },
            {
              "type": "radio",
              "name": "leadership",
              "input": "D",
              "value": "",
              "required": false
            },
            {
              "type": "textarea",
              "name": "comment",
              "value": "",
              "required": false
            }
          ]
        }
      ],
      [
        {
          "label": "Employees Development",
          "name": "employeesDevelopment",
          "description": [
            "Encouraging and mentoring staff for growth and providing training opportunities.",
            "Setting clear objectives and measures.",
            "Providing the necessary information and resources for staff to be effective.",
            "Working with employees to reinforce effective efforts and progress or improve performance.",
            " Conducting performance review on time."
          ],
          "fields": [
            {
              "type": "radio",
              "name": "employeesDevelopment",
              "input": "B",
              "value": "",
              "required": false
            },
            {
              "type": "radio",
              "name": "employeesDevelopment",
              "input": "C",
              "value": "",
              "required": false
            },
            {
              "type": "radio",
              "name": "employeesDevelopment",
              "input": "D",
              "value": "",
              "required": false
            },
            {
              "type": "textarea",
              "name": "comment",
              "value": "",
              "required": false
            }
          ]
        }
      ],
      [
        {
          "label": "Valuing Diversity",
          "name": "valuingDiversity",
          "description": [
            "Effective work with individuals of diverse styles, abilities, backgrounds, and motivations.",
            "Attention to all details and aspects of a job or process to ensuring a complete, high quality output.",
            "Demonstrating a positive attitude and maintaining constructive interpersonal relationships under stress."
          ],
          "fields": [
            {
              "type": "radio",
              "name": "valuingDiversity",
              "input": "B",
              "value": "",
              "required": false
            },
            {
              "type": "radio",
              "name": "valuingDiversity",
              "input": "C",
              "value": "",
              "required": false
            },
            {
              "type": "radio",
              "name": "valuingDiversity",
              "input": "D",
              "value": "",
              "required": false
            },
            {
              "type": "textarea",
              "name": "comment",
              "value": "",
              "required": false
            }
          ]
        }
      ],
      [
        {
          "label": "Decision Making/Problem Solving Ability",
          "name": "decisionMaking",
          "description": [
            "Forecasting and identifying problems and their priorities, evaluating alternatives.",
            "Choosing the appropriate action by evaluating \"options\" and considering implications in a timely manner."
          ],
          "fields": [
            {
              "type": "radio",
              "name": "decisionMaking",
              "input": "B",
              "value": "",
              "required": false
            },
            {
              "type": "radio",
              "name": "decisionMaking",
              "input": "C",
              "value": "",
              "required": false
            },
            {
              "type": "radio",
              "name": "decisionMaking",
              "input": "D",
              "value": "",
              "required": false
            },
            {
              "type": "textarea",
              "name": "comment",
              "value": "",
              "required": false
            }
          ]
        }
      ],
      [
        {
          "label": "Vision/Creativity",
          "name": "vision",
          "description": [
            "Bringing new ideas and ability to implement them.",
            "Find the time and resources to develop and implement those ideas that are worth acting upon finding."
          ],
          "fields": [
            {
              "type": "radio",
              "name": "vision",
              "input": "B",
              "value": "",
              "required": false
            },
            {
              "type": "radio",
              "name": "vision",
              "input": "C",
              "value": "",
              "required": false
            },
            {
              "type": "radio",
              "name": "vision",
              "input": "D",
              "value": "",
              "required": false
            },
            {
              "type": "textarea",
              "name": "comment",
              "value": "",
              "required": false
            }
          ]
        }
      ]
    ]
  }
}