@startuml

(Catalogue) as "**Catalogue Service**\nConsumer"
(Articles) as "**Articles Service**\nProvider"
(Likes) as "**Likes Service**\nProvider"

(Catalogue) -down-> (Articles)
(Catalogue) -down-> (Likes)

@enduml