{
    "entryFile": "./src/register-platform-adapter.ts",
    "noImplicitAdditionalProperties": "throw-on-extras",
    "spec": {
        "specVersion": 3,
        "outputDirectory": "./src",
        "specMerging": "recursive",
        "spec": {
            "info": {
                "version": "0.1.0"
            },
            "paths": {}
        },
        "securityDefinitions": {
            "jwt": {
                "type": "apiKey",
                "in": "header",
                "name": "Authorization",
                "description": "JWT token must be passed in queries in the 'Authorization' header following syntax: 'Authorization': Bearer <token>"
            }
        }
    },
    "controllerPathGlobs": ["src/components/**/*.controller.ts", "src/components/**/*.controller.v1.ts"],
    "routes": {
        "routesDir": "./src",
        "middleware": "express",
        "authenticationModule": "./src/middleware/auth.ts"
    },
    "ignore": ["**/node_modules/**"]
}
