[
  {
    "Id": 1,
    "FirstName": "Brad",
    "LastName": "Pitt",
    "Birthday": "1967/06/07"
  },

  {
    "Id": 2,
    "FirstName": "Leonardo",
    "LastName": "DiCaprio",
    "Birthday": "1971/11/11"
  },

  {
    "Id": 3,
    "FirstName": "Jessica",
    "LastName": "Chastain",
    "Birthday": "1979/04/05"
  },

  {
    "Id": 4,
    "FirstName": "Christian",
    "LastName": "Bale",
    "Birthday": "1977/06/03"
  },

  {
    "Id": 5,
    "FirstName": "Matt",
    "LastName": "Damon",
    "Birthday": "1978/08/06"
  },
  {
    "Id": 6,
    "FirstName": "Tom",
    "LastName": "Hardy",
    "Birthday": "1977/09/15"
  },
  {
    "Id": 7,
    "FirstName": "Michelle",
    "LastName": "Williams",
    "Birthday": "1980/09/09"
  },
  {
    "Id": 8,
    "FirstName": "Jonah",
    "LastName": "Hill",
    "Birthday": "1983/12/20"
  },
  {
    "Id": 9,
    "FirstName": "Margot",
    "LastName": "Robbie",
    "Birthday": "1990/07/02"
  },
  {
    "Id": 10,
    "FirstName": "Hristo",
    "LastName": "Shopov",
    "Birthday": "1964/01/04"
  },
  {
    "Id": 11,
    "FirstName": "Georgi",
    "LastName": "Staikov",
    "Birthday": "1964/08/10"
  },
  {
    "Id": 12,
    "FirstName": "Matthew",
    "LastName": "McConaughy",
    "Birthday": "1969/11/04"
  },
  {
    "Id": 13,
    "FirstName": "Elijah",
    "LastName": "Wood",
    "Birthday": "1981/01/28"
  },
  {
    "Id": 14,
    "FirstName": "Orlando",
    "LastName": "Bloom",
    "Birthday": "1977/01/13"
  },
  {
    "Id": 15,
    "FirstName": "Eddie",
    "LastName": "Murphy",
    "Birthday": "1961/04/07"
  },
  {
    "Id": 16,
    "FirstName": "Cameron",
    "LastName": "Diaz",
    "Birthday": "1972/08/30"
  },
  {
    "Id": 17,
    "FirstName": "Sarah",
    "LastName": "Ballantyne",
    "Birthday": "1977/06/21"
  },
  {
    "Id": 18,
    "FirstName": "Clint",
    "LastName": "Eastwood",
    "Birthday": "1930/05/31"
  }
]
