{
  "extends": ["config:base", "schedule:nonOfficeHours", "npm:unpublishSafe", ":semanticCommits"],
  "baseBranches": ["develop"],
  "packageRules": [
    {
      "matchUpdateTypes": ["minor", "patch", "pin", "digest"],
      "automerge": true
    },
    {
      "matchDepTypes": ["devDependencies"],
      "automerge": true
    }
  ],
  "platformAutomerge": true
}
