{
  "labels": [
    {
      "identifier": 12,
      "name": "Planning",
      "description": "Autonomous Planning is a branch of artificial intelligence that concerns the realization of strategies or action sequences, typically for execution by intelligent agents, autonomous robots and unmanned vehicles. Solving a planning problem involves determining actions that, from an initial state, can be applied to a system so as to reach a predetermined goal. The process requires both to find which actions should be performed and when/in which order. The specification of a planning problem may include constraints, limited resources, and cost metrics to be optimized. Depending on the context, actions may correspond to activities or tasks to be performed, or to choosing locations for a set of objects.The process may be only partially automated, in which case plans are constantly checked and revised by a human supervisor. Examples include defining a plan for a scientific experiment to be performed by a semi-autonomous robot (e.g. a rover or an underwater vehicle), choosing trajectories for one or more autonomous agents, definiing autonomous exploration missions",
      "related terms": NaN
    },
    {
      "identifier": 13,
      "name": "Scheduling",
      "description": "Scheduling is the process of determining when, or in which order, to execut a set of activities. The activieties may correspond to steps in a production process, actions to be done by an autonomous agent, messages to exchange, or (less frequently) to the position of objects in a space. The set of activities to be performed is typically fixed and known in advance, and it is only their order that needs to be decided. The output of the process may prescribe specific times for the activity execution, it may determine their sequece, or it may come in a more articulated format where only some activity pairs are forced to follow a given order. A non-trivial scheduling problem always includes constraints (e.g. temporal dependencies, transition times), limited resources (e.g. production machines, vehicles, workers), or cost metrics to be optimized (e.g. completion time, tardiness, or actual economical cost). Example include scheduling (or planning) production activities so as to meet customer orders, managing a supply chaing, optimizing logistic operations (especially when time windows are involved).",
      "related terms": "planning"
    },
    {
      "identifier": 21,
      "name": "Knowledge Representation",
      "description": "Knowledge-representation is a field of artificial intelligence that focuses on designing computer representations that capture information about the world that can be used for solving complex problems in an automated fashion. As such, knowledge representation is strongly tied to automated reasoning. The justification for knowledge representation is that conventional procedural code makes it difficult to specify and integrate know facts or rules. This is conversely easier if one takes a declarative perspective, i.e. by focusing on knowledge representation rather than on coding a solution process directly. Knowledge representation incorporates elements of psychology and formal logic.  Findings from psychology enable the definition of formalisms that make it easier to design and build complex system. Formal logic is typically employed as the basis for automating various kind of reasoning, such as the application of rules or the relations of sets and subsets. First Order Logic (FOL) is often employed due to its expressive power, while subsets of FOL may be employed to trade expressive power for simplicity of use. Examples of knowledge representation formalisms include semantic nets, systems architecture, frames, rules, and ontologies. Knowledge representation is a key enabling technology for the semantic web and expert systems. Applications include integration of information from multiple sources, consolidation of schemas from heterogeneous databases, providing a unified knowledge base for software system or company data.",
      "related terms": NaN
    },
    {
      "identifier": 22,
      "name": "Automated Reasoning",
      "description": "Automated reasoning is a sub-field of Artificial Intelligence that is dedicated to understanding different aspects of reasoning. The study of automated reasoning helps produce computer programs that allow computers to reason completely, or nearly completely, automatically. In turns this enables the solution of complex tasks such as diagnosing a medical condition, retrieving information about a given topic, of checking the validity of a certain property. Automated reasoning has connections with theoretical computer science and philosophy. Automated reasoning is strongly tied to the field of knowledge representation, as different representations formalisms may enable of facilitate different types of reasoning. Examples of automated reasoning formalisms include First Order Logic, fuzzy logic, probabilistic logic. For the same formalisms, multiple form of reasoning are possible, such as deductive, inductive, and abductive reasoning. Applications include automatic or interactive theorem proving, software verification, hardware verification.",
      "related terms": NaN
    },
    {
      "identifier": 23,
      "name": "Commonsense Reasoning",
      "description": "In artificial intelligence, commonsense reasoning is the ability to make presumptions and reason about ordinary situations humans encounter every day, in a way that is at least superficially similar to how humans themselves operate. A system capable of commonsense reasoning may be capable of make assumptions about the nature of observed objects, about people and their intentions, or naive physics. The system would then be able to act accordingly. One informal definition states that commonsense reasoning is 'what a typical seven year old knows about the world'. The commonsense knowledge problem is a current project in the sphere of artificial intelligence to create a database that contains the general knowledge most individuals are expected to have, represented in an accessible way to artificial intelligence programs. Commonsense reasoning has relation with computed vision, natural language processing, robotic manipulation.",
      "related terms": "natural language processing, vision, robotics"
    },
    {
      "identifier": 24,
      "name": "Searching",
      "description": "Searching AI refers to a set of fundamental techniques for exploring the space of possible configurations of variables. The variables frequently represent decisions, actions, or states. Some configurations may be invalid, due to the presence of constraints, or encouraged/discourages by making use of a cost metric. Different search techniques may be employed depending on the nature of the space to be explored, from numerical methods suited for continuous variables (e.g. Differential Optimization, Particle Swarm Optimization) to enumeration-like approaches for discrete variables (e.g. tree search, Branch and Bound, A*, Monte-Carlo tree search, CDCL). Search techniques may be complete, i.e. they may guaranteed to eventually find a combination that is optimal, or that satisfies given constraints if such a combination exists; alternatively, they may be incomplete, i.e. they may not provide such a guarantee. As a generic technique, searching may be employed in different contexts, such as: exploring the possible sequences of actions that a robot or human may take in order to achieve a certain goal (essentially, for planning); exploring the set of possible in a game, or in a multi-agent interaction; determining the optimal assignment for a set of variables representing decisions in a logistic problem; determining the most likely event, given a know probabilistic model. Search can be employed for reasoning, verification, optimization, probabilistic inference.",
      "related terms": "planning, optimization, inference, reasoning, verification"
    },
    {
      "identifier": 25,
      "name": "Optimization",
      "description": "Optimization refers to a set of fundamental techniques to find a configuration of variable assignments that minimizes a given cost metric (or maximizes a reward metric). The variables may represent decisions, actions, states, or parameters of a Machine Learning model. Optimization is strongly related to searching. Some configurations may be invalid due to the presence of \"hard\" constraint, while 'soft' constraints can be generally understood as terms in the cost metric. The most direct application of optimization in AI would to be solve hard decision making problems arising in logistic, scheduling, routing, resource management, planning, engineering, etc. However, optimization is also routinely employed for training Machine Learning models (in which case it is often understood as a form of learning) and in some cases to perform probabilistic inference. Different optimization techniques are employed in different context, e.g. numerical methods (gradient descent, Newton-like methods, Nelder-Mead, Particle Swarm Optimization) for continuous variables, combinatorial methods for discrete variables (e.g. Constraint Programming); some methods are applicable with mixed continuous and discrete variables (e.g. SAT Modulo Theories, Mixed-Integer Linear Programming and Mathematical Programming).",
      "related terms": "searching, learning, decision support, decision optimization"
    },
    {
      "identifier": 26,
      "name": "Machine Learning",
      "description": "Machine learning (ML) is the study of computer algorithms that can improve automatically through experience and by the use of data. It is seen as a part of Artificial Intelligence. Machine learning algorithms build a model based on sample data, known as training data, in order to make predictions or decisions without being explicitly programmed to do so. Machine learning algorithms are used in a wide variety of applications, such as in medicine, email filtering, speech recognition, computer vision, diagnostics, industrial maintenance, and anomaly detection, where it is difficult or unfeasible to develop conventional algorithms to perform the needed tasks. A subset of machine learning is closely related to computational statistics, which focuses on making predictions using computers; but not all machine learning is statistical learning. The study of mathematical optimization delivers methods, theory and application domains to the field of machine learning. Data mining is a related field of study, focusing on exploratory data analysis through unsupervised learning. Some implementations of machine learning use data and neural networks in a way that mimics the working of a biological brain. In its application across business problems, machine learning is also referred to as predictive analytics. Machine Learning techniques include: supervised learning (where the goal is approximating an input/output relation from examples with known output, i.e. labels); unsupervised learning (where labels are missing); and reinforcement learning (where labels are missing, but it is possible to interact with a -- possibly simulated -- environment and observe the consequence of the decisions made by an agent).",
      "related terms": "Neural Networks, Deep Learning, Decision Trees, Random Forests, Supervised Learning, Unsupervised Learning, Reinforcement Learning, Data Mining"
    },
    {
      "identifier": 27,
      "name": "Natural Language Processing",
      "description": "Natural language processing (NLP) is a subfield of linguistics, computer science, and Artificial Intelligence concerned with the interactions between computers and human language, in particular how to program computers to process and analyze large amounts of natural language data. The goal is a computer capable of \"understanding\" the contents of documents, including the contextual nuances of the language within them. The technology can then accurately extract information and insights contained in the documents as well as categorize and organize the documents themselves. Challenges in natural language processing frequently involve speech recognition, natural language understanding, and natural language generation. Applications include: text summarization, text classification, text retrieval, text processing, natural language generation, machine translation, sentiment analysis, question answering",
      "related terms": "deep learning, machine learning"
    },
    {
      "identifier": 28,
      "name": "Computer Vision",
      "description": "Computer vision is an interdisciplinary scientific field that deals with how computers can gain high-level understanding from digital images or videos. From the perspective of engineering, it seeks to understand and automate tasks that the human visual system can do. Computer vision tasks include methods for acquiring, processing, analyzing and understanding digital images, and extraction of high-dimensional data from the real world in order to produce numerical or symbolic information, e.g. in the forms of decisions. The image data can take many forms, such as video sequences, views from multiple cameras, multi-dimensional data from a 3D scanner, or medical scanning device. Sub-domains of computer vision include scene reconstruction, object detection, event detection, video tracking, object recognition, 3D pose estimation, learning, indexing, motion estimation, visual servoing, 3D scene modeling, image restoration, depth estimation. Additionally, computer vision can be applied for the identification of manufacturing defects. The field is also related to commonsense reasoning.",
      "related terms": "deep learning, commonsense reasoning, defect identification"
    },
    {
      "identifier": 29,
      "name": "Audio Processing",
      "description": "Audio processing is an interdisciplinary subfield of computer science and computational linguistics that develops methodologies and technologies that enable to extract information form audio signals; a notable subfield includes speech recognition, having the goal to recognize spoken language and translate it into text. It incorporates knowledge and research in the computer science, linguistics and computer engineering fields. The reverse process is speech (or audio) synthesis. Some audio processing techniques require training on examples that may be either non-annotated or annotated (e.g. by asking a user to read aloud know text). Applications include the implementation of voice interfaces (such as those of personal AI assistants), preparation of structured documents, speaker identification, identification of specific (or of unusual or anomalous sounds) sounds. The field has been tackled via multiple techniques. Recently, advances in deep learning and big data has lead to breakthrough in audio processing systems.",
      "related terms": "automatic speech recognition, computer speech recognition, speech to text"
    },
    {
      "identifier": 30,
      "name": "Multi-Agent Systems",
      "description": "A multi-agent system (MAS or \"self-organized system\") is a computerized system composed of multiple interacting intelligent agents. Multi-agent systems may serve as simulator for complex systems, and they can solve problems that are difficult or impossible for an individual agent or a monolithic system to solve. Individual agent \"intelligence\" may be practically implemented via procedural, rule-based, search, or reinforcement learning approaches. In this respect multi-agent systems are related to automated reasoning, searching, planning, and machine learning. Agents interact with an environment that may be virtual or physical. Depending on the level of abstraction of this interaction, Multi-Agent Systems may be related to robotics. Multi agent systems that are meant to provide insight or predictions (i.e. to serve as simulators), rather than to solve a problem, may require a very limited degree of intelligence, or no intelligence at all: those are sometimes referred to as Agent Based Models. Applications include online trading, disaster response, target surveillance, and social structure modelling.",
      "related terms": "searching, planning, reinforcement learning, robotics"
    },
    {
      "identifier": 31,
      "name": "Robotics and Automation",
      "description": "Robotics is an interdisciplinary branch of computer science and engineering, with particularly strong ties to Artificial Intelligence.  Robotics involves design, construction, operation, and use of robots. Robotics integrates fields of mechanical engineering, electrical engineering, information engineering, mechatronics, electronics, bioengineering, computer engineering, control engineering, software engineering, mathematics, etc. The goal of robotics is to design machines that can help and assist humans. Robots can be used in many situations for many purposes, but today many are used in dangerous environments (including inspection of radioactive materials, bomb detection and deactivation), manufacturing processes, or where humans cannot survive (e.g. in space, underwater, in high heat, and clean up and containment of hazardous materials and radiation). Robots can take on any form, but some are made to resemble humans in appearance. Such robots attempt to replicate walking, lifting, speech, cognition, or any other human activity. Many of today's robots are inspired by nature, contributing to the field of bio-inspired robotics. The design of autonomous or semi-autonomous robots requires the ability to perform decisions-making, explaining the strong ties this field has with planning (including trajectory planning).",
      "related terms": "planning, trajectory planning, physical AI systems"
    },
    {
      "identifier": 32,
      "name": "Connected and Autonomous Vehicles",
      "description": "Vehicular automation involves the use of mechatronics, artificial intelligence, and multi-agent systems to assist the operator of a vehicle (car, aircraft, watercraft, or otherwise). These features and the vehicles employing them may be labeled as intelligent or smart. A vehicle using automation for difficult tasks, especially navigation, to ease but not entirely replace human input, may be referred to as semi-autonomous, whereas a vehicle relying solely on automation is called robotic or autonomous. Both of these types are instantiated in today's various self-driving cars, advanced airliner autopilots, drone aircraft, and planetary rovers, as well as guided rockets and missiles. The technology involved in implementing autonomous vehicles is very expansive, ranging from technological improvements in the vehicle itself to the environment and objects around the vehicle. In terms of AI techniques, autonomous vehicles are related to planning, computer vision, and robotics in general. Although automated vehicles bring various benefits, they also come with various concerns. Also, there are still technological challenges that need to be overcome in order to make vehicular automation robust and scalable.",
      "related terms": "planning, computer vision, robotics"
    },
    {
      "identifier": 33,
      "name": "Data Mining",
      "description": "",
      "related terms": NaN
    },
    {
      "identifier": 34,
      "name": "AI Ethics",
      "description": "",
      "related terms": NaN
    }
  ]
}
