description
"Magazino is an innovative company producing robots for warehouse intra logistics. In Magazino, each robot is given a prioritized list of jobs to perform, and each of them is associated with a hand-written plan, encoded using a behavior tree formalism. This solution has a few drawbacks: handwriting of the behavior trees requires expert knowledge and quite some brain power to be carried out without mistakes. This makes the writing tedious and the maintenance and update complex and error prone. For example, in addition to take into account the possible failures and unexpected events, such plans need to be crafted considering that the executor might get restarted at any point in time, losing and thus needing to reconstruct the world and internal states. Finally, the behavior trees are typically rather complex and they are not suitable to be analyzed or manipulated by some high-level reasoning mechanism. In this context, AI techniques can be used to guide the user to design the complex plans required to accomplish the tasks the robot is given, and to follow their execution taking into account the automatic recovery from unforeseen circumstances, e.g., after a failure has occurred."
"Meritor HVS AB in Lindesberg manufactures rear and front axles for heavy vehicle applications. The plants comprise both machining and assembly. The order horizon for assembly as well as the assembly process itself are short which allows the planning process to meet the customer needs. For the machining department we have longer lead-times which forces us to consider order forecasts for planning. Together with a complex machine park with numerous different process steps and different machines with different cycle times depending on the part produced, this makes planning hard. Today the planner operates day by day, using data on the availability of parts and comes up with a production plan based on what we know at this time. However this is a very time-consuming process and in reality the result are almost every time wrong as changes such as machine breakdowns or unaccomplished target cycle times have occurred during the planning process. This leads to sub-planning activities in the machining departments that focus on the individual department only and as a consequence to an imperfect overall exploitation of resources. We are expecting as an major end result a tool that provides decision options for the central planners, enabling us to control the production in real-time based on accurate data."
"The ‘Planning for Space’ use case targets the automation of the planning process in the context of multi-asset human-robotic missions as prepared by the National Space Agencies, the European Commission and the European Space Agency. Typical examples are the ExoMars mission for Mars exploration, the Mars Sample Return mission as well as the HERACLES mission for moon exploration and exploitation. In this context, the ground operators prepare Activity Plans to be executed by the robotic system on the planet as a logical and temporal composition of robotic Activities. In addition, the system shall merge Activity Plans proposed by different remote operators to a final consolidated Activity Plan to be uploaded for execution. The automatisation of this process is expected to decrease the duration of the on-ground planning phase and create more efficient plans in terms of energy consumptions and science return."
"HyDrone is a technology program to develop new concept underwater vehicles, highly reconfigurable with different payloads, expected to carry out underwater missions at different degrees of autonomy and to operate resident underwater without maintenance for up to two years. Typical missions range from geographically restricted inspections and operations on wells, pipelines and processing systems (using wired communication and power), to medium range missions (based on underwater wifi communication and battery power), to long-range missions. AI planning techniques may help to overcome several problems like: Management of system resources even in abnormal or unexpected conditions happening during mission execution; Management of critical/abnormal situations that may lead to damage or risks in general; Making the mission’s definition independent from specific field, so allowing to develop a much more general code in the lowest levels of the architecture (improving reusability, testability and development of additional features for the system and not for a specific scenario); Allow planning missions that foresee use of manipulator and tools in general in a seamless way with the rest of the mission; Exploiting opportunities that may not be exploited by standard, rigid plans programmed by humans; Help in validating missions proposed/developed by humans"
"Agriculture tech has become a highly digitized, high-technology branch involving powerful and expensive machinery. The need for effective and efficient processes has increased due to economic and ecological constraints. In that situation, automation, optimization and planning methods are natural choices, and they can build on existing high levels of digitization at modern farms and contractors. One problem class is campaign planning for agricultural processes. It consists of various coordination and optimization problems on several levels of detail. Campaign planning is needed in harvesting processes, which involve harvesters, overloading and transport vehicles, and possibly other resources and agents, depending on the type of crop; it is also of help in spraying chemicals or manure. The harvesting processes for the various crops, e.g., silage maize, wheat, forage, or sugar beet, vary due to different general requirements and machinery. A particularly complex process is silage maize harvesting, which is the focus of this use-case. The chopping, transport, and compaction of the crop in the silo must be coordinated so that the machines are used to full capacity and downtimes are avoided. Efficiency is important here, as there are requirements in terms of time, economy, and sustainability: When the crop is ripe there is only a limited time window to harvest it. Here, weather conditions can lead to further restrictions or deadlines. Efficiency is also important from an economic point of view, as the machines and labour are expensive and limited. Finally, sustainability aspects such as a reduction in fuel consumption or soil compaction risks could also play a role. In this use case the goal is to use AI techniques in order to plan and optimize the overall silage maize harvest campaigns. This also involves monitoring and adapting plans during the harvest in order to react to changed conditions or deviations from the original plan."
"The Rosetta/Philae mission was launched in 2004 by the European Space Agency (ESA). It is scheduled to reach the comet 67P/ChuryumovGerasimenko in 2014 after traveling more than six billion kilometers. The Philae module will then be separated from the orbiter (Rosetta) to attempt the ﬁrst ever landing on the surface of a comet. If it succeeds, it will engage a sequence of scientiﬁc exploratory experiments on the comet. We need to schedule the different experiments of the mission. A feasible plan must satisfy a number of constraints induced by energetic resources, precedence relations on activities, or incompatibility between instruments. Moreover, a very important aspect is related to the transfer (to the orbiter then to Earth) of all the data produced by the instruments. The capacity of inboard memories and the limitation of transfers within visibility windows between lander and orbiter, make the transfer policy implemented on the lander's CPU prone to data loss."
"All fabric is produced to order. A specific set of fabric types can be produced on a certain loom only if the loom is equipped with a specific warp chain. The replacement of a warp chain requires a relevant amount of time during which the loom is idle. This idle time can last a few hours if the same type of warp chain is being replaced, or a few days otherwise. The production of an order has to obey a deadline agreed upon with the customer. Several planning problems arise in the described situation, e.g. the long-term problem of loom grouping, i.e. partitioning the looms according to the mounted warp chains in order to reduce the occurrences of the long idle times, the problem of deadline setting with respect to the present production plan and the short-term problem of scheduling the looms belonging to a particular group."
"In a chemical plant, the production process considered consists of a network of processing tasks linked by divergent, convergent, as well as cyclical material flows. In the mixing process, various ingredients are mixed together according to pre-specified input fractions. All processing tasks are realized in batch mode, with minimum and maximum batch sizes being pre-determined by the nature of the chemical processes and the capacity of the reactors. Hence, the batch size itself is not known a priori and may be different even for the same type of product or the same production unit. As the durations of the chemical reactions are fixed, processing times are assumed to be constant per batch, irrespective of the particular batch size. As a result, processing times depend solely on the particular processing task and the production unit used. It is further assumed that the processing mode for most types of batches is given,i.e., the fractions of all inputs and outputs are normally specified as fixed proportions of the batch size. However, some processing tasks allow the proportions of output goods to be varied within certain limits."
"We have a printed circuit board (PCB) assembly line for inserting electronic components to produce a variety of PCB types. A typical PCB assembly line consists of several stages, and each stage consists of several insertion machines in parallel. Usually, each type of insertion machine is specialized with regard to certain types of components that it can handle; for example, axial leaded, radial leaded, etc. Such an assembly line is typically required to produce the different types of PCBs in lots of different sizes. Each type of PCB consists of hundreds of electronic devices such as resistors, capacitors, diodes,transistors, transformers, and connectors. In the assembly environment that we consider the PCBs move unidirectionally through the various stages of assembly, and the insertion machines at each stage insert a subset of the electronic components required. The ﬂow order is determined by assembly technological constraints. The line consists of three consecutive assembly stages. The setup between different typesof PCBs is conducted off-line, and the setup time can be neglected."
"We have a production system for sticky labels. The system has two stages: stage 1 consists of a single high speed machine (called calender) which is used to glue the surface material and liner together to produce the label stickers; stage 2 has two types of cutting machines, each consisting of two identical machines. One type of machine slits the label stickers into specified width and winds on the rolls, and the other type cuts the label stickers into sheets, which are in conformity with the required size (i.e., unit length and width). We refer to the two types of cutting machines as CM1 and CM2,respectively. Depending on the requirement of customer orders, each job is processed on either a CM1 or a CM2 machine at stage 2. When the calender is changed over from jobs of different classes, a setup time, which depends on both the previous and the current class of jobs, is required for the changeover task. At stage 2, the setup time is relatively minor, and can included in the processing time. In addition, the transfer time is negligible because the distance between the machines at the two stages is short."
"In upholstered furniture manufacturing, an item is defined by a fabric type and frame style. To complete a piece of furniture, the frame is cut and assembled, the upholstery pieces cut and sewn, then the fabric pieces are assembled onto the frame. At each stage there is typically parallel capacity. Considering the two stage fabric cut and sew operations independently, one way to achieve line efficiency is to limit changeovers at each stage by cutting all orders of a given fabric type together and sewing all orders of a certain style together. The fabric pieces must be ready to be applied to a frame after some duration of time. If a manufacturer specifies a maximum one week lead time from cutting to final assembly, for example, then the goal is to process all orders as quickly as possible within that week. Current practice is to perform work in weekly buckets utilizing single setups per group. At the first stage, groups are determined by fabric type, and at the second stage, groups are determined by style. During a given week, fabric and frame cutting would be performed for this week’s orders, sewing and frame assembly of last week’s orders, and finally, fabric application to the frame for orders from two weeks ago. The manufacturer is interested in reducing its lead-time by two-thirds: from three weeks to one week. In order to reduce this lead-time, operations must be performed during the same week."
"Our glass factory produces a large range of manufactured glass objects, more than 3000 different types of pieces, and works under a make-to-order policy. Whenever a new customer order arrives, the information system checks if the required products are in stock and, if is the case, the order is served from existing stock. Otherwise, the system creates two kinds of production orders for the shop. Some production orders correspond to finished goods, and involve operations such as decorating, assembling, packing and palletization. Other production orders correspond to semi-elaborated products which involve operations in the furnaces, blowing, cooling and bulk packing. Lot sizing considerations determine the number of pieces of each intermediate product in these orders, the number of which is typically much larger than the quantity required by a customer. This scheme introduces precedence relationships between production orders. The operations to be performed on the pieces can, and in fact should, overlap.  Some orders have an operation in which raw materials (basically recycled glass) are melted in one furnace to produce liquid glass and then another operation on a blowing machine in which the glass is shaped while still hot. These operations must be processed in a special type of no-wait mode, in which every time a glass bit comes from the furnace, it is immediately shaped in the blowing machine. After being shaped, the pieces are placed on a conveyor belt where, while they cool down, they are transported at a constant speed to the packing area. Once there, the pieces must be packed before they arrive at the end of the belt. The factory has different types of machines. The furnaces in which the glass is melted can serve several blowing machines simultaneously. The number of packers varies throughout the day and they process several packing operations at a time. Some of the blowing operations are carried out by automatic blowing machines and some others by teams of highly skilled workers. Some machines are continuously available, but others are not. Each machine can have its own calendar, with non-working days, holidays or maintenance breaks."
"PBS and UPS are two efficient assembly forms for mass production of apparel manufacture. Both systems are composed of a certain number of sewing workstations. Each workstation is a physical location that accommodates an operator and a sewing machine. In PBS, bundles of garment components are moved sequentially from operation to operation. Bundles consist of garment components needed to complete one or more specific operations. One of the main characteristics of the systems is that each operator must only operate one machine at any instance of time. Unlike the PBS in which a batch of garment components (bundle) is transported from workstation to workstation, UPS has an automated hanger to transport one garment component from workstation to workstation. Multiple production orders can be processed. The assembly process of each garment consists of multiple operations. Moreover, due to the labor-intensive nature of the apparel industry, the performance of the production system is influenced greatly by the efficiencies of sewing operators."
"Our ice cream production system consists of three phases: in each phase there is a set of suitable machines for each lot, operating in parallel. In the first phase, two mixers have to mix the raw materials according to the recipe; and then the mix is sent to one of the three tanks for the pastorization. Each tank has a capacity and each mix has a time constraint for the pastorization. Then, in the second phase, the mix goes to one of the available coolers. The product that comes from the cooler arrives to a filling machine which shapes the ice cream. Finally, in the third stage, it goes through a freezing tunnel and finally to the packing machine. There are different types of freezing tunnels: some of them are fixed while others are mobile and, in occasions, two filling machines can feed the same tunnel of freezing. In addition, a filling machine can receive products from more than one mixer because every mixer produces only one flavour. According to this schema, this is a no wait system because the product which comes from one stage goes directly to the next stage without waiting in an intermediate buffer. Additionally, there are setup costs depending on the sequence of the family of products to produce due to the installation of lines or to the cleaning works. One of the most important limitations to be considered is the manpower: the manufacture of each product requires a certain number of persons. In addition, due to be a very seasonal product one must take into account the opportunity cost of advancing production (stock) with regard to the backorder cost due to a punctual load or unexpected events (absenteeism, strikes...). Finally, another critical limitation is the reduced space in the productive plant."
"The overall production system consists in three services: the making, the temporary storage and the packing services. The making service is in charge of producing the products that will later on be packed in bottles by the packing service. The storage service is the interface between making and packing: whenever a product is produced, it is delivered to the storage service before being sent for packing. Everyday, the packing service, which gathers several packing lines, fixes the production for the next 24 hour for each packing line according to its medium term planning. Once the production has been fixed, it transmits the orders to be produced (also called batches), one for each packing line, to the making service. Several making units compose the making service and have to produce and transfer the batches to the storage facility. A batch within a storage tank is supplied to the intended packing line according to its order. A batch is a fixed and indivisible volume of the same kind of shampoo product: each batch has to be entirely stored in one tank and entirely packed by one packing line. The storage facility contains many tanks with different capacities and each tank is directly connected to a subset of packing lines. There are several families of shampoo and each family has its own characteristics. Thus, even if the tank capacity is sufficient, two batches from different shampoo families cannot be stored in it at once, and a tank will have to be cleaned before the arrival of the new batch. The goal is to minimize the number of tank cleanings and the maximum lateness of the batches. The lateness is defined on the basis of due dates which correspond to the dates at which the packing lines are planned to complete the packing of the batches of shampoo. Limited intermediate storage is crucial in many production process in the chemical industry."
"In a typical manufacturing process of crystalline silicon solar cells, the flow of job includes texturing, diffusion, phosphor silicateglass etching, plasma-enhanced chemical vapor deposition, printing, and testing/sorting six stages. Because the production times are different in each stage, the number of machine resources for the job is greater than or equal to one at each stage. In addition to parallel machine allocation issues, the number of machines can be dynamically adjusted to complete the job within the shortest possible time. Because the production quantity of each job is very high, each job needs to be splitted into small sublots to complete all jobs in a short time. Then various similar sublots can be processed simultaneously ona number of machines within the same stage, thereby reducing the production time. Moreover, each stage of the process has its practical characteristics that influence the production and that should be taken into account. First, the need for different numbers of dedicated machines for each of these processes is obvious due to the variance in capacity. Second, identical parallel machines are used in the manufacturing process to reduce makespan when the demand is high. Finally, the sequence independent/dependent setup time that is a key focus to reduce the number of setups and shorten the overall completion time."
"The manufacturing system of our car Company mainly consists of three workshops, i.e. the body shop, the coating shop and the assembly shop. The manufacturing process of a vehicle passes through the three workshops in order. The body shop requires that the bodies of identical or similar types should be processed as closely as possible, so that the cost for equipment switching and setup operations can be reduced. Here, the most dominant operation is welding, which is performed by a series of welding robots installed along the production line.  If the model of the current car body is different from the previous one, some welding robots need to be ‘‘reset’’. The coating shop requires that the parts with identical or similar colors should be processed as closely as possible, so that the cost for preparing and changing the paint can be minimized. Here, the paint equipments (e.g. spray guns) have to be cleaned (using a special solvent) if the color of the next car to be painted is different from the previous car. The assembly shop requires that the vehicles with different levels of complexity should be processed in a staggered manner (difficult jobs alternating with easy jobs), so that the production intensity can be smoothed and thus the undesirable accumulation or tardiness of jobs can be reduced. Each workshop has quite different criteria to define ‘‘good’’ production schedules for maximizing the production efficiency (like makespan and due date related performances)."
"A bread making enterprise needs to effective allocate production resources to produce different bread variety, in order to meet the demand. The goal is to minimize the completion time (makespan) to fulfill the whole order in time. The enterprise on bread products has a variety range of products from various flavors and size: it produces five variety of bread namely mocha, strawberry, coconut, chocolate, and choco-nut. The production has a certain level of pieces/day and this quantity generally increases at the weekend to a fixed range of pieces/day. The bread enterprise uses serial machines and facilities with specific processing time, completion time, and departure time in each stage of production of bread. The enterpise needs to avoid order delivery delays, and to shorten completion time."
"We consider the production process of a canned fruit manufacturer, that is composed of different stages. Fresh fruits from various farmers arrive and are sorted according to their sizes and quality. The plant categorizes its raw materials into three groups: pineapple, fruit cocktails and seasonal fruits. The fresh fruits in each group are prepared (i.e. peeling, washing, cutting, etc.) according to the finished product requirements in their own production lines. The prepared fruits are inspected and packed into washed cans. The packed cans are then filled with packing media, which are prepared and tested for their properties. After filling, the cans are seamed and sterilized. This is where all products from multiple production lines are combined to form a single production line, thus, making the sterilization operations at the retorts the bottleneck. Once the products are sterilized, they are labeled, packed into boxes, and ready to be shipped to the customers. We need to tackle different aspects: uncertainties of agricultural raw materials (fresh fruits), and multiple types of finished products sharing the same resources, thus makes their scheduling interdependent."
"LCDs are high-tech display products manufactured through a complex proces, that is composed of five serial stages, called deposition with 10 machines, gate photo with 20 machines, exposure with 10 machines, wet etching with 15 machines, and stripping with 10 machines, in the line. The process starts with a glass of semiconductor material that is coated with a thin film of a chemical called photo-resist. Photo-resist coated wafers or glasses are then baked in an oven to remove solvents. Once the baking process is completed, the stepper aligns layers with mask plate and the glass is exposed to ultraviolet light. Then, the glass is developed in the developer. At the final stage, dry and wet etching processes remove thin film layers. Due to a large number of operations, the LCD manufacturing line has low system throughput, long flow time, and bad due date related performance measures. Therefore, the need is: maximizing system throughput;  minimizing mean flow time; minimizing mean tardiness; and minimizing the number of tardy jobs."
"A set of product orders of a pharmaceutical industry should be processed by following a predefined sequence of processing stages with, in general, unrelated processing units working in parallel. Each product order comprises a single batch that must follow a set of processing stages. Some orders may skip some processing stages, since different production recipes are considered. Product order can be processed in a specific subset of units. Similarly, processing stage can be processed in a specific subset of units. Transition times between consecutive product orders are expressed as the sum of two terms. One depends on both the unit and the order being processed while the other also varies with the order previously manufactured in that unit. Transition times must be explicitly taken into account in the schedule generation process since they are usually of the same order of magnitude or even larger than the processing times. Model parameters like order due dates, processing times, sequence-dependent changeover times and costs, unit-dependent setup times, order release times, unit available times, and operating cost are taken into account. Once the processing of an order in a given stage is started, it should be carried out until completion without interruption (non-preemptive mode). Mixing or splitting of product orders is not allowed."
"A milk industry develops two types of products - fresh milk (pasteurized) and UHT - for direct consumption, or to supply other sectors. Both of these products are subject to stages of homogenization, pasteurization, and finally, packaging. The difference between these types reside primarily in the percentage of cream in each product and in the manufacturing process after homogenization. They also differ in shelf life duration, which is five days after production for fresh milk. However, UHT can be kept for up to a maximum of six months. The process starts with the daily milk collection: daily milking delivers quantities of milk which are collected, analyzed, and then transported to production sites. Transportation takes place via insulated tankers to preserve the quality of the product. Then, to ensure product consistency in terms of fat, the raw milk is separated into cream and skim milk using a separator unit. The cream is then added to the milk in the tank, mixing in controlled percentages to produce several types of milk. The pasteurization step eliminates undesirable microorganisms. It is done through contact with hot plates, whereby the milk is heated to a certain temperature for a certain time. For the production of UHT, the milk is heated together with water vapor and achieves a fixed temperature for a fixed time. Finally, the milk is ready to be packed into bricks or bottles, leaving it sheltered from the air and from light, to keep it at its best. Then it is stored and transported to grocery stores and supermarkets. Typically, in a dairy industry, the multiproduct milk processing should consider the dependent sequence changeover time,  machine speed, taking into account the packaging timing and the capacity constraints. The objective is to minimize the makespan."
"A petrochemical company is involved in the design and manufacturing of various types of industrial equipment, especially different types of valves for the oil, gas, refining and petrochemical industries. The valves are manufactured based on some relevant standards: (1) the valves are used to allow the passage of flow or to shutoff the existing flow in the transportation line; (2) the valves are linear flow valves used for the start or stop of fluid flow, and cannot be adjusted; (3) the valves are designed to prevent the return of fluid and they operate by fluid flow in the pipelines; (4) the valves are utilized for the adjustment and control of flow, and they enjoy a low rate of wear. The shop dedicated to the manufacturing has a flexible flow shop system. All valves are cast first, and after undergoing inspection operation and mechanical tests, they enter the production line. First, a turning operation is performed on the work-piece, and then the necessary hole-drilling operations are carried out based on the design type of each product. There are 2 hole-drilling machines at this stage. Then, the grinding operation is performed. At next stage, the turning operation continues on the work-piece based on the product norm, which constitutes the major part of manufacturing. There are 5 parallel machines for performing this operation. The milling operation is then carried out by 2 parallel machines. Finally, welding is performed. In these conditions, it is possible to have some disruptions due to unexpected events. These disruptions may cause the initial plan to become infeasible and non-optimal. So, appropriate revisions are often needed to overcome the unfavorable subsequent of these disruptions."
"The task is to control the ground traffic on an airport (in such a way that the summed up travel time of all airplanes is minimised). Timed travel routes must be assigned to the airplanes so that they reach their targets. There is inbound traffic  (planes that need to go to a parking position) and outbound traffic (planes that need to go to a runway). The former are airplanes that must take off, the latter are airplanes that have just landed and have to park. The main problem constraint is to ensure the safety of the airplanes. This means to avoid collisions, and also to prevent airplanes from entering the unsafe zones behind large airplanes that have their engines running. Which means that no two planes can share the same airport segment, and that a plane with running engines blocks a set of segments behind it (where the blocked set depends on the size category of the plane). The available activities are to move a plane away backwards from a parking position, to startup the engines, to move between segments, to park by turning off the engines, and to remove the plane from the airport. The criterion is to minimize the summed up travel time (on the surface of the airport) of all airplanes. There usually are standard routes, i.e., routes that any airplane must take when outbound from a certain parking area, or inbound from a certain runway. The reason for introducing such routes is to reduce complexity for human ground controllers, since significant computer support is not yet available at real airports."
"The task is to control the flow of different oil derivatives through a pipeline network, so that certain product amounts are transported to their destinations. Transporting oil derivatives through a pipeline system has a very different and characteristic kind of structure. The pipelines must be filled with liquid at all times, and if you push something into the pipe at one end, something possibly completely different comes out of it at the other end. Additional difficulties that have to be dealt with are, e.g., interface restrictions (different types of products that must not interface each other in a pipe), tankage restrictions in areas (i.e., limited storage capacity defined for each product in the places that the pipe segments connect), and deadlines on the arrival time of products. Pipeline networks have a topology composed by areas and pipes, where the pipes can differ in length. An available activity is to pump liquid into ends of pipes, with the effect that the liquid at the other end of the pipe gets ejected. Pipe segments have a direction, and we could also need to reverse the pipe direction."
"The task in power supply restoration is to reconfigure a faulty power distribution network so as to resupply customers affected by the faults. The network consists of electric lines connected by switches and fed via a number of power sources that are equipped with circuit-breakers. When faults occur, the circuit-breakers of the sources feeding the faulty lines open to protect the network, leaving not only these lines but also many healthy ones unsupplied. The network needs to be reconfigured by opening and closing switches and circuit-breakers in such a way as to resupply the healthy portions. Unreliable fault sensors and switches lead to uncertainty about the state of the network. Furthermore, breakdown costs that depend on various parameters need under constraints on the capacity of sources and lines. The application is a topic of  ongoing interest in the field of power distribution, and has been investigated by the AI community for a long time, in order to use AI techniques to guide the user to design the complex plans."
"In this domain, the agent manages a manufacturing company that buys goods to use them in the production of other goods. A manufacturer has a number of orders, each for a combination of different products, and can only make one product at a time. The total required quantity of each product is made at the same time (because changing from making one product to making another requires a production stop).  From the time that the first product included in an order is made to the time that all products included in the order have been made, the order is said to be open and during this time it requires a temporary storage space (a stack). The goal is to order the making of the different products so that the maximum number of stacks that are in use simultaneously, or equivalently the number of orders that are in simultaneous production, is minimized (because each stack takes up space in the production area)."
"The Earth Observation domain models a satellite orbiting Earth. It can take pictures of the landscape below with a camera. The landscape is subdivided into square regions of interest forming a grid wrapped around a cylindrical projection of the Earth surface. The camera focuses on one region at a time and can be shifted north or south. It can take a picture of the region currently in focus. The focus may not be shifted while taking a picture. Regardless whether the focus is shifted or a picture is taken, the satellite moves eastward around Earth, shifting the focus one grid cell to the east in addition to the other effects in each step. The objective is to take pictures of certain regions in a limited timeframe with as few shifts and as quick as possible. Taking a picture of a region does not guarantee good image quality: the worse the weather, the lower the chance of success. Over time the visibility in each region can change probabilistically. Changes between similar levels of visibility are more likely than vast changes."
"The aim is to protect a wildlife preserve from poachers by sending available ranger to areas. Poachers attack parts of the preserve depending on their preferences and an expectation where rangers will likely show up. For each step, we need to consider each area that has not been attacked undefended, and each area that has. The aim is to predict where poachers will attack with high probability and to lure the poachers that observe each step of the rangers into attacking an area where they are caught. A poacher that has been caught does not attack in the next step. AI techniques can compute the expectation where rangers will likely show up by exploiting assumptions that the defender’s (i.e., rangers) mixed strategy is fully observed by the attacker, and memorized for a predefined number of steps."
"In the field of molecular biology, and specifically biochemical pathways, a pathway is a sequence of chemical reactions in a biological organism. Such pathways specify mechanisms that explain how cells carry out their major functions by means of molecules and reactions that produce regular changes. Many diseases can be explained by defects in pathways, and new treatments often involve finding drugs that correct those defects. It is possible define plans for parts of the functioning of a pathway by considering chemical reactions as actions for synthesizing organic molecules. There are different kinds of basic actions corresponding to the different kinds of reactions that appear in the pathway. The goals refer to substances that must be synthesized by the pathway, and are disjunctive with two disjuncts each. Furthermore, there is a limit on the number of input reactants that can be used in the pathway. It is challenging to synthesize organic molecules of high-quality with respect to some specific features, considering the large scale of reactions and molecules. Automated retrosynthesis or synthesis of molecules has been an open problem for many years due to its scientific importance in chemistry as well as its direct applications to pharmaceutical and material industries."
"Cybersecurity has become one of the most pressing problems facing the private and public sectors. Cybersecurity threats are pervasive but extremely difficult to defend against, given the constantly changing vulnerability surfaces of ever-evolving networks. In a cybersecurity domain, many adversaries tend to leverage existing, benign capabilities for malicious ends. Based on parameters such as the number of hosts, the number of users, the number of domains, and the probability of credential overlap among others, it is possible to plan a potential attack scenario in order to prevent it. We are expecting a tool that provides decision options, enabling us to prevent the attacks in real-time based on accurate data."
"While wind turbine components are designed to have a 20 year lifespan, experience shows that such components will rarely operate successfully without some form of maintenance over this time. This leads to turbine maintenance becoming an important aspect of wind-farm asset management. The availability of resources which have the ability to transport large-scale equipment is scarce, with high costs for a single repair. When a maintenance operation is required, the associated plan is hand-built by a logistics expert within the company. The objective of this expert is to minimise the cost associated with the operation, whilst also minimising the downtime of the failed turbines. However, they must also consider variables such as the availability of ship and helicopter crew; the location of replacement parts; weather conditions and sea-state. As there are many components which can break inside the turbine, there are naturally varying degrees of maintenance intervention. This results in large automated plans being constructed."
"In a given network of servers, each server can produce data by processing existing data and send the data to connected servers. Each server has a disk and random access memory (RAM). Data that is saved on the disk of a server must be loaded into RAM of the server in order to be processed or sent to the RAM of another server. The ability to process and distribute the data in the network is constrained by the connections between servers, the capacity of RAM on a server, the availability of scripts on servers, and the cost of loading and saving data, which depends on the data size and the (disk io performance of a) server, sending data, which depends on the data size and (bandwidth of a) connection, and processing data, which depends on the script and (clock rate and numbers of processors of a) server."
"A company has drivers that can walk between locations and trucks that can drive between locations. Walking requires traversal of different paths from those used for driving, and there is always one intermediate location on a footpath between two road junctions. The trucks can be loaded or unloaded with packages (with or without a driver present) and the objective is to transport packages between locations, ending up with a subset of the packages, the trucks and the drivers at specified destinations. AI techniques are able to take into account concurrency in the use of drivers and vehicles, by handling temporal aspects. This makes time spent driving or walking between locations dependent on the path being traversed. The plan quality depends on the total make-span."
"Solar arrays requires flight controllers to constantly balance multiple complex constraints against power needs. The complexity not only impacts planning activities, but has an even more acute effect on real-time operations, in particular when handling unexpected events or changes in operations plans. We need to assist the flight controllers with the task of creating plans and executing solar array operations in a safe and effective manner. We are expecting a tool that takes into account the different constraints, find optimal array modes and orientations subject to these constraints and user-configurable solution preferences, and automatically generate solar array operations plans."
"The final purpose of a generating plant is to produce saline solution with a given concentration recycling the unused part and preparing for another production cycle. The plant is composed of a certain number of tanks connected through a complex pipeline, whose flow is regulated by different valves and pumps, one heater, a condenser and cooling circuits. A set of sensors provide information to the plant controller about the filling level of tanks the pump pressure and the condenser status. When tanks are appropriately filled, the plant can start the production phase. If the product is not completely used, the plant recycles it in the next production cycle. Finally, recycled water and solution are pumped to tanks. The system goal is to synthesise production policies able to bring the system to the goal in any possible configuration obtained after the recycle phase. However, the duration of these activities is not known a priori, thus it is necessary to determine the time point at which the tank capacity (or required concentration) is reached."
"Assist humans in medical care activities must often monitor the evolution of a process or state over time (including that of the human, the agents are deployed to assist) and make periodic decisions based on such monitoring. In assisting with caring and therapy planning, it is necessary to monitor users’ states and make periodic decisions such as sending reminders. One of its crucial aspect is the derivation of therapeutic plans taking into account the dynamic aspect of the decision problem. Addressing decision making in these tasks represents a critical problem, since they must monitor and make decisions despite significant uncertainty in the observations and actions. Furthermore, actions have costs, e.g., delaying a therapy has repercussions. We expect a tool able to solve decision problems in which the optimal choice can be revised periodically in accordance to the evolution of the patient's conditions."
"Appropriate usage of bed resources is a major factor in terms of hospital resources optimization. Hospital bed allocation is a complex problem while hospital planners face several constraints, such as important patient flows, restrained admission to specialty according to pathology, and constrained staff working planning. Besides the elective patients flow (an elective patient is a patient who has had a preadmission assessment given by a physician before hospitalization has occurred), there is another flow of patients transferred from emergency department called acute patients flow, which disturbs predefined planning. A planning should be set up by balancing available beds and hospitalization demands with both flows taken into account. The aim is to help hospital planners to anticipate hospital bed allocation according to hospitalization demands, bed capacity, and incomes at a medium term level. We expect a support tool for decision-makers able to consider long term level decisions and hospitalization department planning at the operational level."
"Defining plans for emergency situations has drawn significant interest in recent years. Evacuation planning is an important component of almost all emergency situations, albeit with varying levels of importance. A critical component of emergency evacuation planning is the evaluation of the traffic operations during an evacuation, including estimation of evacuation times and identification of bottlenecks. In addition, each plan has to include full or partial closures of various roads, limited access to some special facilities, and security delays at certain locations. Performance measures for evaluating an evacuation plan include the total time to achieve a complete evacuation, the time needed for a partial evacuation in which the population within certain areas is at risk, and the percentage of the population in affected zones as a function of time."
"Planning for urban space is a complex task that often involves a large number of stakeholders: local authorities, architects, developers, consultants, the people already living in the neighborhood of the area etc. All may have different needs and expectations, imposing (sometimes conflicting) constraints on the planning process, which therefore can be considered to be a multi-objective problem by nature. Generally, a urban area mainly consists of parkings, railways, residential areas, major and minor roads... The area is to be redeveloped into a bigger residential area, with room for an urban park and an elementary school, with roads but without through traffic. The main focus of the planning redevelopment, is to attract new inhabitants, by way of constructing new dwellings, and to enhance the quality of life of the people already living in the neighborhood, by way of creating a coherent, public green space.  There are budget constraints to keep the project economically feasible. Next to this, generally planning is guided by the presence of other elements such as a number of trees, and the presence of a shed in the center of the area."
"Our use case is a Multisided Platform for the exchange of secondary materials. The platform offerings include supply chain and logistics services that are designed to address CO2 emissions, and to inform and motivate our customers to adopt sustainable transportation attitude. Our motivation is to create better digital technologies for secondary materials exchange. Our motivation is also to design circular supply chains and logistics that will be engaging and informative for our customers, while creating clear economic benefits for them. The goal of the system/platform is to orchestrate several resource management services, plus added-value, intelligent operative services, e.g. AI-supported intermodal transport network that will be designed in a way that is ""explainable"" to the customers/platform's users. . We do not have big data available, and would prefer to use causal systems over Machine Learning. . Explainability and fairness. "
"Students differentiated/personalised learning One of the bigger challenges in primary and secondary education is the accurate, meaningfull and effective orientation/guidance of learners Objectives: Design, development and testing of an AI system providing differentiated or even personalised1.   learning pathways 2.   formative assessment to learners according to their qualifications, needs, background (family, social and learning). Available data: grades, descriptive evaluation, family/social background for 280 pupils/studentsProvioning data: personality test (exists the one of William Marston only for 9 grade students). "
"Environmental monitoring and climate change mitigation assesmentThe solution will enable data-driven decision making providing advanced stats and predictive analysis useful to optimise the public investments reducing costs and increasing efficiency of the future mobility services. The solution will provide indications useful to identify the most crowded pathways towards the workplaces and commercial areas and suggest possible solutions to reduce the stressful elements and fluidify the traffic.In detail, a set of dashboards with CO2 indicators related to mobility. These indicators are founded on predictive models based on real-time air quality measurements and AI to optimise traffic flows in cities and ports. Thus, it provides high-value green and innovative mobility services for citizens, companies, and public administrations and enhances the informed decision-making processes by simplifying the data.IMAGINEXT mitigates the emissions, i.e. CO2 eq tons emissions from pollutant gases such as NOx, H2S, SO2 and particles such as PM10, by establishing correlations and context analysis. It is the first project on the market that combines social and economic data with air quality, traffic and sensor data integrated into an IoT platform.IMAGINEXT’s innovation leads both to actions dedicated to providing information to citizens and creating mitigation and control plans to improve citizens’ quality of life and reduce environmental pollution. Databases with over 3TBs of environmental data collected by our own chemical IoT devices for collecting gases. Additionally, COPERNICUS Sentinel 3 and Sentinel 5 datasets (netCDF) files. "
Our chatbot using will be able to guide the patient throughout the fertility journey providing info and matching them with suitable doctors and clinicsTo answer questions such as: Who is the right doctor for me? What would you recommend in my case?. We are cooperating with 8 fertility specialists and we are collecting data from 4 of them so far. 
"The proposed experiment (CYBER LAWYERS) has a transformative potential for our particular business and the entire value chain, for the following reasons:1.- Our particular business. - We are an expert Law Firm in Telecommunications and Cyber Law that, based on 21 years of experience, and we see the abyss that the digital divide is generating in the physical world, because companies have also opted to continue their operations through the web and many governmental procedures are also taking place online and e-finance has seen a tremendous rise over the last year. All this transactions are done in the Cyberspace.We need to solve the problem that arises with the market players (companies, citizens) who want to operate in this cyberspace, but nevertheless do not achieve it with traditional measures and procedures, this is where the problem-opportunity lies.CYBER LAWYERS, our solution proposal managed by Cyberlawyers on a platform, (such as a Marketplace) is new to the market, which will process online presentations following statistics by sectors in Spain that are most in demand (“FACUA Data-Consumers in Action”) like:Health, Telecommunications companies, Financial entities, Bank of Spain, Public Administrations, Insurance, Electricity and gas market companies, Food, Leisure and Holidays, Vehicles, Home and clothing items, transport and others.We want to reduce the digital gap and exclusion in the use of the new media technologies and provide an ascending cyberlegal service that goes from the citizen to the company,  that is, Cyber lawyers proposes to carry out online transactions on behalf of its clients in public administrations, institutions, multinationals (telecommunications companies, banks, electricity, gas, ...) solve this kind of cyber problems.CYBER LAWYERS definition says it is a legal system designed to deal with the Internet, computing, Cyberspace, and related legal issues. It is ‘paper laws’ in the ‘paperless world’.Our proposed experiment encompasses changes in this areas: aspects of intellectual property, contract, jurisdiction, data protection laws, privacy, and freedom of expression, it directs the digital circulation of software, information, online security, and e-commerce and also creates a structure for e-commerce transactions and e-filling. . CYBER LAWYERS will use technologies based on blockchain, Artificial Intelligence (AI), and we want to revolutionize the customer experience through Virtual Assistants (chatbots), on WhatsApp, Facebook Messenger, Telegram, Web Chat or SMS to improve accessibility to the service and have greater autonomy. That is, we will use Conversational Artificial Intelligence.We will carry out proactive training and daily supervision of the AI to ensure the optimal functioning and continuous improvement of the Chatbots.The Chatbots will be easily integrated into all our channels to become top-level agents, resolve our customers doubts automatically and digitize repetitive procedures or manual tasks.We will combine Conversational RPA, intelligent automation and omnichannel solutions to develop effective and scalable tools, with these benefits, according to statistics:• Automate 90% of frequent and transactional queries.• Reduce expenses and operating costs.• Optimize manual processes and repetitive tasks.• Ensure personalized conversations and attention 24/7.• Increase productivity and effectiveness. CYBER LAWYERS will generate an ecosystem within the new digital economy, even when it´s evolved can be replicated (used for several companies/sectors/environments)"
"AI-based algorithm used for data from smart metering infrastructure to provide recommendations for facility managers to increase energy efficiency: reduction of energy consumption, detect energy thefts, etc.Current energy crises drive everyone to be more energy efficient. Placed on top of current technologies, AI tech has a huge potential to increase energy efficiency. Data from current smart infrastructures is available as well as data from new deployments. No."
"Automatic / semi automatic identification of microfossils from images taken under the microscopeSignificantly reduce time spent by specialists in observation (days to hours)Systematize analysisAllow quality check and auditingRemote access to data. We have the microfossils to be analysed, but need a high resolution scanner to obtain the images. apart from hardware requirements we need to develop the system to identify microfossils"
"Enfants, femmes enceintes et allaitantesRestaurée le moyen de substances et réintégration communautaire. Les outils disponibles. Non pas exigences"
Public lighting telemanagement systemPredictive Maintenance. 140 electrical quality parameters recorded every 15 minutes in hundreds of electrical lighting panels. energy efficiency
software products we implement for production program planning and supply chain managementproblems and data and objectives are changing day by day. we have not enough historical data. 
"Our Data-driven drug discovery, provides Pharmaceutical companies, Research laboratories and Health authorities, precious foreknowledge #Biotech #Covid.AI4MB provides Pharmaceutical companies, Research laboratories and Health authorities, precious foreknowledge about any emerging organism (virus, bacteria) immediately after it is detected and based on simple input. AI4SMB generates its output off-laboratory in a fully data driven way, saving months of wet lab research and funnelling the researcher’s efforts into the right direction.In addition, our state-of-the-art technology and methodologies bring Artificial Intelligence (AI) and Machine Learning (ML) based data analysis as driving force to R&D processes of Biotech and Pharma.Automating the process, POMICELL draws clear, personally customized drug development road-maps navigating its partners through the metadata space toward achieving their R&D goals.see above. all healthcare or patient related data. no"
"IQOFTHINGS would like to get in contact with AI development entities in order to integrate those tools to the IoT solutions that is providing to its customers. In particular, IQOFTHINGS is now studying and designing an IoT solution for addressing the overuse of fertilizers and pesticides in the agricultural sector. The solution is acquiring data from sensors and an AI algorithm would help further process the data and provide a decision making support on the farmer.The motivation comes from the need on maintaining a healthy and clean environment, keeping soil and ambient away from pollutant particles.The goal is to support farmers on their decision to use fertilizers and pesticides only when is needed and in the lowest possible amount and at the same time keeping their production in the highest possible level of yield. Data will come from IoT modular sensors spread around the field. Temperature, humidity, nitrogen, phosphorus and potassium concentrations  will be monitored by dedicated sets of sensors. Then the data collected will be stored in a cloud based database to be used as an input to a DSS. . "
"We work in an ERP called SUMMA, it is a Swedish produced system. In summa we place orders, invoicing, keep ccontrole of materials etc. The customer database is also placed there. We belive that maybe this system need to be replaced (we do not know) to make the AI processes to work. We our first B2C site, taggla.se has just been released. Its built in wordpress and wordpress is also right now the place of the costumer database. Our process looks like this:Site/email/phone - ERP - Impositioning software ( prenect and Caldera) - Restoricing Image Processor RIP - offset printers, digitalprinters and expo- printersWe have started a mayor path of development in varios areas, we really want and need to be modern in our way of thinking and doing. Its a survival issue for us and the printing industry. If you also combine this with the environmentally callanges the world and our industry have and facing, the AI technology is an importaint block of success. for us, the industry and the world. That is our belive. Our goal is to grow from a local producer to an EU company that people will see as one of them who contribute to the solvation of the sustainability issuesWe believe that the AI technology can help us reduce our and other printing- and manufacturing companies waste with success, and therefore contribute to lower the footprint of printing industry with a crucial amount. We have the costumer database and its history. It would be enough to work with (?).  "
"Our current solution (FitSprite) for fitness and nutrition management consists of two parts: one part beingused by consumers, and the other part by personal coaches or fitness/nutritionspecialists. Consumers collect data such as their activity, trainings and eating usingmobile phone and/or a smart watch. One part of data collection, related to activity isautomatic, while nutrition intake recording is manually added by consumer to a mobile app.A personal trainer has an overview of the total activity and nutrition of his clients andnot only episodic views during their sessions. This allows her/him to accurately andefficiently lead them to achieving agreed fitness or weight related goals. The AI-basedinnovation, which we want to achieve with support of StairwAI, is to add automatic fooddetection so that a consumers can take a photo of the food they eat, after which AI modelswill determine the type of food, volume and based on that calculate calorie intake. Thiswill address the main burden in the use of our current solution for tracking nutritionintake, which is manual entry of food related data. The current method is inaccurate andcumbersome to use.There are two problems: food recognition and volume estimation. Available food image databases enable development of new DL models and fine-tuning of the existing complex DL architectures to perform well on taskssuch as food recognition, or calorie estimation. However, to achieve a robust and reliable solution, which users will love, we need to ensure that big majority of food a user eats is covered in databases and can be automatically recognized. Therefore in the first objective is to organize a data collection study using the existing FitSpritesolutions. The obtained data set can be used to refine the DL models trained from public data sets.The second objective is to implement a direct approach of nutrients recording via scanning of barcodes, with the DL-based food recognition based on the images taken by the user. The following public data sets are available: Food 101: https://www.tensorflow.org/datasets/catalog/food101, FooDD:https://ieee-dataport.org/open-access/foodd-food-detection-dataset-calorie-measurement-using-food-images,Recipe1M+: http://pic2recipe.csail.mit.edu/, ISIA Food-500:http://123.57.42.89/FoodComputing-Dataset/ISIA-Food500.htmlTechnologyAdditional data will be collected through a data collection study using the existing FitSprite solution. . Local execution on a mobile phone or a low latency if the inference is on the cloud"
"A platform for managing teams in shop-floor facilities - direct suggestions for team decision.A solution that enables and enhance teams to produce better with dedicated information.A solution that solves team demotivation and low performance caused by information loss, biased and deviated. With current knowledge, we have no information to assess which data is required. . Fairness, and low latency.Others still unknown."
"We genereted many of force/indentation curves in our production processes, the use of IA is challenging for us to be more efficiency and to preserve our know.The main challenge is to standardise our processes and preserve our ressources and workforces. All datas on biological models are collected and organazed, we needs to collect more datas on human body (in-vivo) with our innovative product. "
"smart textilesto transform products to products+ services. health related data. energy efficiency, data safety"
Meal plan developmentIncrease the app user friendliness. Eating habit and user biometrical data. 
"An independent hotel (new or not) that does not have the support of an HR & Quality department to manage the satisfaction and retention of its team. Therefore, this hotel is always short of staff and lacks the commitment of the team, and either can commit to providing a quality job to its team.It is important for the hotel to keep the team as stable as possible. This can just be done by providing a good job position to each team member. After investigating, the staff in the sector is sicking continues development, a job career and better conditions (timetable and salary).The AI system will allow the hotel to sort 2 of the 3 requests from the team: offer continuous development based on the interest of each staff and match it with the needs of each team member to provide a professional career. . The data available that we have is the needs (skills) that each position has in the industry, this will help us to draft a training path depending on the position that a team member is working on and the position that they would like to reach. The data missing are the interests of each user, which can be collected once they access the training platform and will help to provide a unique training path for them. Also, the interest of any other professional, which will adapt the training path to the next level or promotion hunted. . "
Optimisation of the manufacturing process for drone and video electrical components in theassembly and testing line using AI solutions.Improvement of the manufacturing process and lowering the costs. Data from the sensors for detection of defects are available. 
"The context is our proprietary software Anti-Hacker. It allows anybody to test their IT systems with no need for tech knowledge. Tests results are organised in two layers: one for non-technical readers (e.g., managers), who can quickly understand the overall cyber risk and choose remediation strategies, and one with all technical details needed by the system owner to fix the vulnerabilities foundCyLock's current default settings allow limited management of IT specificities to cover as many situations as possible, with slower average processing and scanning times. Nevertheless, the software has been designed with the possibility of including special scripts able to significantly improve the testing process: the introduction of AI can indeed allow selecting the types of tests to be carried out according to the technical specifications of the IT systems under analysis. Thanks to AI, CyLock will be able to provide a significantly higher quality of results than the current configuration, with a direct impact on SMEs' ability to respond to cyber threats: the more cyber vulnerabilities are found, the fewer chances cybercriminals have of compromising IT systems. Data related to penetration tests already executed are available. We will collect a wider dataset by running the tests on several different ocnfigurations while our current and future customers keep on buying our services. "
Utilize CNN to validate media investments. Access to enough data. Still to be determined. scaleout systemsdatabricks. 
"We make changes to newspublications visible. But tracking all changes requires an objective valuation of the context and text changes. For this we need language based machine learning and AI. To follow 100+ newssites over the world requires an indepth knowledge of the language and context of journalistic publications. It's neigh impossible to have staff that speak a multitude of languages and can assess changes by themselves without losing objectivity or context. We collect all the new publications from 27 public newssites all over the world. Currently we have over 250.000 publications which grows every minute :). The AI system is supposed to evaluate the text, decide if a change adds or removes information and score on public (open source) algorithms. . It's mostly about being transparant and fair, something that is usually kept really secret in the AI industry.We hope that with our usecase we can improve journalism not only in the EU but everywhere."
Marketing analysis to reash new targeted segments . Paying money in digital marketing channels without reach new customers . Data via web and social media analytics tools. Enhance the reach of our clients content. . No
"as described before, we have our own database where we capture and manage many different dates. But the interpretation of this dates must be done by human resource. For example, we have more than 100k different articles on stock, which must be ordered or produced in time and also the quantity of ordering parts is not always the same it must be organized on the needs. Another example is in the sales department, we have around 3000 customers in out database, it is difficult to monitor all this customers only by the human. Which customer decrease the sales and when?. to reduce the quantity of articles on stock, to have always enough and on time articles on stock and reduce in this way the cost.Another point is to monitor the customer and react by time, contact the customer if sales are decreasing  . we have a lot different dates in out database. described at point 31. no"
"In 2018, using Artificial Intelligence and augmented reality, we created StorySign, the first application in the world capable of translating a book into Sign Language in real time. . Learning to read can be difficult for any child. For deaf children, it can be a real challenge. We knew that our technology could help open the doors of the world of books to 32 million deaf children around the world, accompanying them in a universe of imagination, curiosity and creativity.Focusing on supporting families with deaf children up to 6 years old, StorySign uses innovative mobile AI technology to translate popular children's books into sign language. The app scans the words of selected, popular children's books, instantly translating them into sign language using our friendly signing avatar, Star. Here it shows how it works https://consumer.huawei.com/it/makeitpossible/humanlypossible/storysign/ . The 71 different children's books on the app are available in 15 sign languages, including British Sign Language, American Sign Language, Auslan, Libras, Spanish Sign Language, and French Sign Language. The greater the number of books the more pervasive this app can be https://www.huawei.com/en/tech4all/stories/storysign . Ensure that deaf children are not excluded.   90% of deaf children have hearing parents, most of whom do not sign and so can’t share bedtime stories. 57% of deaf students fail to achieve basic school qualifications. And fewer than 40% of deaf adults are employed. Ensure they are not excluded from the learning process other kids benefit from. The root of the problem is that deaf children struggle to read, because they can’t learn phonetically. Our insight - if we helped them link words with signs, it would hugely increase what is possible for them in the future. Huawei believes in the positive power of AI and its smartphones include an AI chip. "
"By linking signs to words, Huawei's goal is to facilitate the learning of reading and writing, allowing individuals to read more independently , i.e. even when there is no one to translate the text into the language of the signThis is how it works https://consumer.huawei.com/it/makeitpossible/humanlypossible/storysign/ . 90% of deaf children have hearing parents, most of whom do not sign and so can’t share bedtime stories. 57% of deaf students fail to achieve basic school qualifications. And fewer than 40% of deaf adults are employed.The root of the problem is that deaf children struggle to read, because they can’t learn phonetically. Our insight - if we helped them link words with signs, it would hugely increase what is possible for them in the future. Huawei believes in the positive power of AI and its smartphones include an AI chip. 71 books across 15 languages . Support deaf children, ensure they are not excluded by society . "
"Automatise and speed up the diagnosis of respiratory diseases . Improve COVID 19 and other respiratory diseases diagnosis (time, accuracy). Algorithms recognize the medical images, identify typical disease development patterns. More images, more accurate disease identification . AI improve the duration analysis from 10-15 mins when done manually to 2-3 seconds. Accuracy is almost 10. "
"We provide back end systems for mobile observations (environmental, biodiversity). . We want to offer captured data from mobile phones to (deep) learning mechanisms. A lot the processing and reduction is done by hand now. Data coming in from smartphones and sensors (images, sound files, all kinds of measurement data (for example PM2.5). We want to automate and innovate our systems by detecting colors or perform reduction of (spectral) images, but also want to hook on existing systems like plant/biodiversity recognition services. The mobile app user needs quick feedback and therefore fast processing types."
"Getting an accurate weigh of farm animals is very difficult, yet knowing the daily weight gain of these animals is essential to farm management decisions. Larger beef animals as an example carry up to 30kg of feed and water in their stomachs which can be excreted at any time resulting in huge fluctuations in weight from one day to the next. Additionally animal behavior like moving, head movement, scratching etc while on a weighing scales causes the weight reading to fluctuate continuously. Considering that a top performing animal will gain about 1.5kgs of weight per day it is extremely difficult to get an accurate weight that truly reflects the animals performance and as a result most farmers don't weight their animals regularly. We have developed hardware that weights the animals in their natural environment several times a day and uses machine learning and AI to eliminate the factors that cause weight fluctuations in order to get an accurate weight for the animal. We are farmers and IT professionals, we can not run our farms as efficiently as we need to if we do not have accurate daily live weight gain data for our animals. This data will allow us to make better decisions around animal diet, animal environment, animal health and project slaughter dates all of which will increase our profit. We have already captured months of data from a series of animals and are working on the modelling to find the accurate weight data for each animal daily. AI enables us to get the most accurate animal weight on the market. "
"We are developing a thermo-mechanical (reversible heat-pump storage solution) system that has high complexity controls and requires AI support to optimise theefficiency of the process for different use case scenarios. We are in discussions with large corporations from different sectors that want to see our solution demonstrated. This is rises our ambition but at the same time we cannot bear the risks of bringing our product to the market without financing and support. . We need to assemble our well developed sub components to a first of a kind prototype. Tests of this prototype will generate multiple data sets which we will collect analyse and combine with datasets from energy companies (DSO, DNO), industrial processes and research institutes in order to optimise our process parameters and respond to targeted products by each case. For instance with DSOs we will optimise our storage system for EV Chargers support. With DNOs we will optimise our heat-pumping solution especially for district heating systems. For industrial plants (especially those using steam for processes, like pharma, food, etc processing) we will optimise our heat-pump storage to recover waste heat, and synchronise the waste energy with the heat input requirements dramatically improving the industrial process efficiency. The AI system under development will collect real time data from ~150 sensors deployed in our prototype heat pump storage (namely phase change material mass, heat exchangers (acting as condensers and evaporators, compressor and expander system, piping for refrigerant, generator, motor, power consumption and production parameters etc.) to precisely monitor and log all physical parameters under various external scenarios (temperature levels, pressure levels, speed of rotor, electrical power input /output) in order to validate the simulated process and optimise the controls for different requirements, in accordance to different application specifications. This is an extremely complex task and the algorithm we have developed aims to identify all critical correlations between all these parameters, map the operational boundaries, and identify strategies that maximise the efficient and safe operation per case. These strategies will then be tested with real data series from our partner's scenarios in order to verify the operational efficiency on simulated conditions, before we manufacture the pilots that will be tested in real environment. Energy and Power efficiency related parameters are key to our development"
"Using data held in a Performance Management System to understand the level of engagement of an employee, in order to tackle employee attrition or lack of motivation, both costly business problems. . Since the world has moved to remote, finding out how motivated or engaged an employee is, is not as simple as it once was. We can analyse trends in the performance management system to help them interpret the levels within their customer organisation and provide guidance to help prevent the problem from occuring in the first place. . Data is currently held in the Performce Management System and has been shared with our organisation. a Real time integration will most likely be built upon successful delivery of a pilot. . Identify unmotivated and unengaged employees so the organisation can take measures to counteract this problem. . xAI will be incredibly important so that the organisation in question is able to trust the predictions being made and use them to make decisions about their employees. "
"The benefit would be in industrial quality control processes. To be specific, in the manufacturing industry, quality controls with 3D data are being automated. This generates tons of data, which is usually simplified and analyzed. The analysis nonetheless, is essentially dimensional (size of a hole for instance), and much of the data is completely ignored and not used. We think that adding AI analyzing the whole data could help detect defects outside the basic dimensional analysis, improving quality significantly. It is not so much a problem as an opportunity. Quality control of manufactured parts (specially sheet metal parts) is usually quality controlled using expensive and very accurate optical sensors, which generate millions of data points per second. To handle such data usually the data is simplified and analyzed with very specific dimensional analysis plans. We think that these raw data points could be additionally used to detect defects outside the analysis plan, and AI-based approach could embed the intuition of what is a defect and what is actually noise.The problem itself is not of extreme difficulty, nonetheless, what makes it challenging is that AI development is hard to predict how much time it will take and if it will be successful. Since we are a startup it is hard for us, even though we see a huge benefit for it, to invest our limited resources into developing AI for this use case. We have a strong CAD based simulation engine, and we can use data augmentation techniques to create simulated random defects in order to train our AI models. So we think we could generate all the data necessary (and with enough variety) to train and test the models from our simulation.It cannot be any other way since industrial data is heavily protected to avoid industrial espionage. When the model is trained and ready we do have access into industrial facilities where we could test our AI models to see results in real life. The AI system should be able to consume 3D data points (in the millions per second) and be able to tell if the surface the data comes from has defects or not (scratches, irregularities, cracks...). The difficulty is that the variety of surfaces is very high, but nonetheless in almost all industries the definition of what is a defect is quite standard.The benefit is that if AI is able to detect any defect with certainty (even if it misses some), it would increase quality of products, reduce manufacturing costs and maybe even anticipate/predict manufacturing problems. The main requirement is that the false positives of the AI model in detecting defects should be very low, since positives would need to be double checked by human operators and that has a high cost.Another requirement is that the model needs to run locally (for privacy protection of industrial data), not in big GPU farms."
"We have developed a cloud database system for mobile and web application developers. It is integrated into the python and javascript programming languages such that it is much easier to use than other databases. We have seen a reduction of 30% in development costs using our database. The challenge is to send data opportunistically to client devices. Since the application(s) are used in similar ways by most users, it should be possible to predict what data will be needed at a device and send this data, before the client devices request this data. This will make the applications run much faster with lower latency. We are logging the data requests made to the database. This needs to be turned into a format that can be used by AI so that predictions can be made. The AI system is supposed to predict data requests and send data to client devices before the applications request it. Since there might be many outstanding data requests, it also needs to prioritize these requests. The benefit is lower latency, thus faster mobile and web applkications. "
physical system for predictive maintenance. to monitor and apply diagnstic to our products. data form sensors that has been used during many durability test of our products. better and adaptavive monitoring of our product health status . prediction or remaining usefull life of product after malfunction detection
Analyze and optimization of power electricity consumption on centrals sites or data center. Cost seving and increased sostenibility. The data are available. Consumption Data are saved on different systems and database. Predicting energy consumption throughout the Italian territory and moving processing to sites with a lower consumption. Optimization local energy consumption. Power efficiency and latency
machining room: feedback by the machining tool about the maintenance service. if the machining tool is not mainenanced the machinig of the component could be affected by some fault in dimension and tollerances. working ourkind of components machined during the working timelevel of wear of the tools registred by the machine. the AI will give us an alarm when the tools has to be mainteined. 
"Trouble ticketing services for customers support. Tickets are often repetitive, Time-consuming, Human-task based tasks that require you to understand the case history, implement the intervention or scale up on vendor support. Data is available from the operational system of the company. . Reduce ticket management times, improve solutions finding starting from similar problems in the knowledg-baseof the previous tickets, increase the quality of service to the end user  by adopting intelligent systems based on chatbot. Explainability to motivate some reasoning is common problems, natural language understanig from users needs, ethics aspect in using AI"
"Polymer extrusion lines. High energy consumption in order to fulfill quality of the product. Available: real time process data, lab analyses . Determine the optimal set points for the extruder, according to the specific product, in order to minimize the specific energy while maintaining the quality of the product which depends on several factors either unknown or unpredictable . "
"The idea is to create an intelligent machine where reinforcement learning is used to optimize the parametrization for performing better product. One possible machine could be a plastic thermoforming machine where process parameter should be find in order to optmize the production. The reinforcement learning is a technique spread at research level but with less apllication in the manufacturing, the possibility to train an agent for finding the best policy for optmizing the machine parametrization will lead to high efficiency process. All the process parameter should be collected. An edge device that works at field level, where all the data flow into the same device. "
"Stimulate reading (again) for children 5+ with an interactive reading app using AI. Bring WALKYTALKIES children's socks and sock puppets alive, in an educational way. All content is available. We developed a first working prototype 2 years ago. AI brings the WALKYTALKIES stories alive. While reading the interactive stories in the app, you answer questions which influence the way the story continues. You'll find those answers in a 3D world, driven bij AI. It turns reading into an experience and stimulates children to read (more often). All in combination with a tangible object: WALKYTALKIES sock puppets. Scanning in colour, scanning textile."
