[gd_scene load_steps=3 format=2]

[ext_resource path="res://ui/Homeward.theme" type="Theme" id=1]
[ext_resource path="res://screens/encounter/EncounterScreen.gd" type="Script" id=3]

[node name="EncounterScreen" type="Control"]
theme = ExtResource( 1 )
script = ExtResource( 3 )
__meta__ = {
"_edit_use_anchors_": false
}
