[gd_scene load_steps=5 format=2]

[ext_resource path="res://ui/Homeward.theme" type="Theme" id=1]
[ext_resource path="res://ui/LargeUIFont.tres" type="DynamicFont" id=2]
[ext_resource path="res://ui/MediumUIFont.tres" type="DynamicFont" id=3]
[ext_resource path="res://screens/game_over/GameOverScreen.gd" type="Script" id=4]

[node name="GameOverScreen" type="Control"]
theme = ExtResource( 1 )
script = ExtResource( 4 )
__meta__ = {
"_edit_use_anchors_": false
}

[node name="Background" type="ColorRect" parent="."]
margin_right = 1280.0
margin_bottom = 720.0
color = Color( 0, 0, 0, 1 )
__meta__ = {
"_edit_use_anchors_": false
}

[node name="Title" type="Label" parent="."]
margin_left = 60.0
margin_top = 60.0
margin_right = 673.0
margin_bottom = 126.0
custom_fonts/font = ExtResource( 2 )
text = "Game Over"
__meta__ = {
"_edit_use_anchors_": false
}

[node name="Description" type="Label" parent="."]
margin_left = 200.0
margin_top = 160.0
margin_right = 1080.0
margin_bottom = 560.0
custom_fonts/font = ExtResource( 3 )
custom_constants/line_spacing = 12
text = "Description"
align = 1
valign = 1
autowrap = true
__meta__ = {
"_edit_use_anchors_": false
}

[node name="BummerButton" type="Button" parent="."]
margin_left = 571.311
margin_top = 618.031
margin_right = 721.311
margin_bottom = 663.031
text = "Bummer!"
__meta__ = {
"_edit_use_anchors_": false
}

[connection signal="pressed" from="BummerButton" to="." method="_onBummerButtonPressed"]
