[gd_resource type="DynamicFont" load_steps=2 format=2]

[ext_resource path="res://ui/roboto-medium.ttf" type="DynamicFontData" id=1]

[resource]
size = 30
outline_size = 1
outline_color = Color( 0.196078, 0.203922, 0.192157, 1 )
font_data = ExtResource( 1 )
