<?xml version="1.0" encoding="UTF-8" standalone="no"?>
<!-- Created with Inkscape (http://www.inkscape.org/) -->

<svg
   width="1280"
   height="200"
   viewBox="0 0 338.66666 52.916667"
   version="1.1"
   id="svg5"
   inkscape:version="1.1.1 (3bf5ae0d25, 2021-09-20)"
   sodipodi:docname="GraphBackground.svg"
   xmlns:inkscape="http://www.inkscape.org/namespaces/inkscape"
   xmlns:sodipodi="http://sodipodi.sourceforge.net/DTD/sodipodi-0.dtd"
   xmlns="http://www.w3.org/2000/svg"
   xmlns:svg="http://www.w3.org/2000/svg">
  <sodipodi:namedview
     id="namedview7"
     pagecolor="#ffffff"
     bordercolor="#666666"
     borderopacity="1.0"
     inkscape:pageshadow="2"
     inkscape:pageopacity="0.0"
     inkscape:pagecheckerboard="0"
     inkscape:document-units="px"
     showgrid="false"
     units="px"
     width="1280px"
     inkscape:zoom="1.4142136"
     inkscape:cx="691.19688"
     inkscape:cy="140.71425"
     inkscape:window-width="1920"
     inkscape:window-height="1015"
     inkscape:window-x="0"
     inkscape:window-y="0"
     inkscape:window-maximized="1"
     inkscape:current-layer="layer1" />
  <defs
     id="defs2" />
  <g
     inkscape:label="Layer 1"
     inkscape:groupmode="layer"
     id="layer1">
    <rect
       style="fill:#343434;fill-opacity:1;stroke:none;stroke-width:1.058;stroke-miterlimit:4;stroke-dasharray:none;stop-color:#000000"
       id="rect1038"
       width="338.66666"
       height="52.916664"
       x="0"
       y="0"
       ry="0"
       rx="0" />
    <rect
       style="fill:#b4a49e;fill-opacity:1;stroke:none;stroke-width:1.058;stroke-miterlimit:4;stroke-dasharray:none;stop-color:#000000"
       id="rect2514"
       width="333.375"
       height="47.625"
       x="2.6458333"
       y="2.6458333"
       ry="5.7707071"
       rx="5.7707071" />
    <path
       style="fill:none;stroke:#d4957e;stroke-width:0.264583px;stroke-linecap:butt;stroke-linejoin:miter;stroke-opacity:1"
       d="M 2.6458333,42.465625 H 336.02083"
       id="path7572"
       sodipodi:nodetypes="cc" />
    <rect
       style="fill:#a6ada6;fill-opacity:1;stroke:none;stroke-width:1.058;stroke-miterlimit:4;stroke-dasharray:none;stroke-opacity:1;stop-color:#000000"
       id="rect7758"
       width="333.375"
       height="31.75"
       x="2.645833"
       y="10.583332"
       rx="0"
       ry="0" />
    <path
       style="fill:none;stroke:#479847;stroke-width:0.264583px;stroke-linecap:butt;stroke-linejoin:miter;stroke-opacity:1"
       d="M 2.6458333,26.458333 H 336.02083"
       id="path877"
       sodipodi:nodetypes="cc" />
    <path
       style="fill:none;stroke:#d4957e;stroke-width:0.264583px;stroke-linecap:butt;stroke-linejoin:miter;stroke-opacity:1"
       d="M 2.6458333,10.715625 H 336.02083"
       id="path7574"
       sodipodi:nodetypes="cc" />
  </g>
</svg>
