[gd_scene load_steps=5 format=2]

[ext_resource path="res://encounters/base/LandEncounter.tscn" type="PackedScene" id=1]
[ext_resource path="res://props/Crew.tscn" type="PackedScene" id=2]
[ext_resource path="res://encounters/common/HuntingGrounds.gd" type="Script" id=3]
[ext_resource path="res://props/Planet.tscn" type="PackedScene" id=4]

[node name="HuntingGrounds" instance=ExtResource( 1 )]
script = ExtResource( 3 )
travelScreenScene = ExtResource( 4 )
travelScreenText = "A large rocky spheroid orbiting a star..."

[node name="Crew" parent="." index="7" instance=ExtResource( 2 )]
position = Vector2( 173.027, 598.45 )

[node name="Crew2" parent="." index="8" instance=ExtResource( 2 )]
position = Vector2( 431.773, 546.066 )

[node name="Crew3" parent="." index="9" instance=ExtResource( 2 )]
position = Vector2( 479.395, 611.149 )

[node name="Crew4" parent="." index="10" instance=ExtResource( 2 )]
position = Vector2( 322.242, 623.848 )
