[gd_scene load_steps=2 format=2]

[ext_resource path="res://props/Alien.gd" type="Script" id=1]

[node name="Alien" type="Node2D"]
script = ExtResource( 1 )

[node name="Sprite" type="Sprite" parent="."]
position = Vector2( 0, -50 )
