[gd_scene load_steps=3 format=2]

[ext_resource path="res://encounters/Encounter.tscn" type="PackedScene" id=1]
[ext_resource path="res://encounters/BG_FriendlyShip.png" type="Texture" id=2]

[node name="FriendlyShipEncounter" instance=ExtResource( 1 )]

[node name="ShipBackground" type="TextureRect" parent="." index="1"]
margin_right = 1280.0
margin_bottom = 720.0
texture = ExtResource( 2 )
stretch_mode = 3
__meta__ = {
"_edit_use_anchors_": false
}
