<?xml version="1.0" encoding="UTF-8" standalone="no"?>
<svg
   xmlns:dc="http://purl.org/dc/elements/1.1/"
   xmlns:cc="http://creativecommons.org/ns#"
   xmlns:rdf="http://www.w3.org/1999/02/22-rdf-syntax-ns#"
   xmlns:svg="http://www.w3.org/2000/svg"
   xmlns="http://www.w3.org/2000/svg"
   xmlns:sodipodi="http://sodipodi.sourceforge.net/DTD/sodipodi-0.dtd"
   xmlns:inkscape="http://www.inkscape.org/namespaces/inkscape"
   width="80"
   height="80"
   viewBox="0 0 21.166666 21.166667"
   version="1.1"
   id="svg8"
   inkscape:version="1.0.2 (e86c870879, 2021-01-15, custom)"
   sodipodi:docname="player.svg">
  <defs
     id="defs2" />
  <sodipodi:namedview
     id="base"
     pagecolor="#ffffff"
     bordercolor="#666666"
     borderopacity="1.0"
     inkscape:pageopacity="0.0"
     inkscape:pageshadow="2"
     inkscape:zoom="7.9195959"
     inkscape:cx="36.569054"
     inkscape:cy="46.991097"
     inkscape:document-units="mm"
     inkscape:current-layer="layer1"
     inkscape:document-rotation="0"
     showgrid="false"
     units="px"
     inkscape:window-width="1920"
     inkscape:window-height="1015"
     inkscape:window-x="0"
     inkscape:window-y="0"
     inkscape:window-maximized="1" />
  <metadata
     id="metadata5">
    <rdf:RDF>
      <cc:Work
         rdf:about="">
        <dc:format>image/svg+xml</dc:format>
        <dc:type
           rdf:resource="http://purl.org/dc/dcmitype/StillImage" />
        <dc:title />
      </cc:Work>
    </rdf:RDF>
  </metadata>
  <g
     inkscape:label="Layer 1"
     inkscape:groupmode="layer"
     id="layer1">
    <g
       id="g849">
      <ellipse
         style="fill:#63809f;stroke:#c0ebeb;stroke-width:0.397;stroke-linecap:round;stroke-linejoin:round;stroke-miterlimit:4;stroke-dasharray:none;stop-color:#000000;fill-opacity:1;stroke-opacity:1"
         id="path849"
         cx="10.613264"
         cy="6.4853187"
         rx="0.86981195"
         ry="0.90870494" />
      <rect
         style="fill:#63809f;stroke:#c0ebeb;stroke-width:0.396875;stroke-linecap:round;stroke-linejoin:round;stroke-miterlimit:4;stroke-dasharray:none;stop-color:#000000;fill-opacity:1;stroke-opacity:1"
         id="rect855"
         width="1.9800736"
         height="4.6365895"
         x="9.6248426"
         y="7.446239"
         ry="0.72840619" />
      <rect
         style="fill:#63809f;stroke:#c0ebeb;stroke-width:0.396875;stroke-linecap:round;stroke-linejoin:round;stroke-miterlimit:4;stroke-dasharray:none;stop-color:#000000;fill-opacity:1;stroke-opacity:1"
         id="rect855-6"
         width="0.91061676"
         height="3.5383034"
         x="8.8672037"
         y="7.6218371"
         ry="0.55586594" />
      <rect
         style="fill:#63809f;stroke:#c0ebeb;stroke-width:0.396876;stroke-linecap:round;stroke-linejoin:round;stroke-miterlimit:4;stroke-dasharray:none;stop-color:#000000;fill-opacity:1;stroke-opacity:1"
         id="rect897"
         width="0.91061676"
         height="3.6300776"
         x="11.388846"
         y="7.5200472"
         ry="0.57028359" />
      <rect
         style="fill:#63809f;stroke:#c0ebeb;stroke-width:0.396875;stroke-linecap:round;stroke-linejoin:round;stroke-miterlimit:4;stroke-dasharray:none;stop-color:#000000;fill-opacity:1;stroke-opacity:1"
         id="rect899"
         width="0.91061676"
         height="3.5383034"
         x="9.4033117"
         y="12.00145"
         ry="0.55586594" />
      <rect
         style="fill:#63809f;stroke:#c0ebeb;stroke-width:0.396876;stroke-linecap:round;stroke-linejoin:round;stroke-miterlimit:4;stroke-dasharray:none;stop-color:#000000;fill-opacity:1;stroke-opacity:1"
         id="rect901"
         width="0.91061676"
         height="3.6300776"
         x="10.829169"
         y="11.960037"
         ry="0.57028359" />
    </g>
  </g>
</svg>
