<?xml version="1.0" encoding="UTF-8" standalone="no"?>
<svg
   xmlns:dc="http://purl.org/dc/elements/1.1/"
   xmlns:cc="http://creativecommons.org/ns#"
   xmlns:rdf="http://www.w3.org/1999/02/22-rdf-syntax-ns#"
   xmlns:svg="http://www.w3.org/2000/svg"
   xmlns="http://www.w3.org/2000/svg"
   xmlns:sodipodi="http://sodipodi.sourceforge.net/DTD/sodipodi-0.dtd"
   xmlns:inkscape="http://www.inkscape.org/namespaces/inkscape"
   width="80"
   height="80"
   viewBox="0 0 21.166666 21.166667"
   version="1.1"
   id="svg8"
   inkscape:version="1.0.2 (e86c870879, 2021-01-15, custom)"
   sodipodi:docname="cracks-3.svg">
  <defs
     id="defs2" />
  <sodipodi:namedview
     id="base"
     pagecolor="#ffffff"
     bordercolor="#666666"
     borderopacity="1.0"
     inkscape:pageopacity="0.0"
     inkscape:pageshadow="2"
     inkscape:zoom="8"
     inkscape:cx="21.801415"
     inkscape:cy="39.548839"
     inkscape:document-units="px"
     inkscape:current-layer="layer1"
     inkscape:document-rotation="0"
     showgrid="false"
     units="px"
     inkscape:window-width="1920"
     inkscape:window-height="1015"
     inkscape:window-x="0"
     inkscape:window-y="0"
     inkscape:window-maximized="1"
     inkscape:pagecheckerboard="true" />
  <metadata
     id="metadata5">
    <rdf:RDF>
      <cc:Work
         rdf:about="">
        <dc:format>image/svg+xml</dc:format>
        <dc:type
           rdf:resource="http://purl.org/dc/dcmitype/StillImage" />
        <dc:title></dc:title>
      </cc:Work>
    </rdf:RDF>
  </metadata>
  <g
     inkscape:label="Layer 1"
     inkscape:groupmode="layer"
     id="layer1">
    <path
       style="fill:none;stroke:#ffffff;stroke-width:0.264583px;stroke-linecap:butt;stroke-linejoin:miter;stroke-opacity:1"
       d="M 10.782663,10.302096 C 10.638353,9.867948 10.473221,9.4481686 10.338145,8.9916446 10.148049,8.3491701 10.00831,7.6983025 9.8398506,7.0521485 9.7389219,6.6650189 9.6141309,6.7744503 9.3019191,6.6768836 8.6669979,6.4784699 7.9774821,6.4585346 7.3240642,6.3278506 7.2685248,6.3167434 6.6704048,6.2079277 6.6012705,6.1554028 c -0.00865,-0.00657 0.00668,-0.049181 0,-0.057789 C 6.4000514,5.8381857 6.5175738,5.7200209 6.490033,5.3757628 6.4635641,5.044904 6.4117338,4.7165638 6.3736883,4.3868355 6.3677749,4.33559 6.3624885,4.0617647 6.3446022,4.0477966 c -0.01134,-0.00886 -0.031438,0.00834 -0.043164,0 C 6.1753389,3.9581462 6.0137981,3.9111729 5.8770556,3.8200118 5.5407189,3.595788 5.2461083,3.3005773 4.9172142,3.0637736 4.477594,2.7472465 3.9454846,2.3075354 3.3756518,2.3075354"
       id="path855" />
    <path
       style="fill:none;stroke:#ffffff;stroke-width:0.264583px;stroke-linecap:butt;stroke-linejoin:miter;stroke-opacity:1"
       d="m 10.782663,10.302096 c 0.350304,0.451154 0.498063,0.896018 0.628708,1.440374 0.0057,0.02368 0.07287,0.347144 0.08726,0.375926 0.132903,0.265812 0.07162,-0.223082 0.199217,0.51697 0.0067,0.03871 0.0071,0.646201 0.02909,0.668982 0.04022,0.04172 0.344298,0.10562 0.355964,0.109525 0.186159,0.06233 0.372778,0.124916 0.552634,0.203603 0.516595,0.226011 0.244592,0.207174 0.814411,0.378121 0.248182,0.07445 0.342115,0.03905 0.514017,0.08726 0.135679,0.03805 0.252684,0.186446 0.377728,0.254652 0.0974,0.05313 0.222499,0.09466 0.319948,0.145429 0.04719,0.02458 0.143373,0.03243 0.188266,0.05167 0.161426,0.06918 0.429724,0.212154 0.533103,0.334916 0.07308,0.08679 0.48099,0.760034 0.465378,0.901669 -0.03218,0.291983 -0.142114,0.566009 -0.17144,0.85925 -0.02037,0.203719 0.01493,0.427221 0.02909,0.625422 8.2e-4,0.01155 -0.01455,0.158496 0,0.174517 0.02369,0.02608 0.07061,-0.0033 0.105686,0 0.07783,0.0073 0.156258,0.01271 0.23269,0.02909 0.323883,0.0694 0.558273,0.116344 0.901669,0.116344 0.008,0 0.396199,-0.03443 0.40553,-0.02909 0.01452,0.0083 0,0.164152 0,0.176996 0,0.172978 0.09913,0.272349 0.114036,0.451158 0.01106,0.132774 -0.03376,0.300305 0,0.430834 0.114191,0.441504 0.336062,0.782704 0.696396,1.071175 0.0068,0.0054 0.474881,0.06412 0.538339,0.08527 0.370504,0.123502 0.742597,0.290862 1.1389,0.290862"
       id="path857" />
    <path
       style="fill:none;stroke:#ffffff;stroke-width:0.264583px;stroke-linecap:butt;stroke-linejoin:miter;stroke-opacity:1"
       d="m 10.782663,10.302096 c 0.173267,-0.02102 0.345753,-0.04999 0.5198,-0.06306 0.106349,-0.008 0.214637,0.01685 0.319946,0 0.592009,-0.09472 1.126459,-0.4138856 1.657907,-0.6689799 0.164221,-0.078826 0.327033,-0.1609328 0.494465,-0.2326891 0.05245,-0.022479 0.225666,-0.035771 0.252251,-0.08612 0.04112,-0.077875 -0.02207,-0.2337086 0,-0.316488 0.255453,-0.7663569 -0.0017,0.065687 0.174517,-0.6980658 0.270439,-1.1718983 -0.05693,0.670828 0.23269,-1.1634433 0.03072,-0.1945634 0.107212,-0.4895934 0.05817,-0.6980658 -0.0073,-0.030923 -0.03585,-0.052466 -0.05286,-0.079295 C 14.325243,6.1156057 14.200004,5.9416493 14.098478,5.7538719 14.017948,5.6049266 13.9706,5.4399409 13.894877,5.2884944 13.818677,5.1360952 13.618557,4.8391113 13.516757,4.7067723 13.274845,4.3922869 13.502557,4.6670543 13.40295,4.6195153 13.376,4.6066513 12.907844,3.9022508 12.919523,3.8597759 12.971933,3.6691452 13.143548,3.5675045 13.268557,3.4246382 13.54883,3.1043267 13.634179,2.9827261 13.850278,2.6684 c 0.0561,-0.081606 0.08357,-0.1817335 0.145431,-0.2590635 0.09244,-0.1155509 0.244449,-0.2447671 0.367274,-0.3091018 0.02676,-0.014016 0.06445,5.609e-4 0.09212,-0.016582 0.118315,-0.073295 0.213558,-0.2426458 0.303502,-0.3325863 0.04552,-0.045514 0.08861,-0.031929 0.126567,-0.069892"
       id="path859" />
    <path
       style="fill:none;stroke:#ffffff;stroke-width:0.264583px;stroke-linecap:butt;stroke-linejoin:miter;stroke-opacity:1"
       d="M 6.4857132,6.237411 C 6.3405657,6.5650678 6.1935965,6.8638205 5.9163296,7.1158819 5.8083201,7.2140727 5.6381684,7.3123945 5.5382117,7.4007815 5.4220559,7.5034928 5.4539795,7.3880815 5.1993273,7.6280591 4.8801556,7.9288369 5.0486614,7.8138344 4.8212073,8.1225228 4.5998198,8.4229775 4.3399455,8.6688812 4.0358829,8.8787609 3.9658575,8.9270961 3.676334,8.717745 3.6230829,8.7044436 c -0.047031,-0.011748 -0.096952,0 -0.1454287,0 C 3.3807005,8.675358 3.2835392,8.6469544 3.1867927,8.6171862 2.9523634,8.5450547 2.7016855,8.5061876 2.4887269,8.384497 2.4229807,8.3469278 2.3779067,8.2800149 2.3142099,8.2390672 2.2263451,8.1825829 2.1060865,8.1762475 2.0322261,8.1023872"
       id="path861" />
    <path
       style="fill:none;stroke:#ffffff;stroke-width:0.264583px;stroke-linecap:butt;stroke-linejoin:miter;stroke-opacity:1"
       d="m 10.782663,10.302096 c -0.514759,1.085711 -0.04163,0.194716 -0.8251495,1.33235 -0.1181079,0.171487 -0.1932221,0.372322 -0.3253415,0.533262 -0.2611287,0.318092 -0.6309069,0.534238 -0.8725829,0.872581 -0.088335,0.123668 0.1482635,0.961854 0.1733643,1.114215 0.04334,0.26307 0.047755,0.531581 0.091237,0.794628 0.330472,1.999218 -0.032971,-0.994384 0.2374289,1.528972 0.01347,0.125693 0.097255,0.271663 0.029086,0.37812 -0.1224325,0.191202 -0.2703216,0.378047 -0.3977328,0.569168 -0.1026805,0.154023 -0.1301607,0.39056 -0.3199479,0.490496 -0.087251,0.04594 -0.8622549,-0.0092 -0.9698334,0 -0.7125269,0.06107 -1.4084985,0.239805 -2.1232836,0.290861 -0.5903288,0.04217 -1.1845155,-0.03299 -1.7742519,0.02908 -0.1065006,0.01121 -0.2131306,0.02146 -0.3199476,0.02909 -0.019823,0.0014 -0.1886014,-0.02306 -0.2127859,0 -0.1362339,0.129871 -0.4288345,0.249845 -0.5739333,0.403005 -0.1187189,0.125315 -0.2163732,0.26911 -0.3199457,0.407206 -0.084945,0.113261 -0.1875904,0.242822 -0.2326893,0.378119"
       id="path863" />
    <path
       style="fill:none;stroke:#ffffff;stroke-width:0.264583px;stroke-linecap:butt;stroke-linejoin:miter;stroke-opacity:1"
       d="m 14.736709,6.6681632 c 0.5711,-0.00754 1.14143,0.058172 1.711487,0.058172 0.03244,0 0.357791,-0.01995 0.378118,0 0.04722,0.046339 0.04858,0.1407737 0.110091,0.1651354 0.03815,0.01511 0.06031,-0.055921 0.08705,-0.087052 0.111517,-0.1298427 0.213584,-0.2675501 0.317313,-0.4036949 0.130465,-0.1712343 0.225902,-0.3713289 0.378123,-0.5235498 0.09708,-0.097077 0.648575,-0.4494088 0.668979,-0.4653775 0.240382,-0.1881253 0.37836,-0.4510952 0.58172,-0.6689796 0.08615,-0.092302 0.207126,-0.1780339 0.301414,-0.2723288"
       id="path865" />
    <path
       style="fill:none;stroke:#ffffff;stroke-width:0.264583px;stroke-linecap:butt;stroke-linejoin:miter;stroke-opacity:1"
       d="M 8.6529602,13.141416 C 8.217745,12.796633 7.7917486,12.386601 7.2824366,12.147861 6.8637615,11.951608 6.4982092,11.907439 6.0608217,11.827914 5.942831,11.806461 5.8300815,11.760371 5.7117879,11.740655 c -0.05738,-0.0096 -0.1171348,0.0096 -0.1745149,0 C 5.3719399,11.7131 5.2094426,11.463137 5.0553659,11.617213 4.685897,11.986682 4.4768907,12.543097 4.1827833,12.984259 c -0.1578792,0.236819 -0.304746,0.376003 -0.4653767,0.639895 -0.077563,0.12604 -0.1551262,0.252079 -0.2326891,0.378118 -0.038782,0.05817 -0.079291,0.11523 -0.1163447,0.174517 -0.016251,0.026 -0.0087,0.06436 -0.029084,0.08726 -0.03654,0.04106 -0.3537714,-0.184344 -0.3927975,-0.198979 -0.1781148,-0.06679 -0.4880927,-0.186105 -0.6980658,-0.203603 -0.1285912,-0.01072 -0.3069771,0.02586 -0.4362904,0 -0.2868712,-0.05737 -0.3998862,-0.232689 -0.6397219,-0.232689"
       id="path869" />
    <path
       style="fill:none;stroke:#ffffff;stroke-width:0.264583px;stroke-linecap:butt;stroke-linejoin:miter;stroke-opacity:1"
       d="m 13.949086,14.277467 c -0.664681,0.505432 -0.198765,0.140318 -0.966329,0.779955 -0.05822,0.04852 -0.53476,0.438693 -0.61081,0.494463 -0.05383,0.03948 -0.256704,0.107552 -0.290859,0.174517 -0.04099,0.08037 0.07585,0.280187 0.09046,0.324019 0.199213,0.597643 0.288343,1.044241 0.727154,1.541563 0.09601,0.108813 0.698055,0.577909 0.605514,0.782571 -0.06664,0.147384 -0.853407,0.651564 -1.003538,0.801695"
       id="path885" />
    <path
       style="fill:none;stroke:#ffffff;stroke-width:0.264583px;stroke-linecap:butt;stroke-linejoin:miter;stroke-opacity:1"
       d="m 14.885172,1.6811744 c 0.292823,-0.151989 0.615291,-0.226144 0.93543,-0.2947452 0.319353,-0.068433 0.688769,-0.029086 1.010133,-0.029086 0.04707,0 0.202526,-0.030504 0.23269,0.028976 0.03117,0.061473 -0.02572,0.1671613 0,0.231469 0.01298,0.032457 0.04711,0.054096 0.05817,0.087259 0.08411,0.2523487 -0.318126,0.879338 -0.436291,1.1048309 -0.06753,0.1288756 0.04207,0.3299135 0.08726,0.4428823 0.0072,0.017971 -0.0085,0.040693 0,0.058065 0.0092,0.018756 0.0762,0.032455 0.05559,0.028991 -0.03102,-0.00521 -0.06248,-0.00746 -0.09372,-0.011194"
       id="path921" />
  </g>
</svg>
