[gd_scene load_steps=3 format=2]

[ext_resource path="res://levels/BaseLevel.tscn" type="PackedScene" id=1]
[ext_resource path="res://levels/TestLevel.gd" type="Script" id=2]

[node name="TestLevel" instance=ExtResource( 1 )]
script = ExtResource( 2 )
