[
  {
    "id": "apply",
    "http-methods": [
      "POST"
    ],
    "include-command-output-in-response": true,
    "include-command-output-in-response-on-error": true,
    "pass-arguments-to-command": [
      {
        "source": "string",
        "name": "apply"
      },
      {
        "source": "entire-payload"
      }
    ]
  },
  {
    "id": "destroy",
    "http-methods": [
      "DELETE"
    ],
    "include-command-output-in-response": true,
    "include-command-output-in-response-on-error": true,
    "pass-arguments-to-command": [
      {
        "source": "string",
        "name": "destroy"
      },
      {
        "source": "entire-payload"
      }
    ]
  }
]