<?xml version="1.0" encoding="UTF-8" standalone="no"?>
<svg
   xmlns:dc="http://purl.org/dc/elements/1.1/"
   xmlns:cc="http://creativecommons.org/ns#"
   xmlns:rdf="http://www.w3.org/1999/02/22-rdf-syntax-ns#"
   xmlns:svg="http://www.w3.org/2000/svg"
   xmlns="http://www.w3.org/2000/svg"
   id="svg8"
   version="1.1"
   viewBox="0 0 66.145832 66.145835"
   height="250"
   width="250">
  <defs
     id="defs2" />
  <metadata
     id="metadata5">
    <rdf:RDF>
      <cc:Work
         rdf:about="">
        <dc:format>image/svg+xml</dc:format>
        <dc:type
           rdf:resource="http://purl.org/dc/dcmitype/StillImage" />
        <dc:title></dc:title>
      </cc:Work>
    </rdf:RDF>
  </metadata>
  <g
     transform="translate(0,-230.85415)"
     id="layer1">
    <g
       transform="matrix(0.92405822,0,0,0.96354237,-5.161245,18.331138)"
       id="g896">
      <path
         id="path900"
         d="m 17.529221,274.58134 c -6.241839,-0.37123 -9.6807989,-0.97069 -9.975582,-1.73888 -0.227103,-0.59182 0.7194854,-2.3347 2.4001262,-4.41916 6.8195918,-8.45818 24.9244818,-25.82744 29.4617688,-28.26468 l 1.116518,-0.59975 1.081389,1.05365 c 4.170968,4.06401 15.542672,25.97512 16.054464,30.93391 0.129246,1.25227 0.0813,1.45248 -0.410946,1.71592 -0.863698,0.46224 -5.276418,1.03808 -10.226696,1.33454 -5.167545,0.30948 -24.204831,0.29944 -29.501042,-0.0155 z"
         style="fill:#502994;stroke-width:0.26458332" />
      <path
         id="path898"
         d="m 21.894846,274.35111 c -8.16138,-0.32714 -13.5148294,-0.99871 -13.7956928,-1.73063 -0.2107208,-0.54913 0.556437,-1.79227 2.6489978,-4.29257 2.028835,-2.42415 5.24336,-5.62736 5.647243,-5.62736 0.12919,0 7.848792,-1.42606 17.154671,-3.16904 15.803541,-2.95996 16.942491,-3.13888 17.263996,-2.71197 0.689544,0.91559 4.073311,7.81438 4.963785,10.12011 1.378138,3.56846 1.787808,5.31495 1.349518,5.75324 -0.498989,0.49899 -3.862756,1.03541 -8.509601,1.35703 -5.577779,0.38606 -20.429556,0.55345 -26.722917,0.30119 z"
         style="fill:#0b095a;fill-opacity:1;stroke-width:0.26458332" />
    </g>
    <path
       id="rect923"
       d="m 35.878146,247.23698 c -1.417459,-1.07563 5.263559,-3.62736 6.249566,-1.97684 3.368158,12.36989 9.463695,23.83517 15.676085,35.66981 1.054667,1.30574 -4.880421,1.63873 -4.836238,0.31848 -3.425707,-13.59135 -9.442406,-22.37077 -17.089413,-34.01145 z"
       style="fill:#502994;fill-opacity:1;stroke:none;stroke-width:0.78682786;stroke-miterlimit:1.40999997;stroke-dasharray:none;stroke-opacity:1" />
    <path
       id="rect923-3"
       d="m 57.172035,280.76526 c 1.054667,1.30574 -3.774837,1.58384 -3.756978,0.18124 -1.645587,-6.34351 -3.635351,-11.22164 -6.632516,-16.62423 -0.423429,-0.5752 1.798139,-1.12151 2.128778,-0.27147 0,0 3.748009,8.14601 8.260716,16.71446 z"
       style="fill:#1e0768;fill-opacity:1;stroke:none;stroke-width:0.78682786;stroke-miterlimit:1.40999997;stroke-dasharray:none;stroke-opacity:1" />
    <g
       transform="translate(3.96232,3.7538928)"
       id="g1043">
      <path
         style="fill:#502994;fill-opacity:1;stroke:none;stroke-width:0.80000001;stroke-miterlimit:1.40999997;stroke-dasharray:none;stroke-opacity:1"
         d="m 60.395589,255.32059 a 2.6067932,2.6067932 0 0 1 -2.606794,2.60679 2.6067932,2.6067932 0 0 1 -2.606793,-2.60679 2.6067932,2.6067932 0 0 1 2.606793,-2.6068 2.6067932,2.6067932 0 0 1 2.606794,2.6068 z"
         id="path971" />
      <path
         style="fill:#1e0768;fill-opacity:1;stroke:none;stroke-width:1.24547732;stroke-miterlimit:1.40999997;stroke-dasharray:none;stroke-opacity:1"
         d="m 60.090007,255.45918 c 0,1.00736 -0.896253,2.13153 -2.110229,2.13153 -1.213976,0 -2.058971,-0.59695 -1.993068,-1.03317 0.81631,0.33346 4.104913,-2.18654 4.103297,-1.09836 z"
         id="path1004" />
    </g>
    <g
       transform="translate(3.96232,9.0455598)"
       id="g1039">
      <path
         style="fill:#502994;fill-opacity:1;stroke:none;stroke-width:0.80000001;stroke-miterlimit:1.40999997;stroke-dasharray:none;stroke-opacity:1"
         d="m 60.395589,263.35647 a 2.6067932,2.6067932 0 0 1 -2.606795,2.60679 2.6067932,2.6067932 0 0 1 -2.606793,-2.60679 2.6067932,2.6067932 0 0 1 2.606793,-2.6068 2.6067932,2.6067932 0 0 1 2.606795,2.6068 z"
         id="path971-1" />
      <path
         style="fill:#1e0768;fill-opacity:1;stroke:none;stroke-width:0.71101594;stroke-miterlimit:1.40999997;stroke-dasharray:none;stroke-opacity:1"
         d="m 60.105636,263.35647 a 2.3168396,2.3168396 0 0 1 -2.316841,2.31683 2.3168396,2.3168396 0 0 1 -2.31684,-2.31683 2.3168396,2.3168396 0 0 1 2.31684,-2.31684 2.3168396,2.3168396 0 0 1 2.316841,2.31684 z"
         id="path971-9" />
    </g>
  </g>
</svg>
