<?xml version="1.0" encoding="UTF-8"?>
<svg xmlns="http://www.w3.org/2000/svg" width="800.000" height="600.000" viewBox="0.0 0.0 800.000 600.000" version="1.1">
  <title>Produce by Acme CAD Converter</title>
  <desc>Produce by Acme CAD Converter</desc>
<path d="M400 497.22L399.81 484.83M399.81 484.83L399.22 472.46M399.22 472.46L398.25 460.1M398.25 460.1L396.89 447.79M396.89 447.79L395.14 435.52M395.14 435.52L393.01 423.31M393.01 423.31L390.5 411.18M390.5 411.18L387.61 399.13M387.61 399.13L384.34 387.18M384.34 387.18L380.69 375.33M380.69 375.33L376.68 363.61M376.68 363.61L372.3 352.02M372.3 352.02L367.56 340.57M367.56 340.57L362.46 329.28M362.46 329.28L357.01 318.15M357.01 318.15L351.21 307.2M351.21 307.2L345.07 296.43M345.07 296.43L338.6 285.87M338.6 285.87L331.79 275.51M331.79 275.51L324.67 265.37M324.67 265.37L317.23 255.46M317.23 255.46L309.48 245.79M309.48 245.79L301.43 236.37M301.43 236.37L293.09 227.21M293.09 227.21L284.47 218.31M284.47 218.31L275.57 209.68M275.57 209.68L266.4 201.34M266.4 201.34L256.98 193.3M256.98 193.3L247.31 185.55M247.31 185.55L237.4 178.11M237.4 178.11L227.26 170.98M227.26 170.98L216.91 164.18M216.91 164.18L206.34 157.71M206.34 157.71L195.58 151.57M195.58 151.57L184.63 145.77M184.63 145.77L173.5 140.32M173.5 140.32L162.21 135.22M162.21 135.22L150.76 130.47M150.76 130.47L139.17 126.09M139.17 126.09L127.44 122.08M127.44 122.08L115.6 118.44M115.6 118.44L103.65 115.17M103.65 115.17L91.6 112.27M91.6 112.27L79.46 109.76M79.46 109.76L67.26 107.63M67.26 107.63L54.99 105.89M54.99 105.89L42.67 104.53M42.67 104.53L30.32 103.55M30.32 103.55L17.94 102.97M17.94 102.97L5.55 102.78"
fill="none" stroke="black" stroke-width="0.5"/>
<path d="M794.45 102.78L782.06 102.97M782.06 102.97L769.68 103.55M769.68 103.55L757.33 104.53M757.33 104.53L745.01 105.89M745.01 105.89L732.74 107.63M732.74 107.63L720.54 109.76M720.54 109.76L708.4 112.27M708.4 112.27L696.35 115.17M696.35 115.17L684.4 118.44M684.4 118.44L672.56 122.08M672.56 122.08L660.83 126.09M660.83 126.09L649.24 130.47M649.24 130.47L637.79 135.22M637.79 135.22L626.5 140.32M626.5 140.32L615.37 145.77M615.37 145.77L604.42 151.57M604.42 151.57L593.66 157.71M593.66 157.71L583.09 164.18M583.09 164.18L572.74 170.98M572.74 170.98L562.6 178.11M562.6 178.11L552.69 185.55M552.69 185.55L543.02 193.3M543.02 193.3L533.6 201.34M533.6 201.34L524.43 209.68M524.43 209.68L515.53 218.31M515.53 218.31L506.91 227.21M506.91 227.21L498.57 236.37M498.57 236.37L490.52 245.79M490.52 245.79L482.77 255.46M482.77 255.46L475.33 265.37M475.33 265.37L468.21 275.51M468.21 275.51L461.4 285.87M461.4 285.87L454.93 296.43M454.93 296.43L448.79 307.2M448.79 307.2L442.99 318.15M442.99 318.15L437.54 329.28M437.54 329.28L432.44 340.57M432.44 340.57L427.7 352.02M427.7 352.02L423.32 363.61M423.32 363.61L419.31 375.33M419.31 375.33L415.66 387.18M415.66 387.18L412.39 399.13M412.39 399.13L409.5 411.18M409.5 411.18L406.99 423.31M406.99 423.31L404.86 435.52M404.86 435.52L403.11 447.79M403.11 447.79L401.75 460.1M401.75 460.1L400.78 472.46M400.78 472.46L400.19 484.83M400.19 484.83L400 497.22"
fill="none" stroke="black" stroke-width="0.5"/>
<path d="M794.45 102.78L794.45 497.22"
fill="none" stroke="black" stroke-width="0.5"/>
<path d="M8.84 497.22L2.26 497.22 2.26 102.78 8.84 102.78 8.84 497.22Z"
fill-rule="evenodd" fill="black"/>
<path d="M797.74 497.22L791.16 497.22 791.16 102.78 797.74 102.78 797.74 497.22Z"
fill-rule="evenodd" fill="black"/>
</svg>
