<?xml version="1.0" encoding="UTF-8"?>
<svg xmlns="http://www.w3.org/2000/svg" width="800.000" height="600.000" viewBox="0.0 0.0 800.000 600.000" version="1.1">
  <title>Produce by Acme CAD Converter</title>
  <desc>Produce by Acme CAD Converter</desc>
<path d="M404.4 429.87L708.18 429.87 404.4 388.46 404.4 429.87Z"
fill-rule="evenodd" fill="gray"/>
<path d="M708.18 429.87L708.18 388.46 404.4 388.46 708.18 429.87Z"
fill-rule="evenodd" fill="gray"/>
<path d="M404.4 211.54L708.18 211.54 404.4 170.13 404.4 211.54Z"
fill-rule="evenodd" fill="gray"/>
<path d="M708.18 211.54L708.18 170.13 404.4 170.13 708.18 211.54Z"
fill-rule="evenodd" fill="gray"/>
<path d="M708.18 211.54L404.4 211.54M404.4 211.54L404.4 170.13M404.4 170.13L708.18 170.13M708.18 170.13L708.18 211.54"
fill="none" stroke="black" stroke-width="0.5"/>
<path d="M405.95 211.54L405.95 170.13"
fill="none" stroke="black" stroke-width="0.5"/>
<path d="M405.1 211.54L405.1 170.13"
fill="none" stroke="black" stroke-width="0.5"/>
<path d="M407.3 211.54L407.3 170.13"
fill="none" stroke="black" stroke-width="0.5"/>
<path d="M408.39 211.54L408.39 170.13"
fill="none" stroke="black" stroke-width="0.5"/>
<path d="M410.78 211.54L410.78 170.13"
fill="none" stroke="black" stroke-width="0.5"/>
<path d="M412.55 211.54L412.55 170.13"
fill="none" stroke="black" stroke-width="0.5"/>
<path d="M416.69 211.54L416.69 170.13"
fill="none" stroke="black" stroke-width="0.5"/>
<path d="M420.82 211.54L420.82 170.13"
fill="none" stroke="black" stroke-width="0.5"/>
<path d="M426.4 211.54L426.4 170.13"
fill="none" stroke="black" stroke-width="0.5"/>
<path d="M433.56 211.54L433.56 170.13"
fill="none" stroke="black" stroke-width="0.5"/>
<path d="M441.78 211.54L441.78 170.13"
fill="none" stroke="black" stroke-width="0.5"/>
<path d="M450.34 211.54L450.34 170.13"
fill="none" stroke="black" stroke-width="0.5"/>
<path d="M458.57 211.54L458.57 170.13"
fill="none" stroke="black" stroke-width="0.5"/>
<path d="M466.62 211.54L466.62 170.13"
fill="none" stroke="black" stroke-width="0.5"/>
<path d="M475.02 211.54L475.02 170.13"
fill="none" stroke="black" stroke-width="0.5"/>
<path d="M482.99 211.54L482.99 170.13"
fill="none" stroke="black" stroke-width="0.5"/>
<path d="M490.91 211.54L490.91 170.13"
fill="none" stroke="black" stroke-width="0.5"/>
<path d="M499.13 211.54L499.13 170.13"
fill="none" stroke="black" stroke-width="0.5"/>
<path d="M507.53 211.54L507.53 170.13"
fill="none" stroke="black" stroke-width="0.5"/>
<path d="M515.5 211.54L515.5 170.13"
fill="none" stroke="black" stroke-width="0.5"/>
<path d="M523.39 211.54L523.39 170.13"
fill="none" stroke="black" stroke-width="0.5"/>
<path d="M531.47 211.54L531.47 170.13"
fill="none" stroke="black" stroke-width="0.5"/>
<path d="M539.86 211.54L539.86 170.13"
fill="none" stroke="black" stroke-width="0.5"/>
<path d="M548.34 211.54L548.34 170.13"
fill="none" stroke="black" stroke-width="0.5"/>
<path d="M556.82 211.54L556.82 170.13"
fill="none" stroke="black" stroke-width="0.5"/>
<path d="M564.79 211.54L564.79 170.13"
fill="none" stroke="black" stroke-width="0.5"/>
<path d="M573.1 211.54L573.1 170.13"
fill="none" stroke="black" stroke-width="0.5"/>
<path d="M580.84 211.54L580.84 170.13"
fill="none" stroke="black" stroke-width="0.5"/>
<path d="M589.24 211.54L589.24 170.13"
fill="none" stroke="black" stroke-width="0.5"/>
<path d="M597.63 211.54L597.63 170.13"
fill="none" stroke="black" stroke-width="0.5"/>
<path d="M605.6 211.54L605.6 170.13"
fill="none" stroke="black" stroke-width="0.5"/>
<path d="M613.91 211.54L613.91 170.13"
fill="none" stroke="black" stroke-width="0.5"/>
<path d="M621.89 211.54L621.89 170.13"
fill="none" stroke="black" stroke-width="0.5"/>
<path d="M629.94 211.54L629.94 170.13"
fill="none" stroke="black" stroke-width="0.5"/>
<path d="M638.09 211.54L638.09 170.13"
fill="none" stroke="black" stroke-width="0.5"/>
<path d="M646.5 211.54L646.5 170.13"
fill="none" stroke="black" stroke-width="0.5"/>
<path d="M654.52 211.54L654.52 170.13"
fill="none" stroke="black" stroke-width="0.5"/>
<path d="M663.27 211.54L663.27 170.13"
fill="none" stroke="black" stroke-width="0.5"/>
<path d="M671.18 211.54L671.18 170.13"
fill="none" stroke="black" stroke-width="0.5"/>
<path d="M679.94 211.54L679.94 170.13"
fill="none" stroke="black" stroke-width="0.5"/>
<path d="M686.05 211.54L686.05 170.13"
fill="none" stroke="black" stroke-width="0.5"/>
<path d="M692.06 211.54L692.06 170.13"
fill="none" stroke="black" stroke-width="0.5"/>
<path d="M696.07 211.54L696.07 170.13"
fill="none" stroke="black" stroke-width="0.5"/>
<path d="M699.76 211.54L699.76 170.13"
fill="none" stroke="black" stroke-width="0.5"/>
<path d="M702.19 211.54L702.19 170.13"
fill="none" stroke="black" stroke-width="0.5"/>
<path d="M704.14 211.54L704.14 170.13"
fill="none" stroke="black" stroke-width="0.5"/>
<path d="M705.23 211.54L705.23 170.13"
fill="none" stroke="black" stroke-width="0.5"/>
<path d="M706.62 211.54L706.62 170.13"
fill="none" stroke="black" stroke-width="0.5"/>
<path d="M707.35 211.54L707.35 170.13"
fill="none" stroke="black" stroke-width="0.5"/>
<path d="M405.95 429.87L405.95 388.46"
fill="none" stroke="black" stroke-width="0.5"/>
<path d="M405.1 429.87L405.1 388.46"
fill="none" stroke="black" stroke-width="0.5"/>
<path d="M407.3 429.87L407.3 388.46"
fill="none" stroke="black" stroke-width="0.5"/>
<path d="M408.39 429.87L408.39 388.46"
fill="none" stroke="black" stroke-width="0.5"/>
<path d="M410.78 429.87L410.78 388.46"
fill="none" stroke="black" stroke-width="0.5"/>
<path d="M412.55 429.87L412.55 388.46"
fill="none" stroke="black" stroke-width="0.5"/>
<path d="M416.69 429.87L416.69 388.46"
fill="none" stroke="black" stroke-width="0.5"/>
<path d="M420.82 429.87L420.82 388.46"
fill="none" stroke="black" stroke-width="0.5"/>
<path d="M426.4 429.87L426.4 388.46"
fill="none" stroke="black" stroke-width="0.5"/>
<path d="M433.56 429.87L433.56 388.46"
fill="none" stroke="black" stroke-width="0.5"/>
<path d="M441.78 429.87L441.78 388.46"
fill="none" stroke="black" stroke-width="0.5"/>
<path d="M450.34 429.87L450.34 388.46"
fill="none" stroke="black" stroke-width="0.5"/>
<path d="M458.57 429.87L458.57 388.46"
fill="none" stroke="black" stroke-width="0.5"/>
<path d="M466.62 429.87L466.62 388.46"
fill="none" stroke="black" stroke-width="0.5"/>
<path d="M475.02 429.87L475.02 388.46"
fill="none" stroke="black" stroke-width="0.5"/>
<path d="M482.99 429.87L482.99 388.46"
fill="none" stroke="black" stroke-width="0.5"/>
<path d="M490.91 429.87L490.91 388.46"
fill="none" stroke="black" stroke-width="0.5"/>
<path d="M499.13 429.87L499.13 388.46"
fill="none" stroke="black" stroke-width="0.5"/>
<path d="M507.53 429.87L507.53 388.46"
fill="none" stroke="black" stroke-width="0.5"/>
<path d="M515.5 429.87L515.5 388.46"
fill="none" stroke="black" stroke-width="0.5"/>
<path d="M523.39 429.87L523.39 388.46"
fill="none" stroke="black" stroke-width="0.5"/>
<path d="M531.47 429.87L531.47 388.46"
fill="none" stroke="black" stroke-width="0.5"/>
<path d="M539.86 429.87L539.86 388.46"
fill="none" stroke="black" stroke-width="0.5"/>
<path d="M548.34 429.87L548.34 388.46"
fill="none" stroke="black" stroke-width="0.5"/>
<path d="M556.82 429.87L556.82 388.46"
fill="none" stroke="black" stroke-width="0.5"/>
<path d="M564.79 429.87L564.79 388.46"
fill="none" stroke="black" stroke-width="0.5"/>
<path d="M573.1 429.87L573.1 388.46"
fill="none" stroke="black" stroke-width="0.5"/>
<path d="M580.84 429.87L580.84 388.46"
fill="none" stroke="black" stroke-width="0.5"/>
<path d="M589.24 429.87L589.24 388.46"
fill="none" stroke="black" stroke-width="0.5"/>
<path d="M597.63 429.87L597.63 388.46"
fill="none" stroke="black" stroke-width="0.5"/>
<path d="M605.6 429.87L605.6 388.46"
fill="none" stroke="black" stroke-width="0.5"/>
<path d="M613.91 429.87L613.91 388.46"
fill="none" stroke="black" stroke-width="0.5"/>
<path d="M621.89 429.87L621.89 388.46"
fill="none" stroke="black" stroke-width="0.5"/>
<path d="M629.94 429.87L629.94 388.46"
fill="none" stroke="black" stroke-width="0.5"/>
<path d="M638.09 429.87L638.09 388.46"
fill="none" stroke="black" stroke-width="0.5"/>
<path d="M646.5 429.87L646.5 388.46"
fill="none" stroke="black" stroke-width="0.5"/>
<path d="M654.52 429.87L654.52 388.46"
fill="none" stroke="black" stroke-width="0.5"/>
<path d="M663.27 429.87L663.27 388.46"
fill="none" stroke="black" stroke-width="0.5"/>
<path d="M671.18 429.87L671.18 388.46"
fill="none" stroke="black" stroke-width="0.5"/>
<path d="M679.94 429.87L679.94 388.46"
fill="none" stroke="black" stroke-width="0.5"/>
<path d="M686.05 429.87L686.05 388.46"
fill="none" stroke="black" stroke-width="0.5"/>
<path d="M692.06 429.87L692.06 388.46"
fill="none" stroke="black" stroke-width="0.5"/>
<path d="M696.07 429.87L696.07 388.46"
fill="none" stroke="black" stroke-width="0.5"/>
<path d="M699.76 429.87L699.76 388.46"
fill="none" stroke="black" stroke-width="0.5"/>
<path d="M702.19 429.87L702.19 388.46"
fill="none" stroke="black" stroke-width="0.5"/>
<path d="M704.14 429.87L704.14 388.46"
fill="none" stroke="black" stroke-width="0.5"/>
<path d="M705.23 429.87L705.23 388.46"
fill="none" stroke="black" stroke-width="0.5"/>
<path d="M706.62 429.87L706.62 388.46"
fill="none" stroke="black" stroke-width="0.5"/>
<path d="M707.35 429.87L707.35 388.46"
fill="none" stroke="black" stroke-width="0.5"/>
<path d="M493.82 294.74L495.2 295.04M495.2 295.04L496.46 295.7M496.46 295.7L497.49 296.67M497.49 296.67L498.22 297.88M498.22 297.88L498.61 299.24M498.61 299.24L498.61 300.66M498.61 300.66L498.24 302.03M498.24 302.03L497.51 303.24M497.51 303.24L496.48 304.22M496.48 304.22L495.23 304.88M495.23 304.88L404.62 325.65M404.62 325.65L259.12 335.03M259.12 335.03L200.06 335.03M200.06 335.03L28.68 327.7M28.68 327.7L2.26 306.23M2.26 306.23L25.29 287M25.29 287L200.22 271.56M200.22 271.56L259.12 271.49M259.12 271.49L404.15 276.75M404.15 276.75L493.82 294.74"
fill="none" stroke="black" stroke-width="0.5"/>
<path d="M483.76 298.41L403.57 281.59"
fill="none" stroke="black" stroke-width="0.5"/>
<path d="M484.16 302.08L404.02 320.7"
fill="none" stroke="black" stroke-width="0.5"/>
<path d="M404.29 318.89L404.12 283.51"
fill="none" stroke="black" stroke-width="0.5"/>
<path d="M413.44 285.49L413.86 316.63"
fill="none" stroke="black" stroke-width="0.5"/>
<path d="M405.84 284.14L412.23 296.59"
fill="none" stroke="black" stroke-width="0.5"/>
<path d="M412.59 304.9L406.63 317.95"
fill="none" stroke="black" stroke-width="0.5"/>
<path d="M419.34 286.04L447.55 309.2"
fill="none" stroke="black" stroke-width="0.5"/>
<path d="M439.23 290.11L439.37 311.28"
fill="none" stroke="black" stroke-width="0.5"/>
<path d="M450.98 292.36L450.9 308.57"
fill="none" stroke="black" stroke-width="0.5"/>
<path d="M474.81 297.24L459.75 306.99"
fill="none" stroke="black" stroke-width="0.5"/>
<path d="M479.72 298.29L479.58 302.57"
fill="none" stroke="black" stroke-width="0.5"/>
<path d="M381.42 282.92L381.81 319.14"
fill="none" stroke="black" stroke-width="0.5"/>
<path d="M378.59 318.83L349.5 282.76"
fill="none" stroke="black" stroke-width="0.5"/>
<path d="M397.05 282.23L259.39 277.6"
fill="none" stroke="black" stroke-width="0.5"/>
<path d="M396.64 320.28L259.39 329.34"
fill="none" stroke="black" stroke-width="0.5"/>
<path d="M272.77 326.09L272.2 280.53"
fill="none" stroke="black" stroke-width="0.5"/>
<path d="M274.96 279.97L307.26 324.38"
fill="none" stroke="black" stroke-width="0.5"/>
<path d="M312.38 323.94L343.25 282.07"
fill="none" stroke="black" stroke-width="0.5"/>
<path d="M25.29 287L2.26 306.23"
fill="none" stroke="black" stroke-width="0.5"/>
<path d="M28.68 327.7L2.26 306.23"
fill="none" stroke="black" stroke-width="0.5"/>
<path d="M199.99 279.22L31.06 287.82M31.06 287.82L31.79 325.67M31.79 325.67L200.43 328.86"
fill="none" stroke="black" stroke-width="0.5"/>
<path d="M196.04 327.37L195.72 279.09"
fill="none" stroke="black" stroke-width="0.5"/>
<path d="M189.8 327.16L161.42 282.38"
fill="none" stroke="black" stroke-width="0.5"/>
<path d="M159.83 282.47L126.98 326.5"
fill="none" stroke="black" stroke-width="0.5"/>
<path d="M125.46 326.14L93.69 285.4"
fill="none" stroke="black" stroke-width="0.5"/>
<path d="M92.35 286.04L66.97 324.8"
fill="none" stroke="black" stroke-width="0.5"/>
<path d="M65.78 324.68L32.21 288.65"
fill="none" stroke="black" stroke-width="0.5"/>
<path d="M618.23 211.54L596.43 231.79"
fill="none" stroke="black" stroke-width="0.5"/>
<path d="M596.43 211.54L516.31 211.54M516.31 211.54L516.31 259.17M516.31 259.17L596.43 259.17M596.43 259.17L596.43 211.54"
fill="none" stroke="black" stroke-width="0.5"/>
<path d="M610.08 211.54L596.43 224.08"
fill="none" stroke="black" stroke-width="0.5"/>
<path d="M494.5 211.54L516.31 231.79"
fill="none" stroke="black" stroke-width="0.5"/>
<path d="M502.66 211.54L516.31 224.08"
fill="none" stroke="black" stroke-width="0.5"/>
<path d="M567.12 213.42L545.67 213.42M545.67 213.42L545.67 234.86M545.67 234.86L567.12 234.86M567.12 234.86L567.12 213.42"
fill="none" stroke="black" stroke-width="0.5"/>
<path d="M522.3 234.86L590.37 234.86M590.37 234.86L590.37 256.77M590.37 256.77L522.3 256.77M522.3 256.77L522.3 234.86"
fill="none" stroke="black" stroke-width="0.5"/>
<path d="M618.23 388.53L596.43 368.27"
fill="none" stroke="black" stroke-width="0.5"/>
<path d="M596.43 388.53L516.31 388.53M516.31 388.53L516.31 340.9M516.31 340.9L596.43 340.9M596.43 340.9L596.43 388.53"
fill="none" stroke="black" stroke-width="0.5"/>
<path d="M610.08 388.53L596.43 375.98"
fill="none" stroke="black" stroke-width="0.5"/>
<path d="M494.5 388.53L516.31 368.27"
fill="none" stroke="black" stroke-width="0.5"/>
<path d="M502.66 388.53L516.31 375.98"
fill="none" stroke="black" stroke-width="0.5"/>
<path d="M567.12 386.65L545.67 386.65M545.67 386.65L545.67 365.21M545.67 365.21L567.12 365.21M567.12 365.21L567.12 386.65"
fill="none" stroke="black" stroke-width="0.5"/>
<path d="M522.3 365.21L590.37 365.21M590.37 365.21L590.37 343.29M590.37 343.29L522.3 343.29M522.3 343.29L522.3 365.21"
fill="none" stroke="black" stroke-width="0.5"/>
<path d="M556.23 284.72L556.23 315.35"
fill="none" stroke="RGB(255,223,127)" stroke-width="0.5"/>
<path d="M573.39 300.03L539.08 300.03"
fill="none" stroke="RGB(255,223,127)" stroke-width="0.5"/>
<path d="M595.24 300.03L595.22 298.79M595.22 298.79L595.16 297.55M595.16 297.55L595.06 296.31M595.06 296.31L594.92 295.07M594.92 295.07L594.74 293.84M594.74 293.84L594.53 292.61M594.53 292.61L594.27 291.4M594.27 291.4L593.98 290.19M593.98 290.19L593.64 288.99M593.64 288.99L593.27 287.8M593.27 287.8L592.86 286.63M592.86 286.63L592.42 285.47M592.42 285.47L591.93 284.32M591.93 284.32L591.41 283.19M591.41 283.19L590.86 282.08M590.86 282.08L590.27 280.98M590.27 280.98L589.64 279.91M589.64 279.91L588.98 278.85M588.98 278.85L588.29 277.82M588.29 277.82L587.57 276.81M587.57 276.81L586.81 275.82M586.81 275.82L586.02 274.86M586.02 274.86L585.21 273.92M585.21 273.92L584.36 273.01M584.36 273.01L583.48 272.13M583.48 272.13L582.58 271.27M582.58 271.27L581.65 270.45M581.65 270.45L580.69 269.65M580.69 269.65L579.71 268.89M579.71 268.89L578.7 268.15M578.7 268.15L577.68 267.45M577.68 267.45L576.63 266.78M576.63 266.78L575.56 266.15M575.56 266.15L574.47 265.55M574.47 265.55L573.36 264.99M573.36 264.99L572.23 264.46M572.23 264.46L571.09 263.97M571.09 263.97L569.93 263.51M569.93 263.51L568.76 263.1M568.76 263.1L567.57 262.71M567.57 262.71L566.38 262.37M566.38 262.37L565.17 262.07M565.17 262.07L563.96 261.8M563.96 261.8L562.73 261.57M562.73 261.57L561.5 261.39M561.5 261.39L560.27 261.24M560.27 261.24L559.03 261.13M559.03 261.13L557.79 261.06M557.79 261.06L556.55 261.03M556.55 261.03L555.3 261.04M555.3 261.04L554.06 261.09M554.06 261.09L552.82 261.18M552.82 261.18L551.58 261.31M551.58 261.31L550.35 261.48M550.35 261.48L549.12 261.68M549.12 261.68L547.9 261.93M547.9 261.93L546.69 262.21M546.69 262.21L545.49 262.54M545.49 262.54L544.3 262.9M544.3 262.9L543.12 263.3M543.12 263.3L541.96 263.74M541.96 263.74L540.81 264.21M540.81 264.21L539.67 264.72M539.67 264.72L538.55 265.27M538.55 265.27L537.45 265.85M537.45 265.85L536.73 266.26M517.24 300.03L517.24 300.65M517.24 300.65L517.28 301.9M517.28 301.9L517.35 303.14M517.35 303.14L517.47 304.38M517.47 304.38L517.63 305.61M517.63 305.61L517.83 306.84M517.83 306.84L518.07 308.06M518.07 308.06L518.34 309.27M518.34 309.27L518.66 310.48M518.66 310.48L519.01 311.67M519.01 311.67L519.4 312.85M519.4 312.85L519.82 314.02M519.82 314.02L520.29 315.17M520.29 315.17L520.79 316.31M520.79 316.31L521.33 317.43M521.33 317.43L521.9 318.54M521.9 318.54L522.51 319.62M522.51 319.62L523.15 320.69M523.15 320.69L523.83 321.73M523.83 321.73L524.53 322.76M524.53 322.76L525.27 323.76M525.27 323.76L526.05 324.73M526.05 324.73L526.85 325.68M526.85 325.68L527.68 326.61M527.68 326.61L528.54 327.5M528.54 327.5L529.43 328.37M529.43 328.37L530.35 329.21M530.35 329.21L531.3 330.02M531.3 330.02L532.26 330.8M532.26 330.8L533.26 331.55M533.26 331.55L534.27 332.27M534.27 332.27L535.31 332.95M535.31 332.95L536.37 333.6M536.37 333.6L537.45 334.22M537.45 334.22L538.55 334.8M538.55 334.8L539.67 335.35M539.67 335.35L540.81 335.86M540.81 335.86L541.96 336.33M541.96 336.33L543.12 336.77M543.12 336.77L544.3 337.17M544.3 337.17L545.49 337.53M545.49 337.53L546.69 337.85M546.69 337.85L547.9 338.14M547.9 338.14L549.12 338.38M549.12 338.38L550.35 338.59M550.35 338.59L551.58 338.76M551.58 338.76L552.82 338.89M552.82 338.89L554.06 338.98M554.06 338.98L555.3 339.03M555.3 339.03L556.55 339.04M556.55 339.04L557.79 339.01M557.79 339.01L559.03 338.94M559.03 338.94L560.27 338.83M560.27 338.83L561.5 338.68M561.5 338.68L562.73 338.49M562.73 338.49L563.96 338.26M563.96 338.26L565.17 338M565.17 338L566.38 337.69M566.38 337.69L567.57 337.35M567.57 337.35L568.76 336.97M568.76 336.97L569.93 336.55M569.93 336.55L571.09 336.1M571.09 336.1L572.23 335.61M572.23 335.61L573.36 335.08M573.36 335.08L574.47 334.51M574.47 334.51L575.56 333.91M575.56 333.91L575.73 333.81"
fill="none" stroke="black" stroke-width="0.5"/>
<path d="M630.76 320.78L528.73 320.78M528.73 320.78L528.73 279.54M528.73 279.54L630.76 279.54M630.76 279.54L630.76 320.78"
fill="none" stroke="black" stroke-width="0.5"/>
<path d="M635.03 320.78L692.27 320.78M692.27 320.78L692.27 279.54M692.27 279.54L635.03 279.54M635.03 279.54L635.03 320.78"
fill="none" stroke="black" stroke-width="0.5"/>
<path d="M699.05 320.92L732.68 320.92M732.68 320.92L732.68 279.26M732.68 279.26L699.05 279.26M699.05 279.26L699.05 320.92"
fill="none" stroke="black" stroke-width="0.5"/>
<path d="M750.67 320.91L732.68 320.91M732.68 320.91L732.68 306.09M732.68 306.09L750.67 306.09M750.67 306.09L750.67 320.91"
fill="none" stroke="black" stroke-width="0.5"/>
<path d="M743.46 306.09L739.93 306.09M739.93 306.09L739.93 294.22M739.93 294.22L743.46 294.22M743.46 294.22L743.46 306.09"
fill="none" stroke="black" stroke-width="0.5"/>
<path d="M750.81 294.22L732.68 294.22M732.68 294.22L732.68 279.26M732.68 279.26L750.81 279.26M750.81 279.26L750.81 294.22"
fill="none" stroke="black" stroke-width="0.5"/>
<path d="M790.75 320.91L772.77 320.91M772.77 320.91L772.77 306.09M772.77 306.09L790.75 306.09M790.75 306.09L790.75 320.91"
fill="none" stroke="black" stroke-width="0.5"/>
<path d="M783.55 306.09L780.01 306.09M780.01 306.09L780.01 294.22M780.01 294.22L783.55 294.22M783.55 294.22L783.55 306.09"
fill="none" stroke="black" stroke-width="0.5"/>
<path d="M790.89 294.22L772.77 294.22M772.77 294.22L772.77 279.26M772.77 279.26L790.89 279.26M790.89 279.26L790.89 294.22"
fill="none" stroke="black" stroke-width="0.5"/>
<path d="M732.68 320.92L793.66 320.92M793.66 320.92L793.66 279.26M793.66 279.26L732.68 279.26M732.68 279.26L732.68 320.92"
fill="none" stroke="black" stroke-width="0.5"/>
<path d="M699.05 320.92L528.73 320.92M528.73 320.92L528.73 279.54M528.73 279.54L699.05 279.54M699.05 279.54L699.05 320.92"
fill="none" stroke="black" stroke-width="0.5"/>
<path d="M553.16 279.54L544.81 278.39M544.81 278.39L520.89 278.51M520.89 278.51L520.89 274.31M520.89 274.31L544.85 274.26M544.85 274.26L554.51 273.48M554.51 273.48L796.33 273.78M796.33 273.78L796.33 326.56M796.33 326.56L554.45 326.68M554.45 326.68L543.3 325.84M543.3 325.84L520.91 325.84M520.91 325.84L520.91 321.66M520.91 321.66L545.62 321.66M545.62 321.66L553.79 320.92"
fill="none" stroke="black" stroke-width="0.5"/>
<path d="M752.39 297.23L752.52 296.43M752.52 296.43L752.92 295.72M752.92 295.72L753.55 295.2M753.55 295.2L754.32 294.93M754.32 294.93L755.13 294.95M755.13 294.95L755.89 295.26M755.89 295.26L760.27 297.84M760.27 297.84L760.27 297.84M760.27 297.84L760.96 298.43M760.96 298.43L761.42 299.22M761.42 299.22L761.6 300.11M761.6 300.11L761.46 301.01M761.46 301.01L761.04 301.82M761.04 301.82L760.37 302.44M760.37 302.44L755.84 305.16M755.84 305.16L755.84 305.16M755.84 305.16L754.99 305.47M754.99 305.47L754.08 305.42M754.08 305.42L753.27 305.02M753.27 305.02L752.67 304.33M752.67 304.33L752.39 303.47M752.39 303.47L752.39 297.23"
fill="none" stroke="black" stroke-width="0.5"/>
<path d="M757.68 300.13L757.86 299.37M757.86 299.37L758.34 298.76M758.34 298.76L759.05 298.42M759.05 298.42L759.83 298.42M759.83 298.42L760.53 298.76M760.53 298.76L761.02 299.37M761.02 299.37L761.19 300.13M761.19 300.13L761.02 300.89M761.02 300.89L760.53 301.5M760.53 301.5L759.83 301.84M759.83 301.84L759.05 301.84M759.05 301.84L758.34 301.5M758.34 301.5L757.86 300.89M757.86 300.89L757.68 300.13"
fill="none" stroke="black" stroke-width="0.5"/>
<path d="M753.42 297.16L753.59 296.53M753.59 296.53L754.05 296.07M754.05 296.07L754.68 295.91M754.68 295.91L755.31 296.07M755.31 296.07L755.76 296.53M755.76 296.53L755.93 297.16M755.93 297.16L755.76 297.79M755.76 297.79L755.31 298.25M755.31 298.25L754.68 298.42M754.68 298.42L754.05 298.25M754.05 298.25L753.59 297.79M753.59 297.79L753.42 297.16"
fill="none" stroke="black" stroke-width="0.5"/>
<path d="M753.42 303.15L753.59 302.53M753.59 302.53L754.05 302.07M754.05 302.07L754.68 301.9M754.68 301.9L755.31 302.07M755.31 302.07L755.76 302.53M755.76 302.53L755.93 303.15M755.93 303.15L755.76 303.78M755.76 303.78L755.31 304.24M755.31 304.24L754.68 304.41M754.68 304.41L754.05 304.24M754.05 304.24L753.59 303.78M753.59 303.78L753.42 303.15"
fill="none" stroke="black" stroke-width="0.5"/>
<path d="M757.3 296.1L757.3 283.21M757.3 283.21L757.3 283.21M757.3 283.21L757.67 282.38M757.67 282.38L758.34 281.78M758.34 281.78L759.21 281.52M759.21 281.52L760.1 281.64M760.1 281.64L760.87 282.13M760.87 282.13L761.36 282.89M761.36 282.89L761.48 283.79M761.48 283.79L761.23 284.65M761.23 284.65L760.85 285.71M760.85 285.71L763.99 293.98M763.99 293.98L763.99 306.41M763.99 306.41L760.88 314.71M760.88 314.71L761.21 315.72M761.21 315.72L761.21 315.72M761.21 315.72L761.48 316.49M761.48 316.49L761.43 317.3M761.43 317.3L761.08 318.03M761.08 318.03L760.47 318.58M760.47 318.58L759.7 318.84M759.7 318.84L758.89 318.79M758.89 318.79L758.16 318.43M758.16 318.43L757.62 317.82M757.62 317.82L757.35 317.05M757.35 317.05L757.35 304.26"
fill="none" stroke="black" stroke-width="0.5"/>
<path d="M758.66 283.5L758.82 283M758.82 283L759.25 282.69M759.25 282.69L759.77 282.69M759.77 282.69L760.2 283M760.2 283L760.36 283.5M760.36 283.5L760.2 284M760.2 284L759.77 284.31M759.77 284.31L759.25 284.31M759.25 284.31L758.82 284M758.82 284L758.66 283.5"
fill="none" stroke="black" stroke-width="0.5"/>
<path d="M758.66 316.79L758.82 316.29M758.82 316.29L759.25 315.98M759.25 315.98L759.77 315.98M759.77 315.98L760.2 316.29M760.2 316.29L760.36 316.79M760.36 316.79L760.2 317.29M760.2 317.29L759.77 317.6M759.77 317.6L759.25 317.6M759.25 317.6L758.82 317.29M758.82 317.29L758.66 316.79"
fill="none" stroke="black" stroke-width="0.5"/>
<path d="M750.45 292.3L733.13 292.3"
fill="none" stroke="black" stroke-width="0.5"/>
<path d="M750.45 291.14L733.13 291.14"
fill="none" stroke="black" stroke-width="0.5"/>
<path d="M750.45 289.27L733.13 289.27"
fill="none" stroke="black" stroke-width="0.5"/>
<path d="M750.45 287.18L733.13 287.18"
fill="none" stroke="black" stroke-width="0.5"/>
<path d="M750.45 285.18L733.13 285.18"
fill="none" stroke="black" stroke-width="0.5"/>
<path d="M750.45 283.44L733.13 283.44"
fill="none" stroke="black" stroke-width="0.5"/>
<path d="M750.45 282.15L733.13 282.15"
fill="none" stroke="black" stroke-width="0.5"/>
<path d="M750.45 280.5L733.13 280.5"
fill="none" stroke="black" stroke-width="0.5"/>
<path d="M750.45 308.05L733.13 308.05"
fill="none" stroke="black" stroke-width="0.5"/>
<path d="M750.45 309.25L733.13 309.25"
fill="none" stroke="black" stroke-width="0.5"/>
<path d="M750.45 310.91L733.13 310.91"
fill="none" stroke="black" stroke-width="0.5"/>
<path d="M750.45 312.78L733.13 312.78"
fill="none" stroke="black" stroke-width="0.5"/>
<path d="M750.45 314.92L733.13 314.92"
fill="none" stroke="black" stroke-width="0.5"/>
<path d="M750.45 317.01L733.13 317.01"
fill="none" stroke="black" stroke-width="0.5"/>
<path d="M750.45 318.08L733.13 318.08"
fill="none" stroke="black" stroke-width="0.5"/>
<path d="M750.45 319.81L733.13 319.81"
fill="none" stroke="black" stroke-width="0.5"/>
<path d="M790.36 292.3L773.04 292.3"
fill="none" stroke="black" stroke-width="0.5"/>
<path d="M790.36 291.14L773.04 291.14"
fill="none" stroke="black" stroke-width="0.5"/>
<path d="M790.36 289.27L773.04 289.27"
fill="none" stroke="black" stroke-width="0.5"/>
<path d="M790.36 287.18L773.04 287.18"
fill="none" stroke="black" stroke-width="0.5"/>
<path d="M790.36 285.18L773.04 285.18"
fill="none" stroke="black" stroke-width="0.5"/>
<path d="M790.36 283.44L773.04 283.44"
fill="none" stroke="black" stroke-width="0.5"/>
<path d="M790.36 282.15L773.04 282.15"
fill="none" stroke="black" stroke-width="0.5"/>
<path d="M790.36 280.5L773.04 280.5"
fill="none" stroke="black" stroke-width="0.5"/>
<path d="M790.36 308.05L773.04 308.05"
fill="none" stroke="black" stroke-width="0.5"/>
<path d="M790.36 309.25L773.04 309.25"
fill="none" stroke="black" stroke-width="0.5"/>
<path d="M790.36 310.91L773.04 310.91"
fill="none" stroke="black" stroke-width="0.5"/>
<path d="M790.36 312.78L773.04 312.78"
fill="none" stroke="black" stroke-width="0.5"/>
<path d="M790.36 314.92L773.04 314.92"
fill="none" stroke="black" stroke-width="0.5"/>
<path d="M790.36 317.01L773.04 317.01"
fill="none" stroke="black" stroke-width="0.5"/>
<path d="M790.36 318.08L773.04 318.08"
fill="none" stroke="black" stroke-width="0.5"/>
<path d="M790.36 319.81L773.04 319.81"
fill="none" stroke="black" stroke-width="0.5"/>
<path d="M662.28 286.68L630.76 286.68M630.76 286.68L630.76 285.69M630.76 285.69L662.28 285.69M662.28 285.69L662.28 286.68"
fill="none" stroke="black" stroke-width="0.5"/>
<path d="M662.28 300.59L630.76 300.59M630.76 300.59L630.76 299.61M630.76 299.61L662.28 299.61M662.28 299.61L662.28 300.59"
fill="none" stroke="black" stroke-width="0.5"/>
<path d="M662.28 314.64L630.76 314.64M630.76 314.64L630.76 313.66M630.76 313.66L662.28 313.66M662.28 313.66L662.28 314.64"
fill="none" stroke="black" stroke-width="0.5"/>
<path d="M535.7 280.95L535.7 319.37"
fill="none" stroke="black" stroke-width="0.5"/>
<path d="M552.33 280.95L552.33 319.37"
fill="none" stroke="black" stroke-width="0.5"/>
<path d="M570.86 280.95L570.86 319.37"
fill="none" stroke="black" stroke-width="0.5"/>
<path d="M587.37 280.95L587.37 319.37"
fill="none" stroke="black" stroke-width="0.5"/>
<path d="M604.92 280.95L604.92 319.37"
fill="none" stroke="black" stroke-width="0.5"/>
<path d="M621.18 280.95L621.18 319.37"
fill="none" stroke="black" stroke-width="0.5"/>
<path d="M638.83 280.95L638.83 319.37"
fill="none" stroke="black" stroke-width="0.5"/>
<path d="M654.08 280.95L654.08 319.37"
fill="none" stroke="black" stroke-width="0.5"/>
<path d="M757.3 273.72L704.03 271.19M704.03 271.19L689.62 271.08M689.62 271.08L689.62 259.05M689.62 259.05L487.09 259.05M487.09 259.05L487.09 261.97M487.09 261.97L488.49 261.97M488.49 261.97L488.49 269.02M488.49 269.02L487.09 269.02M487.09 269.02L487.09 271.12M487.09 271.12L500.5 271.12M500.5 271.12L514.45 279.1M514.45 279.1L514.45 279.1M514.45 279.1L515.42 279.84M515.42 279.84L516.18 280.79M516.18 280.79L516.68 281.9M516.68 281.9L516.88 283.09M516.88 283.09L516.88 316.91M516.88 316.91L516.88 316.91M516.88 316.91L516.74 318.08M516.74 318.08L516.33 319.2M516.33 319.2L515.68 320.18M515.68 320.18L514.81 320.99M514.81 320.99L499.44 329.33M499.44 329.33L486.96 329.33M486.96 329.33L486.96 331.17M486.96 331.17L488.52 331.17M488.52 331.17L488.52 338.35M488.52 338.35L486.82 338.35M486.82 338.35L486.82 340.86M486.82 340.86L689.73 340.86M689.73 340.86L689.73 329.19M689.73 329.19L702.23 329.19M702.23 329.19L757.23 326.58"
fill="none" stroke="black" stroke-width="0.5"/>
<path d="M688.53 271.05L655.84 271.05M655.84 271.05L655.84 259.05M655.84 259.05L688.53 259.05M688.53 259.05L688.53 271.05"
fill="none" stroke="black" stroke-width="0.5"/>
<path d="M655.01 271.08L502.49 271.08"
fill="none" stroke="black" stroke-width="0.5"/>
<path d="M682.88 340.17L673.36 340.17M673.36 340.17L673.36 329.2M673.36 329.2L682.88 329.2M682.88 329.2L682.88 340.17"
fill="none" stroke="black" stroke-width="0.5"/>
<path d="M664.68 338.64L634.33 338.64M634.33 338.64L634.33 329.54M634.33 329.54L664.68 329.54M664.68 329.54L664.68 338.64"
fill="none" stroke="black" stroke-width="0.5"/>
<path d="M628.97 340.86L601.85 340.86M601.85 340.86L601.85 329.97M601.85 329.97L628.97 329.97M628.97 329.97L628.97 340.86"
fill="none" stroke="black" stroke-width="0.5"/>
<path d="M610.86 335.75L611.05 334.45M611.05 334.45L611.59 333.27M611.59 333.27L612.45 332.28M612.45 332.28L613.55 331.57M613.55 331.57L614.8 331.2M614.8 331.2L616.11 331.2M616.11 331.2L617.36 331.57M617.36 331.57L618.46 332.28M618.46 332.28L619.32 333.27M619.32 333.27L619.86 334.45M619.86 334.45L620.04 335.75M620.04 335.75L619.86 337.04M619.86 337.04L619.32 338.23M619.32 338.23L618.46 339.22M618.46 339.22L617.36 339.92M617.36 339.92L616.11 340.29M616.11 340.29L614.8 340.29M614.8 340.29L613.55 339.92M613.55 339.92L612.45 339.22M612.45 339.22L611.59 338.23M611.59 338.23L611.05 337.04M611.05 337.04L610.86 335.75"
fill="none" stroke="black" stroke-width="0.5"/>
<path d="M689.73 329.19L500.98 329.19"
fill="none" stroke="black" stroke-width="0.5"/>
<path d="M501.99 340.86L491.44 356.4"
fill="none" stroke="black" stroke-width="0.5"/>
<path d="M491.3 350.17L451.31 350.17M451.31 350.17L451.31 378.57M451.31 378.57L491.3 378.57M491.3 378.57L491.3 350.17"
fill="none" stroke="black" stroke-width="0.5"/>
<path d="M451.31 377.66L439.62 377.66M439.62 377.66L439.62 350.87M439.62 350.87L451.31 350.87M451.31 350.87L451.31 377.66"
fill="none" stroke="black" stroke-width="0.5"/>
<path d="M451.31 375.58L442.07 375.58M442.07 375.58L442.07 353.13M442.07 353.13L451.31 353.13M451.31 353.13L451.31 375.58"
fill="none" stroke="black" stroke-width="0.5"/>
<path d="M475.5 375.85L452.85 375.85M452.85 375.85L452.85 353.04M452.85 353.04L475.5 353.04M475.5 353.04L475.5 375.85"
fill="none" stroke="black" stroke-width="0.5"/>
<path d="M474.77 375.04L453.48 375.04M453.48 375.04L453.48 353.76M453.48 353.76L474.77 353.76M474.77 353.76L474.77 375.04"
fill="none" stroke="black" stroke-width="0.5"/>
<path d="M491.3 351.07L498.26 340.86"
fill="none" stroke="black" stroke-width="0.5"/>
<path d="M758.38 270.15L758.38 244.14M758.38 244.14L752.46 225.56M752.46 225.56L697.32 225.56M697.32 225.56L691.09 244.29M691.09 244.29L691.09 270.11M691.09 270.11L758.38 270.11"
fill="none" stroke="black" stroke-width="0.5"/>
<path d="M754.56 271.2L752.59 271.2M752.59 271.2L752.59 256.08M752.59 256.08L754.56 256.08M754.56 256.08L754.56 271.2"
fill="none" stroke="black" stroke-width="0.5"/>
<path d="M696.53 271.2L694.55 271.2M694.55 271.2L694.55 256.08M694.55 256.08L696.53 256.08M696.53 256.08L696.53 271.2"
fill="none" stroke="black" stroke-width="0.5"/>
<path d="M758.38 330.18L758.38 356.19M758.38 356.19L752.46 374.78M752.46 374.78L697.32 374.78M697.32 374.78L691.09 356.05M691.09 356.05L691.09 330.22M691.09 330.22L758.38 330.22"
fill="none" stroke="black" stroke-width="0.5"/>
<path d="M754.56 329.13L752.59 329.13M752.59 329.13L752.59 344.25M752.59 344.25L754.56 344.25M754.56 344.25L754.56 329.13"
fill="none" stroke="black" stroke-width="0.5"/>
<path d="M696.53 329.13L694.55 329.13M694.55 329.13L694.55 344.25M694.55 344.25L696.53 344.25M696.53 344.25L696.53 329.13"
fill="none" stroke="black" stroke-width="0.5"/>
<path d="M778.71 394.09L779.88 391.26M779.88 391.26L781.02 388.41M781.02 388.41L782.12 385.55M782.12 385.55L783.19 382.67M783.19 382.67L784.22 379.78M784.22 379.78L785.21 376.88M785.21 376.88L786.17 373.97M786.17 373.97L787.09 371.04M787.09 371.04L787.97 368.1M787.97 368.1L788.81 365.15M788.81 365.15L789.62 362.2M789.62 362.2L790.39 359.23M790.39 359.23L791.12 356.25M791.12 356.25L791.81 353.26M791.81 353.26L792.47 350.26M792.47 350.26L793.09 347.26M793.09 347.26L793.67 344.25M793.67 344.25L794.21 341.23M794.21 341.23L794.71 338.2M794.71 338.2L795.18 335.17M795.18 335.17L795.6 332.13M795.6 332.13L795.99 329.09M795.99 329.09L796.34 326.04M796.34 326.04L796.65 322.99M796.65 322.99L796.92 319.94M796.92 319.94L797.15 316.88M797.15 316.88L797.35 313.82M797.35 313.82L797.5 310.76M797.5 310.76L797.62 307.69M797.62 307.69L797.7 304.62M797.7 304.62L797.74 301.56M797.74 301.56L797.74 298.49M797.74 298.49L797.7 295.42M797.7 295.42L797.62 292.36M797.62 292.36L797.5 289.29M797.5 289.29L797.35 286.23M797.35 286.23L797.15 283.17M797.15 283.17L796.92 280.11M796.92 280.11L796.65 277.05M796.65 277.05L796.34 274M796.34 274L795.99 270.96M795.99 270.96L795.6 267.91M795.6 267.91L795.17 264.88M795.17 264.88L794.71 261.84M794.71 261.84L794.2 258.82M794.2 258.82L793.66 255.8M793.66 255.8L793.08 252.79M793.08 252.79L792.46 249.78M792.46 249.78L791.81 246.79M791.81 246.79L791.11 243.8M791.11 243.8L790.38 240.82M790.38 240.82L789.61 237.85M789.61 237.85L788.81 234.89M788.81 234.89L787.96 231.94M787.96 231.94L787.08 229.01M787.08 229.01L786.16 226.08M786.16 226.08L785.2 223.17M785.2 223.17L784.21 220.26M784.21 220.26L783.18 217.38M783.18 217.38L782.11 214.5M782.11 214.5L781.01 211.64M781.01 211.64L779.87 208.79M779.87 208.79L778.7 205.96M778.7 205.96L777.49 203.14"
fill="none" stroke="black" stroke-width="0.5"/>
<path d="M556.23 284.72L556.23 315.35"
fill="none" stroke="RGB(255,223,127)" stroke-width="0.5"/>
<path d="M573.39 300.03L539.08 300.03"
fill="none" stroke="RGB(255,223,127)" stroke-width="0.5"/>
<path d="M493.42 333.98L493.42 265.96"
fill="none" stroke="black" stroke-width="0.5"/>
<path d="M499.47 299.97L487.37 299.97"
fill="none" stroke="RGB(255,223,127)" stroke-width="0.5"/>
<path d="M617.35 297.11L616.7 295.81M616.7 295.81L615.4 294.51M615.4 294.51L614.1 293.86M614.1 293.86L611.5 293.86M611.5 293.86L610.2 294.51M610.2 294.51L608.9 295.81M608.9 295.81L608.25 297.11M608.25 297.11L607.6 299.06M607.6 299.06L607.6 302.31M607.6 302.31L608.25 304.26M608.25 304.26L608.9 305.56M608.9 305.56L610.2 306.86M610.2 306.86L611.5 307.51M611.5 307.51L614.1 307.51M614.1 307.51L615.4 306.86M615.4 306.86L616.7 305.56M616.7 305.56L617.35 304.26M631 297.11L630.35 295.81M630.35 295.81L629.05 294.51M629.05 294.51L627.75 293.86M627.75 293.86L625.15 293.86M625.15 293.86L623.85 294.51M623.85 294.51L622.55 295.81M622.55 295.81L621.9 297.11M621.9 297.11L621.25 299.06M621.25 299.06L621.25 302.31M621.25 302.31L621.9 304.26M621.9 304.26L622.55 305.56M622.55 305.56L623.85 306.86M623.85 306.86L625.15 307.51M625.15 307.51L627.75 307.51M627.75 307.51L629.05 306.86M629.05 306.86L630.35 305.56M630.35 305.56L631 304.26M647.89 297.11L647.89 296.46M647.89 296.46L648.54 295.16M648.54 295.16L649.19 294.51M649.19 294.51L650.49 293.86M650.49 293.86L653.09 293.86M653.09 293.86L654.39 294.51M654.39 294.51L655.04 295.16M655.04 295.16L655.69 296.46M655.69 296.46L655.69 297.76M655.69 297.76L655.04 299.06M655.04 299.06L653.74 301.01M653.74 301.01L647.24 307.51M647.24 307.51L656.34 307.51M666.74 293.86L660.24 302.96M660.24 302.96L669.99 302.96M666.74 293.86L666.74 307.51M677.13 293.86L675.18 294.51M675.18 294.51L673.88 296.46M673.88 296.46L673.24 299.71M673.24 299.71L673.24 301.66M673.24 301.66L673.88 304.91M673.88 304.91L675.18 306.86M675.18 306.86L677.13 307.51M677.13 307.51L678.43 307.51M678.43 307.51L680.38 306.86M680.38 306.86L681.68 304.91M681.68 304.91L682.33 301.66M682.33 301.66L682.33 299.71M682.33 299.71L681.68 296.46M681.68 296.46L680.38 294.51M680.38 294.51L678.43 293.86M678.43 293.86L677.13 293.86M690.13 293.86L688.18 294.51M688.18 294.51L686.88 296.46M686.88 296.46L686.23 299.71M686.23 299.71L686.23 301.66M686.23 301.66L686.88 304.91M686.88 304.91L688.18 306.86M688.18 306.86L690.13 307.51M690.13 307.51L691.43 307.51M691.43 307.51L693.38 306.86M693.38 306.86L694.68 304.91M694.68 304.91L695.33 301.66M695.33 301.66L695.33 299.71M695.33 299.71L694.68 296.46M694.68 296.46L693.38 294.51M693.38 294.51L691.43 293.86M691.43 293.86L690.13 293.86M616.7 318.55L615.4 317.25M615.4 317.25L613.45 316.6M613.45 316.6L610.85 316.6M610.85 316.6L608.9 317.25M608.9 317.25L607.6 318.55M607.6 318.55L607.6 319.85M607.6 319.85L608.25 321.15M608.25 321.15L608.9 321.8M608.9 321.8L610.2 322.45M610.2 322.45L614.1 323.75M614.1 323.75L615.4 324.4M615.4 324.4L616.05 325.05M616.05 325.05L616.7 326.35M616.7 326.35L616.7 328.3M616.7 328.3L615.4 329.6M615.4 329.6L613.45 330.25M613.45 330.25L610.85 330.25M610.85 330.25L608.9 329.6M608.9 329.6L607.6 328.3M620.6 330.25L620.6 316.6M629.7 316.6L629.7 330.25M620.6 323.1L629.7 323.1"
fill="none" stroke="black" stroke-width="0.5"/>
<path d="M708.18 429.87L404.4 429.87M404.4 429.87L404.4 388.46M404.4 388.46L708.18 388.46M708.18 388.46L708.18 429.87"
fill="none" stroke="black" stroke-width="0.5"/>
</svg>
