<?xml version="1.0" encoding="UTF-8"?>
<svg xmlns="http://www.w3.org/2000/svg" width="800.000" height="600.000" viewBox="0.0 0.0 800.000 600.000" version="1.1">
  <title>Produce by Acme CAD Converter</title>
  <desc>Produce by Acme CAD Converter</desc>
<polyline points="60.64,283.52 60.63,299.88" style="fill:none;stroke:black;stroke-width:0.5"/>
<polyline points="38.34,299.86 38.35,283.5" style="fill:none;stroke:black;stroke-width:0.5"/>
<polyline points="8.5,253.13 5.14,299.84" style="fill:none;stroke:black;stroke-width:0.5"/>
<polyline points="12.29,255.5 10.69,261.7 9.41,267.97 8.46,274.3 7.84,280.66 7.56,287.06 7.6,293.45 7.99,299.84" style="fill:none;stroke:black;stroke-width:0.5"/>
<polyline points="2.77,299.84 4.59,274.12 6.13,248.39" style="fill:none;stroke:black;stroke-width:0.5"/>
<polyline points="14.27,285.38 13.42,290.16 12.9,294.99 12.73,299.84 12.9,304.7 13.4,309.53 14.25,314.31" style="fill:none;stroke:black;stroke-width:0.5"/>
<polyline points="130.44,249.8 130.4,299.83" style="fill:none;stroke:black;stroke-width:0.5"/>
<polyline points="134.71,245.54 134.67,299.83" style="fill:none;stroke:black;stroke-width:0.5"/>
<polyline points="107.1,299.92 107.15,241.83" style="fill:none;stroke:black;stroke-width:0.5"/>
<polyline points="122.76,292.1 122.77,277.88" style="fill:none;stroke:black;stroke-width:0.5"/>
<polyline points="138.89,361.72 138.99,237.95" style="fill:none;stroke:black;stroke-width:0.5"/>
<polyline points="797.82,361.72 797.82,237.95" style="fill:none;stroke:black;stroke-width:0.5"/>
<polyline points="138.89,361.72 797.82,361.72" style="fill:none;stroke:black;stroke-width:0.5"/>
<polyline points="107.06,358.01 24.55,350.36" style="fill:none;stroke:black;stroke-width:0.5"/>
<polyline points="15.06,354.62 29.86,356.21 44.7,357.48 59.56,358.44 74.43,359.08 89.32,359.41 104.21,359.43" style="fill:none;stroke:black;stroke-width:0.5"/>
<polyline points="42.56,359.86 98.52,359.9" style="fill:none;stroke:black;stroke-width:0.5"/>
<polyline points="88.86,333.34 107.07,333.35" style="fill:none;stroke:black;stroke-width:0.5"/>
<polyline points="19.81,346.56 20.04,347.67 20.56,348.68 21.34,349.51 22.31,350.09 23.41,350.38 24.55,350.36" style="fill:none;stroke:black;stroke-width:0.5"/>
<polyline points="8.43,346.55 9.33,348.47 10.46,350.27 11.81,351.9 13.35,353.36 15.06,354.62" style="fill:none;stroke:black;stroke-width:0.5"/>
<polyline points="18.44,355.01 18.44,359.36" style="fill:none;stroke:black;stroke-width:0.5"/>
<polyline points="6.05,351.29 6.86,353.1 7.96,354.76 9.31,356.21 10.88,357.42 12.62,358.37 14.5,359.02 16.45,359.35 18.44,359.36" style="fill:none;stroke:black;stroke-width:0.5"/>
<polyline points="22.66,355.47 22.65,359.38" style="fill:none;stroke:black;stroke-width:0.5"/>
<polyline points="38.77,359.38 38.77,357.01" style="fill:none;stroke:black;stroke-width:0.5"/>
<polyline points="41.16,357.2 41.3,358.24 41.79,359.16 42.56,359.86" style="fill:none;stroke:black;stroke-width:0.5"/>
<polyline points="22.66,355.47 22.66,353.68" style="fill:none;stroke:black;stroke-width:0.5"/>
<polyline points="22.66,353.68 54.42,355.6" style="fill:none;stroke:black;stroke-width:0.5"/>
<polyline points="54.42,355.6 54.35,358.14" style="fill:none;stroke:black;stroke-width:0.5"/>
<polyline points="38.77,359.38 22.65,359.38" style="fill:none;stroke:black;stroke-width:0.5"/>
<polyline points="88.84,356.32 88.86,333.34" style="fill:none;stroke:black;stroke-width:0.5"/>
<polyline points="12.22,344.18 12.02,345.31 12.14,346.45 12.59,347.51 13.32,348.39 14.27,349.04 15.36,349.38 16.51,349.39 17.61,349.08 18.58,348.47 19.33,347.6 19.81,346.56" style="fill:none;stroke:black;stroke-width:0.5"/>
<polyline points="38.33,316.22 60.61,316.24" style="fill:none;stroke:black;stroke-width:0.5"/>
<polyline points="60.61,316.24 60.63,299.88" style="fill:none;stroke:black;stroke-width:0.5"/>
<polyline points="38.34,299.86 38.33,316.22" style="fill:none;stroke:black;stroke-width:0.5"/>
<polyline points="14.25,314.31 16.84,330.47 19.81,346.56" style="fill:none;stroke:black;stroke-width:0.5"/>
<polyline points="5.14,299.84 8.43,346.55" style="fill:none;stroke:black;stroke-width:0.5"/>
<polyline points="6.05,351.29 4.55,325.56 2.77,299.84" style="fill:none;stroke:black;stroke-width:0.5"/>
<polyline points="7.99,299.84 7.59,306.23 7.54,312.62 7.81,319.02 8.42,325.39 9.36,331.72 10.63,337.99 12.22,344.18" style="fill:none;stroke:black;stroke-width:0.5"/>
<polyline points="107.09,307.74 130.4,307.65" style="fill:none;stroke:black;stroke-width:0.5"/>
<polyline points="107.11,292.09 130.41,292.01" style="fill:none;stroke:black;stroke-width:0.5"/>
<polyline points="132.73,357.92 134.63,357.93" style="fill:none;stroke:black;stroke-width:0.5"/>
<polyline points="132.73,362.19 132.73,357.92" style="fill:none;stroke:black;stroke-width:0.5"/>
<polyline points="130.37,349.86 130.71,351.11 131.35,352.24 132.25,353.18 133.36,353.86 134.6,354.24" style="fill:none;stroke:black;stroke-width:0.5"/>
<polyline points="134.63,354.13 134.43,355.49 134.52,356.86 134.92,358.17 135.59,359.37 136.51,360.39 137.63,361.19 138.89,361.72" style="fill:none;stroke:black;stroke-width:0.5"/>
<polyline points="104.21,359.43 105.04,359.38 105.83,359.11 106.52,358.64 107.06,358.01" style="fill:none;stroke:black;stroke-width:0.5"/>
<polyline points="98.52,359.9 99.97,359.84 101.36,359.45" style="fill:none;stroke:black;stroke-width:0.5"/>
<polyline points="107.06,350.9 130.36,350.81" style="fill:none;stroke:black;stroke-width:0.5"/>
<polyline points="116.07,350.9 116.06,362.28" style="fill:none;stroke:black;stroke-width:0.5"/>
<polyline points="116.06,362.28 132.73,362.19" style="fill:none;stroke:black;stroke-width:0.5"/>
<polyline points="107.07,337.14 130.37,337.06" style="fill:none;stroke:black;stroke-width:0.5"/>
<polyline points="114.66,332.88 114,331.78 113.07,330.89 111.95,330.27 110.7,329.96 109.42,329.97 108.18,330.32 107.08,330.98" style="fill:none;stroke:black;stroke-width:0.5"/>
<polyline points="112.76,337.15 113.59,336.57 114.22,335.79 114.63,334.87 114.78,333.88 114.66,332.88" style="fill:none;stroke:black;stroke-width:0.5"/>
<polyline points="112.76,337.15 112.75,350.9" style="fill:none;stroke:black;stroke-width:0.5"/>
<polyline points="122.73,321.98 130.39,321.88" style="fill:none;stroke:black;stroke-width:0.5"/>
<polyline points="107.09,317.23 122.74,317.24" style="fill:none;stroke:black;stroke-width:0.5"/>
<polyline points="122.73,321.98 107.08,321.97" style="fill:none;stroke:black;stroke-width:0.5"/>
<polyline points="130.37,337.06 128.9,333.08 127.13,329.22 125.07,325.52 122.73,321.98" style="fill:none;stroke:black;stroke-width:0.5"/>
<polyline points="122.74,307.75 122.73,321.98" style="fill:none;stroke:black;stroke-width:0.5"/>
<polyline points="130.37,349.86 130.4,299.83" style="fill:none;stroke:black;stroke-width:0.5"/>
<polyline points="134.63,354.13 134.67,299.83" style="fill:none;stroke:black;stroke-width:0.5"/>
<polyline points="107.1,299.92 107.06,358.01" style="fill:none;stroke:black;stroke-width:0.5"/>
<polyline points="138.99,237.95 797.82,237.95" style="fill:none;stroke:black;stroke-width:0.5"/>
<polyline points="88.91,266.47 107.13,266.48" style="fill:none;stroke:black;stroke-width:0.5"/>
<polyline points="107.15,241.83 24.63,249.35" style="fill:none;stroke:black;stroke-width:0.5"/>
<polyline points="104.3,240.4 89.41,240.39 74.52,240.7 59.65,241.32 44.79,242.26 29.95,243.51 15.14,245.07" style="fill:none;stroke:black;stroke-width:0.5"/>
<polyline points="42.65,239.88 98.61,239.92" style="fill:none;stroke:black;stroke-width:0.5"/>
<polyline points="19.88,253.14 16.88,269.23 14.27,285.38" style="fill:none;stroke:black;stroke-width:0.5"/>
<polyline points="88.93,243.49 88.91,266.47" style="fill:none;stroke:black;stroke-width:0.5"/>
<polyline points="24.62,249.35 23.49,249.33 22.39,249.62 21.41,250.2 20.63,251.02 20.11,252.03 19.88,253.14" style="fill:none;stroke:black;stroke-width:0.5"/>
<polyline points="15.14,245.07 13.43,246.33 11.89,247.78 10.54,249.42 9.4,251.21 8.5,253.13" style="fill:none;stroke:black;stroke-width:0.5"/>
<polyline points="19.88,253.14 19.41,252.09 18.65,251.23 17.69,250.61 16.58,250.3 15.44,250.31 14.34,250.66 13.39,251.3 12.66,252.18 12.21,253.24 12.09,254.38 12.29,255.5" style="fill:none;stroke:black;stroke-width:0.5"/>
<polyline points="18.52,244.69 18.53,240.33" style="fill:none;stroke:black;stroke-width:0.5"/>
<polyline points="18.53,240.33 16.55,240.34 14.59,240.67 12.71,241.32 10.97,242.26 9.4,243.47 8.04,244.93 6.95,246.58 6.13,248.39" style="fill:none;stroke:black;stroke-width:0.5"/>
<polyline points="42.65,239.9 41.88,240.59 41.39,241.51 41.25,242.55" style="fill:none;stroke:black;stroke-width:0.5"/>
<polyline points="38.86,240.35 38.86,242.72" style="fill:none;stroke:black;stroke-width:0.5"/>
<polyline points="22.74,244.23 22.75,240.35" style="fill:none;stroke:black;stroke-width:0.5"/>
<polyline points="22.74,246.03 54.51,244.16" style="fill:none;stroke:black;stroke-width:0.5"/>
<polyline points="22.74,244.23 22.74,246.03" style="fill:none;stroke:black;stroke-width:0.5"/>
<polyline points="54.51,244.16 54.44,241.61" style="fill:none;stroke:black;stroke-width:0.5"/>
<polyline points="38.86,240.35 22.75,240.35" style="fill:none;stroke:black;stroke-width:0.5"/>
<polyline points="38.35,283.5 60.64,283.52" style="fill:none;stroke:black;stroke-width:0.5"/>
<polyline points="134.69,245.43 133.44,245.81 132.34,246.49 131.43,247.42 130.79,248.55 130.44,249.8" style="fill:none;stroke:black;stroke-width:0.5"/>
<polyline points="132.82,237.47 132.82,241.74" style="fill:none;stroke:black;stroke-width:0.5"/>
<polyline points="132.82,241.74 134.72,241.74" style="fill:none;stroke:black;stroke-width:0.5"/>
<polyline points="134.69,245.43 133.44,245.81 132.34,246.49 131.43,247.42 130.79,248.55 130.44,249.8" style="fill:none;stroke:black;stroke-width:0.5"/>
<polyline points="138.99,237.95 137.72,238.48 136.6,239.28 135.68,240.3 135.01,241.49 134.61,242.81 134.51,244.18 134.71,245.54" style="fill:none;stroke:black;stroke-width:0.5"/>
<polyline points="107.15,241.83 106.61,241.19 105.92,240.72 105.13,240.45 104.3,240.4" style="fill:none;stroke:black;stroke-width:0.5"/>
<polyline points="101.46,240.37 100.06,239.98 98.61,239.92" style="fill:none;stroke:black;stroke-width:0.5"/>
<polyline points="107.15,241.83 106.61,241.19 105.92,240.72 105.13,240.45 104.3,240.4" style="fill:none;stroke:black;stroke-width:0.5"/>
<polyline points="122.77,277.88 125.11,274.29 127.18,270.53 128.96,266.63 130.43,262.6" style="fill:none;stroke:black;stroke-width:0.5"/>
<polyline points="114.71,266.96 114.84,265.97 114.69,264.97 114.28,264.05 113.64,263.27 112.82,262.7" style="fill:none;stroke:black;stroke-width:0.5"/>
<polyline points="107.12,268.86 108.23,269.51 109.46,269.86 110.75,269.88 112,269.57 113.12,268.95 114.05,268.06 114.71,266.96" style="fill:none;stroke:black;stroke-width:0.5"/>
<polyline points="116.16,237.56 132.82,237.47" style="fill:none;stroke:black;stroke-width:0.5"/>
<polyline points="116.15,248.95 116.16,237.56" style="fill:none;stroke:black;stroke-width:0.5"/>
<polyline points="112.82,262.7 112.83,248.94" style="fill:none;stroke:black;stroke-width:0.5"/>
<polyline points="107.14,248.94 130.44,248.85" style="fill:none;stroke:black;stroke-width:0.5"/>
<polyline points="107.13,262.69 130.43,262.6" style="fill:none;stroke:black;stroke-width:0.5"/>
<polyline points="122.77,277.88 107.12,277.87" style="fill:none;stroke:black;stroke-width:0.5"/>
<polyline points="107.11,282.61 122.76,282.62" style="fill:none;stroke:black;stroke-width:0.5"/>
<polyline points="122.77,277.88 130.42,277.78" style="fill:none;stroke:black;stroke-width:0.5"/>
<polyline points="107.15,241.83 106.61,241.19 105.92,240.72 105.13,240.45 104.3,240.4" style="fill:none;stroke:black;stroke-width:0.5"/>
</svg>
