<?xml version="1.0" encoding="UTF-8"?>
<svg xmlns="http://www.w3.org/2000/svg" width="800.000" height="600.000" viewBox="0.0 0.0 800.000 600.000" version="1.1">
  <title>Produce by Acme CAD Converter</title>
  <desc>Produce by Acme CAD Converter</desc>
<path d="M710.23 598.3L662.51 598.3 662.51 25.56 710.23 25.56 710.23 598.3Z"
fill-rule="evenodd" fill="black"/>
<path d="M686.37 1.7L670.75 1.9 672 49.61 686.37 49.43 686.37 1.7Z"
fill-rule="nonzero" fill="black"/>
<path d="M670.75 1.9L655.15 2.52 657.64 50.18 672 49.61 670.75 1.9Z"
fill-rule="nonzero" fill="black"/>
<path d="M655.15 2.52L639.56 3.54 643.31 51.12 657.64 50.18 655.15 2.52Z"
fill-rule="nonzero" fill="black"/>
<path d="M639.56 3.54L624.01 4.97 629 52.43 643.31 51.12 639.56 3.54Z"
fill-rule="nonzero" fill="black"/>
<path d="M624.01 4.97L608.5 6.8 614.73 54.12 629 52.43 624.01 4.97Z"
fill-rule="nonzero" fill="black"/>
<path d="M608.5 6.8L593.04 9.04 600.51 56.18 614.73 54.12 608.5 6.8Z"
fill-rule="nonzero" fill="black"/>
<path d="M593.04 9.04L577.65 11.69 586.35 58.62 600.51 56.18 593.04 9.04Z"
fill-rule="nonzero" fill="black"/>
<path d="M577.65 11.69L562.33 14.73 572.25 61.42 586.35 58.62 577.65 11.69Z"
fill-rule="nonzero" fill="black"/>
<path d="M562.33 14.73L547.1 18.18 558.24 64.59 572.25 61.42 562.33 14.73Z"
fill-rule="nonzero" fill="black"/>
<path d="M547.1 18.18L531.96 22.03 544.31 68.13 558.24 64.59 547.1 18.18Z"
fill-rule="nonzero" fill="black"/>
<path d="M531.96 22.03L516.93 26.27 530.48 72.03 544.31 68.13 531.96 22.03Z"
fill-rule="nonzero" fill="black"/>
<path d="M516.93 26.27L502.01 30.9 516.76 76.29 530.48 72.03 516.93 26.27Z"
fill-rule="nonzero" fill="black"/>
<path d="M502.01 30.9L487.22 35.92 503.15 80.91 516.76 76.29 502.01 30.9Z"
fill-rule="nonzero" fill="black"/>
<path d="M487.22 35.92L472.57 41.32 489.67 85.88 503.15 80.91 487.22 35.92Z"
fill-rule="nonzero" fill="black"/>
<path d="M472.57 41.32L458.06 47.11 476.32 91.21 489.67 85.88 472.57 41.32Z"
fill-rule="nonzero" fill="black"/>
<path d="M458.06 47.11L443.71 53.28 463.12 96.88 476.32 91.21 458.06 47.11Z"
fill-rule="nonzero" fill="black"/>
<path d="M443.71 53.28L429.53 59.82 450.07 102.89 463.12 96.88 443.71 53.28Z"
fill-rule="nonzero" fill="black"/>
<path d="M429.53 59.82L415.52 66.72 437.19 109.25 450.07 102.89 429.53 59.82Z"
fill-rule="nonzero" fill="black"/>
<path d="M415.52 66.72L401.7 74 424.47 115.94 437.19 109.25 415.52 66.72Z"
fill-rule="nonzero" fill="black"/>
<path d="M401.7 74L388.07 81.63 411.93 122.96 424.47 115.94 401.7 74Z"
fill-rule="nonzero" fill="black"/>
<path d="M388.07 81.63L374.65 89.61 399.58 130.31 411.93 122.96 388.07 81.63Z"
fill-rule="nonzero" fill="black"/>
<path d="M374.65 89.61L361.44 97.95 387.43 137.98 399.58 130.31 374.65 89.61Z"
fill-rule="nonzero" fill="black"/>
<path d="M361.44 97.95L348.45 106.62 375.48 145.96 387.43 137.98 361.44 97.95Z"
fill-rule="nonzero" fill="black"/>
<path d="M348.45 106.62L335.69 115.64 363.75 154.25 375.48 145.96 348.45 106.62Z"
fill-rule="nonzero" fill="black"/>
<path d="M335.69 115.64L323.18 124.98 352.24 162.85 363.75 154.25 335.69 115.64Z"
fill-rule="nonzero" fill="black"/>
<path d="M323.18 124.98L310.91 134.65 340.95 171.75 352.24 162.85 323.18 124.98Z"
fill-rule="nonzero" fill="black"/>
<path d="M310.91 134.65L298.91 144.64 329.9 180.93 340.95 171.75 310.91 134.65Z"
fill-rule="nonzero" fill="black"/>
<path d="M298.91 144.64L287.16 154.94 319.1 190.41 329.9 180.93 298.91 144.64Z"
fill-rule="nonzero" fill="black"/>
<path d="M287.16 154.94L275.69 165.54 308.55 200.16 319.1 190.41 287.16 154.94Z"
fill-rule="nonzero" fill="black"/>
<path d="M275.69 165.54L264.51 176.44 298.26 210.19 308.55 200.16 275.69 165.54Z"
fill-rule="nonzero" fill="black"/>
<path d="M264.51 176.44L253.61 187.63 288.23 220.48 298.26 210.19 264.51 176.44Z"
fill-rule="nonzero" fill="black"/>
<path d="M253.61 187.63L243.01 199.1 278.48 231.03 288.23 220.48 253.61 187.63Z"
fill-rule="nonzero" fill="black"/>
<path d="M243.01 199.1L232.71 210.84 269 241.84 278.48 231.03 243.01 199.1Z"
fill-rule="nonzero" fill="black"/>
<path d="M232.71 210.84L222.72 222.85 259.81 252.88 269 241.84 232.71 210.84Z"
fill-rule="nonzero" fill="black"/>
<path d="M222.72 222.85L213.05 235.11 250.92 264.17 259.81 252.88 222.72 222.85Z"
fill-rule="nonzero" fill="black"/>
<path d="M213.05 235.11L203.71 247.63 242.32 275.68 250.92 264.17 213.05 235.11Z"
fill-rule="nonzero" fill="black"/>
<path d="M203.71 247.63L194.69 260.38 234.03 287.42 242.32 275.68 203.71 247.63Z"
fill-rule="nonzero" fill="black"/>
<path d="M194.69 260.38L186.02 273.37 226.04 299.36 234.03 287.42 194.69 260.38Z"
fill-rule="nonzero" fill="black"/>
<path d="M186.02 273.37L177.68 286.58 218.38 311.52 226.04 299.36 186.02 273.37Z"
fill-rule="nonzero" fill="black"/>
<path d="M177.68 286.58L169.7 300 211.03 323.86 218.38 311.52 177.68 286.58Z"
fill-rule="nonzero" fill="black"/>
<path d="M169.7 300L162.06 313.63 204.01 336.4 211.03 323.86 169.7 300Z"
fill-rule="nonzero" fill="black"/>
<path d="M162.06 313.63L154.79 327.45 197.32 349.12 204.01 336.4 162.06 313.63Z"
fill-rule="nonzero" fill="black"/>
<path d="M154.79 327.45L147.88 341.46 190.96 362 197.32 349.12 154.79 327.45Z"
fill-rule="nonzero" fill="black"/>
<path d="M147.88 341.46L141.34 355.64 184.95 375.05 190.96 362 147.88 341.46Z"
fill-rule="nonzero" fill="black"/>
<path d="M141.34 355.64L135.18 369.99 179.27 388.26 184.95 375.05 141.34 355.64Z"
fill-rule="nonzero" fill="black"/>
<path d="M135.18 369.99L129.39 384.5 173.95 401.6 179.27 388.26 135.18 369.99Z"
fill-rule="nonzero" fill="black"/>
<path d="M129.39 384.5L123.99 399.15 168.98 415.08 173.95 401.6 129.39 384.5Z"
fill-rule="nonzero" fill="black"/>
<path d="M123.99 399.15L118.97 413.94 164.36 428.69 168.98 415.08 123.99 399.15Z"
fill-rule="nonzero" fill="black"/>
<path d="M118.97 413.94L114.33 428.86 160.1 442.41 164.36 428.69 118.97 413.94Z"
fill-rule="nonzero" fill="black"/>
<path d="M114.33 428.86L110.09 443.89 156.2 456.24 160.1 442.41 114.33 428.86Z"
fill-rule="nonzero" fill="black"/>
<path d="M110.09 443.89L106.25 459.03 152.66 470.17 156.2 456.24 110.09 443.89Z"
fill-rule="nonzero" fill="black"/>
<path d="M106.25 459.03L102.8 474.26 149.49 484.18 152.66 470.17 106.25 459.03Z"
fill-rule="nonzero" fill="black"/>
<path d="M102.8 474.26L99.76 489.58 146.69 498.28 149.49 484.18 102.8 474.26Z"
fill-rule="nonzero" fill="black"/>
<path d="M99.76 489.58L97.11 504.97 144.25 512.44 146.69 498.28 99.76 489.58Z"
fill-rule="nonzero" fill="black"/>
<path d="M97.11 504.97L94.87 520.43 142.19 526.66 144.25 512.44 97.11 504.97Z"
fill-rule="nonzero" fill="black"/>
<path d="M94.87 520.43L93.03 535.94 140.5 540.93 142.19 526.66 94.87 520.43Z"
fill-rule="nonzero" fill="black"/>
<path d="M93.03 535.94L91.6 551.49 139.19 555.24 140.5 540.93 93.03 535.94Z"
fill-rule="nonzero" fill="black"/>
<path d="M91.6 551.49L90.58 567.08 138.25 569.58 139.19 555.24 91.6 551.49Z"
fill-rule="nonzero" fill="black"/>
<path d="M90.58 567.08L89.97 582.68 137.68 583.93 138.25 569.58 90.58 567.08Z"
fill-rule="nonzero" fill="black"/>
<path d="M89.97 582.68L89.77 598.3 137.49 598.3 137.68 583.93 89.97 582.68Z"
fill-rule="nonzero" fill="black"/>
</svg>
