@startuml
'https://plantuml.com/sequence-diagram
title Iniciar Partida (FIPA-Propose)
autonumber
skinparam style strictuml
participant AgentePartida
participant AgenteRaton
autonumber

activate AgentePartida
AgentePartida -> AgenteRaton --++ : PROPOSE( IniciarPartida )
note left: 1 seg time-out
alt acepta jugar
    AgenteRaton --> AgentePartida ++ : ACCEPT-PROPOSAL ( EstadoPartida )
else no acepta jugar
    AgenteRaton --> AgentePartida --: REJECT-PROPOSAL ( EstadoPartida ) )
end
deactivate AgentePartida

group incidencias
        AgenteRaton --> AgentePartida ++ : NotUnderstoodException
        note right
            Usar excepción
            si no es la ontología
            OntoMouseRun
        end note
end
@enduml