{
    "app": {
        "bower": {
            "bootstrap": "^3.3.6"
        },
        "bower_css": [],
        "bower_js": [],
        "js": [
            "<script src='mod_RoR-events/mod.RoR-events.js'></script>",
            "<script src='mod_RoR-events/views/dashboard/RoR-events.dashboardCtrl.js'></script>",
            "<script src='mod_RoR-events/views/menu/RoR-events.headerCtrl.js'></script>"
        ]
    },
    "admin": {
        "bower": {
            "moment": "^2.14.1"
        },
        "bower_css": [],
        "bower_js": [],
        "js": [
            "<script src='mod_RoR-events/mod.RoR-events.js'></script>",
            "<script src='mod_RoR-events/views/admin/RoR-events.adminCtrl.js'></script>",
            "<script src='mod_RoR-events/views/menu/RoR-events.headerCtrl.js'></script>"
        ]
    }
}
