<svg xmlns="http://www.w3.org/2000/svg" width="30.707" height="30.707" viewBox="0 0 30.707 30.707">
  <g id="Group_68" data-name="Group 68" transform="translate(-212.146 -16.146)">
    <line id="Line_16" data-name="Line 16" x2="30" y2="30" transform="translate(212.5 16.5)" fill="none" stroke="#b7bed1" stroke-width="1"/>
    <line id="Line_17" data-name="Line 17" x2="30" y2="30" transform="translate(242.5 16.5) rotate(90)" fill="none" stroke="#b7bed1" stroke-width="1"/>
  </g>
</svg>
