{
  "openapi": "3.0.0",
  "info": {
    "title": "Auth API",
    "description": "The Auth API description",
    "version": "1.0.0",
    "contact": {}
  },
  "tags": [],
  "servers": [],
  "components": {
    "securitySchemes": {
      "basic": {
        "type": "http",
        "scheme": "basic"
      }
    },
    "schemas": {
      "FindByAccountMap": {
        "type": "object",
        "properties": {
          "map": {
            "type": "object",
            "additionalProperties": {
              "type": "string"
            }
          }
        },
        "required": [
          "map"
        ]
      },
      "AccountAvatar": {
        "type": "object",
        "properties": {
          "avatarUrl": {
            "type": "string"
          },
          "width": {
            "type": "number"
          },
          "height": {
            "type": "number"
          }
        },
        "required": [
          "avatarUrl",
          "width",
          "height"
        ]
      },
      "Account": {
        "type": "object",
        "properties": {
          "createdAt": {
            "type": "number"
          },
          "updatedAt": {
            "type": "number"
          },
          "id": {
            "type": "string"
          },
          "firstName": {
            "type": "string"
          },
          "lastName": {
            "type": "string"
          },
          "avatar": {
            "$ref": "#/components/schemas/AccountAvatar"
          },
          "email": {
            "type": "string"
          },
          "emailVerified": {
            "type": "boolean"
          },
          "gender": {
            "type": "string",
            "enum": [
              "male",
              "female"
            ]
          },
          "status": {
            "type": "string",
            "enum": [
              "allowed",
              "blocked"
            ]
          },
          "phoneNumber": {
            "type": "string"
          },
          "bio": {
            "type": "string"
          }
        },
        "required": [
          "createdAt",
          "updatedAt",
          "id",
          "firstName",
          "lastName",
          "avatar",
          "email",
          "emailVerified",
          "gender",
          "status",
          "phoneNumber",
          "bio"
        ]
      },
      "CreateAccountInput": {
        "type": "object",
        "properties": {
          "email": {
            "type": "string"
          },
          "firstName": {
            "type": "string"
          },
          "lastName": {
            "type": "string"
          }
        },
        "required": [
          "email"
        ]
      },
      "ChangePersonalDataRequest": {
        "type": "object",
        "properties": {
          "email": {
            "type": "string"
          },
          "firstName": {
            "type": "string"
          },
          "lastName": {
            "type": "string"
          },
          "bio": {
            "type": "string"
          },
          "phoneNumber": {
            "type": "string"
          },
          "gender": {
            "type": "string",
            "enum": [
              "male",
              "female"
            ]
          }
        }
      },
      "ValidatePasswordInput": {
        "type": "object",
        "properties": {
          "challenge": {
            "type": "string"
          }
        },
        "required": [
          "challenge"
        ]
      },
      "ValidatePasswordResponse": {
        "type": "object",
        "properties": {
          "valid": {
            "type": "boolean"
          }
        },
        "required": [
          "valid"
        ]
      },
      "RecoverPasswordResponse": {
        "type": "object",
        "properties": {
          "code": {
            "type": "string"
          },
          "status": {
            "type": "string"
          }
        },
        "required": [
          "code",
          "status"
        ]
      },
      "ValidateRecoveryTokenInput": {
        "type": "object",
        "properties": {
          "token": {
            "type": "string"
          }
        },
        "required": [
          "token"
        ]
      },
      "ValidateRecoveryCodeResponse": {
        "type": "object",
        "properties": {
          "status": {
            "type": "boolean"
          }
        },
        "required": [
          "status"
        ]
      },
      "ValidateRecoveryCodeInput": {
        "type": "object",
        "properties": {
          "code": {
            "type": "string"
          },
          "secret": {
            "type": "string"
          }
        },
        "required": [
          "code",
          "secret"
        ]
      },
      "HasAccountPassword": {
        "type": "object",
        "properties": {
          "state": {
            "type": "boolean"
          }
        },
        "required": [
          "state"
        ]
      },
      "CreateCredentialInput": {
        "type": "object",
        "properties": {
          "challenge": {
            "type": "string"
          }
        },
        "required": [
          "challenge"
        ]
      },
      "CreateCredentialResponse": {
        "type": "object",
        "properties": {
          "state": {
            "type": "boolean"
          }
        },
        "required": [
          "state"
        ]
      },
      "DisableCredentialResponse": {
        "type": "object",
        "properties": {
          "state": {
            "type": "boolean"
          }
        },
        "required": [
          "state"
        ]
      }
    }
  },
  "paths": {
    "/v1/auth/accounts/find/map": {
      "post": {
        "operationId": "findAccountByAll",
        "summary": "",
        "parameters": [
          {
            "name": "size",
            "required": true,
            "in": "query",
            "schema": {
              "type": "number"
            }
          },
          {
            "name": "offset",
            "required": true,
            "in": "query",
            "schema": {
              "type": "number"
            }
          }
        ],
        "requestBody": {
          "required": true,
          "content": {
            "application/json": {
              "schema": {
                "$ref": "#/components/schemas/FindByAccountMap"
              }
            }
          }
        },
        "responses": {
          "200": {
            "description": "",
            "content": {
              "application/json": {
                "schema": {
                  "type": "array",
                  "items": {
                    "$ref": "#/components/schemas/Account"
                  }
                }
              }
            }
          }
        },
        "security": [
          {
            "basic": []
          }
        ],
        "tags": [
          "accounts"
        ]
      }
    },
    "/v1/auth/accounts/{id}": {
      "get": {
        "operationId": "getAccountByIdentifier",
        "summary": "",
        "parameters": [
          {
            "name": "id",
            "required": true,
            "in": "path",
            "schema": {
              "type": "string"
            }
          }
        ],
        "responses": {
          "200": {
            "description": "",
            "content": {
              "application/json": {
                "schema": {
                  "$ref": "#/components/schemas/Account"
                }
              }
            }
          }
        },
        "security": [
          {
            "basic": []
          }
        ],
        "tags": [
          "accounts"
        ]
      }
    },
    "/v1/auth/accounts": {
      "post": {
        "operationId": "createAccount",
        "summary": "",
        "parameters": [],
        "requestBody": {
          "required": true,
          "content": {
            "application/json": {
              "schema": {
                "$ref": "#/components/schemas/CreateAccountInput"
              }
            }
          }
        },
        "responses": {
          "201": {
            "description": "",
            "content": {
              "application/json": {
                "schema": {
                  "$ref": "#/components/schemas/Account"
                }
              }
            }
          }
        },
        "security": [
          {
            "basic": []
          }
        ],
        "tags": [
          "accounts"
        ]
      }
    },
    "/v1/auth/accounts/{id}/email/verify": {
      "get": {
        "operationId": "validateEmail",
        "summary": "",
        "parameters": [
          {
            "name": "id",
            "required": true,
            "in": "path",
            "schema": {
              "type": "string"
            }
          },
          {
            "name": "token",
            "required": true,
            "in": "query",
            "schema": {
              "type": "string"
            }
          }
        ],
        "responses": {
          "200": {
            "description": ""
          }
        },
        "security": [
          {
            "basic": []
          }
        ],
        "tags": [
          "accounts",
          "email"
        ]
      }
    },
    "/v1/auth/accounts/{id}/personal-data": {
      "put": {
        "operationId": "updatePersonalData",
        "summary": "",
        "parameters": [
          {
            "name": "id",
            "required": true,
            "in": "path",
            "schema": {
              "type": "string"
            }
          }
        ],
        "requestBody": {
          "required": true,
          "content": {
            "application/json": {
              "schema": {
                "$ref": "#/components/schemas/ChangePersonalDataRequest"
              }
            }
          }
        },
        "responses": {
          "200": {
            "description": ""
          }
        },
        "security": [
          {
            "basic": []
          }
        ],
        "tags": [
          "account-data"
        ]
      }
    },
    "/v1/auth/accounts/{id}/credentials/{type}/verify": {
      "post": {
        "operationId": "validateCredential",
        "summary": "",
        "parameters": [
          {
            "name": "id",
            "required": true,
            "in": "path",
            "schema": {
              "type": "string"
            }
          },
          {
            "name": "type",
            "required": true,
            "in": "path",
            "schema": {
              "type": "string",
              "enum": [
                "password"
              ]
            }
          }
        ],
        "requestBody": {
          "required": true,
          "content": {
            "application/json": {
              "schema": {
                "$ref": "#/components/schemas/ValidatePasswordInput"
              }
            }
          }
        },
        "responses": {
          "200": {
            "description": "",
            "content": {
              "application/json": {
                "schema": {
                  "$ref": "#/components/schemas/ValidatePasswordResponse"
                }
              }
            }
          }
        },
        "security": [
          {
            "basic": []
          }
        ],
        "tags": [
          "credentials"
        ]
      }
    },
    "/v1/auth/accounts/{identifier}/credentials/{type}/recover": {
      "post": {
        "operationId": "recoverPassword",
        "summary": "",
        "parameters": [
          {
            "name": "identifier",
            "required": true,
            "in": "path",
            "schema": {
              "type": "string"
            }
          },
          {
            "name": "type",
            "required": true,
            "in": "path",
            "schema": {
              "type": "string",
              "enum": [
                "password"
              ]
            }
          }
        ],
        "responses": {
          "200": {
            "description": "",
            "content": {
              "application/json": {
                "schema": {
                  "$ref": "#/components/schemas/RecoverPasswordResponse"
                }
              }
            }
          }
        },
        "security": [
          {
            "basic": []
          }
        ],
        "tags": [
          "credentials"
        ]
      }
    },
    "/v1/auth/accounts/{id}/credentials/{type}/validate-token": {
      "post": {
        "operationId": "validateRecoveryTokenPassword",
        "summary": "",
        "parameters": [
          {
            "name": "id",
            "required": true,
            "in": "path",
            "schema": {
              "type": "string"
            }
          },
          {
            "name": "type",
            "required": true,
            "in": "path",
            "schema": {
              "type": "string",
              "enum": [
                "password"
              ]
            }
          }
        ],
        "requestBody": {
          "required": true,
          "content": {
            "application/json": {
              "schema": {
                "$ref": "#/components/schemas/ValidateRecoveryTokenInput"
              }
            }
          }
        },
        "responses": {
          "200": {
            "description": "",
            "content": {
              "application/json": {
                "schema": {
                  "$ref": "#/components/schemas/ValidateRecoveryCodeResponse"
                }
              }
            }
          }
        },
        "security": [
          {
            "basic": []
          }
        ],
        "tags": [
          "credentials"
        ]
      }
    },
    "/v1/auth/accounts/{id}/credentials/{type}/validate": {
      "post": {
        "operationId": "validateRecoveryPassword",
        "summary": "",
        "parameters": [
          {
            "name": "id",
            "required": true,
            "in": "path",
            "schema": {
              "type": "string"
            }
          },
          {
            "name": "type",
            "required": true,
            "in": "path",
            "schema": {
              "type": "string",
              "enum": [
                "password"
              ]
            }
          }
        ],
        "requestBody": {
          "required": true,
          "content": {
            "application/json": {
              "schema": {
                "$ref": "#/components/schemas/ValidateRecoveryCodeInput"
              }
            }
          }
        },
        "responses": {
          "200": {
            "description": "",
            "content": {
              "application/json": {
                "schema": {
                  "$ref": "#/components/schemas/ValidateRecoveryCodeResponse"
                }
              }
            }
          }
        },
        "security": [
          {
            "basic": []
          }
        ],
        "tags": [
          "credentials"
        ]
      }
    },
    "/v1/auth/accounts/{id}/credentials/{type}": {
      "get": {
        "operationId": "hasCredential",
        "summary": "",
        "parameters": [
          {
            "name": "id",
            "required": true,
            "in": "path",
            "schema": {
              "type": "string"
            }
          },
          {
            "name": "type",
            "required": true,
            "in": "path",
            "schema": {
              "type": "string",
              "enum": [
                "password"
              ]
            }
          }
        ],
        "responses": {
          "200": {
            "description": "",
            "content": {
              "application/json": {
                "schema": {
                  "$ref": "#/components/schemas/HasAccountPassword"
                }
              }
            }
          }
        },
        "security": [
          {
            "basic": []
          }
        ],
        "tags": [
          "credentials"
        ]
      },
      "post": {
        "operationId": "createCredential",
        "summary": "",
        "parameters": [
          {
            "name": "id",
            "required": true,
            "in": "path",
            "schema": {
              "type": "string"
            }
          },
          {
            "name": "type",
            "required": true,
            "in": "path",
            "schema": {
              "type": "string",
              "enum": [
                "password"
              ]
            }
          }
        ],
        "requestBody": {
          "required": true,
          "content": {
            "application/json": {
              "schema": {
                "$ref": "#/components/schemas/CreateCredentialInput"
              }
            }
          }
        },
        "responses": {
          "200": {
            "description": "",
            "content": {
              "application/json": {
                "schema": {
                  "$ref": "#/components/schemas/CreateCredentialResponse"
                }
              }
            }
          }
        },
        "security": [
          {
            "basic": []
          }
        ],
        "tags": [
          "credentials"
        ]
      }
    },
    "/v1/auth/accounts/{id}/credentials/{type}/disable": {
      "put": {
        "operationId": "disableCredential",
        "summary": "",
        "parameters": [
          {
            "name": "id",
            "required": true,
            "in": "path",
            "schema": {
              "type": "string"
            }
          },
          {
            "name": "type",
            "required": true,
            "in": "path",
            "schema": {
              "type": "string",
              "enum": [
                "password"
              ]
            }
          }
        ],
        "responses": {
          "200": {
            "description": "",
            "content": {
              "application/json": {
                "schema": {
                  "$ref": "#/components/schemas/DisableCredentialResponse"
                }
              }
            }
          }
        },
        "security": [
          {
            "basic": []
          }
        ],
        "tags": [
          "credentials"
        ]
      }
    }
  }
}
