<svg xmlns="http://www.w3.org/2000/svg" xmlns:xlink="http://www.w3.org/1999/xlink" viewBox="0 0 762.35 293.38">
    <defs>
        <style>
            .cls-1{fill:none;}.cls-2{clip-path:url(#clip-path);}.cls-3{fill:#b4ff33;}.cls-4{fill:url(#linear-gradient);}.cls-5{fill:url(#linear-gradient-2);}.cls-6{font-size:200px;fill:#b212b2;font-family:Futura-Bold,
            Futura;font-weight:700;letter-spacing:-0.12em;}.cls-7{letter-spacing:-0.11em;}.cls-8{letter-spacing:-0.11em;}
        </style>
        <clipPath id="clip-path">
            <rect class="cls-1" width="287" height="287" rx="45"/>
        </clipPath>
        <linearGradient id="linear-gradient" x1="37.77" y1="143.5" x2="150.47" y2="143.5"
                        gradientUnits="userSpaceOnUse">
            <stop offset="0.55" stop-color="#f0f"/>
            <stop offset="1" stop-color="#93278f"/>
        </linearGradient>
        <linearGradient id="linear-gradient-2" x1="136.53" x2="249.23" xlink:href="#linear-gradient"/>
    </defs>
    <g id="Layer_2" data-name="Layer 2">
        <g id="Layer_1-2" data-name="Layer 1">
            <g id="logo">
                <g class="cls-2">
                    <rect class="cls-3" width="287" height="287"/>
                    <path class="cls-4"
                          d="M59.11,211.84l37.74-43.38h-.7A26.66,26.66,0,0,1,88,172.07a29.24,29.24,0,0,1-5.64.62,42.79,42.79,0,0,1-32-13.85,47.18,47.18,0,0,1-9.26-15.08,50.63,50.63,0,0,1-3.35-18.52,49.48,49.48,0,0,1,3.88-19.66,46,46,0,0,1,11.2-15.87A52.56,52.56,0,0,1,70.57,79,66.73,66.73,0,0,1,94,75.16,67.23,67.23,0,0,1,117.66,79a53.51,53.51,0,0,1,17.73,10.58,45.78,45.78,0,0,1,11.2,15.61,47,47,0,0,1,3.88,19q0,11.28-5,24.42A93.87,93.87,0,0,1,130,174.45L99.14,211.84Zm57.14-87.3a20.87,20.87,0,0,0-1.76-8.55,22.79,22.79,0,0,0-11.73-11.73,21.56,21.56,0,0,0-17.11,0A22.79,22.79,0,0,0,73.92,116a21.65,21.65,0,0,0,0,17.1,22.79,22.79,0,0,0,11.73,11.73,21.56,21.56,0,0,0,17.11,0,22.79,22.79,0,0,0,11.73-11.73A20.87,20.87,0,0,0,116.25,124.54Z"/>
                    <path class="cls-5"
                          d="M157.87,211.84l37.75-43.38h-.71a26.52,26.52,0,0,1-8.11,3.61,29.34,29.34,0,0,1-5.65.62,42.79,42.79,0,0,1-32-13.85,47.36,47.36,0,0,1-9.26-15.08,50.84,50.84,0,0,1-3.35-18.52,49.66,49.66,0,0,1,3.88-19.66,46.1,46.1,0,0,1,11.2-15.87A52.7,52.7,0,0,1,169.34,79a66.65,66.65,0,0,1,23.46-3.88A67.27,67.27,0,0,1,216.43,79a53.36,53.36,0,0,1,17.72,10.58,45.65,45.65,0,0,1,11.2,15.61,46.88,46.88,0,0,1,3.88,19q0,11.28-5,24.42a93.66,93.66,0,0,1-15.44,25.84l-30.86,37.39ZM215,124.54a20.71,20.71,0,0,0-1.77-8.55,22.82,22.82,0,0,0-11.72-11.73,21.56,21.56,0,0,0-17.11,0A22.79,22.79,0,0,0,172.69,116a21.65,21.65,0,0,0,0,17.1,22.79,22.79,0,0,0,11.73,11.73,21.56,21.56,0,0,0,17.11,0,22.82,22.82,0,0,0,11.72-11.73A20.71,20.71,0,0,0,215,124.54Z"/>
                </g>
                <text class="cls-6" transform="translate(261.35 224.59)">t
                    <tspan class="cls-7" x="50.6" y="0">r</tspan>
                    <tspan class="cls-8" x="120.99" y="0">av</tspan>
                    <tspan x="347.59" y="0">l.</tspan>
                </text>
            </g>
        </g>
    </g>
</svg>
