{
  "type": "service_account",
  "project_id": "ntravl",
  "private_key_id": "f8a59a898efb5656de93372adf48b68f5c12262a",
  "private_key": "-----BEGIN PRIVATE KEY-----\nMIIEvAIBADANBgkqhkiG9w0BAQEFAASCBKYwggSiAgEAAoIBAQC3DCW9mU3d88Pa\nElnZ/uHjlL7TTfGZdT44Jk5Gz82LFdoj9faghAFTX49/i3WlfEefdU0k9Sb1kMEO\nPxqlC3/0dJNOv3su+l2ldKt/GOWZUp2DK0cz6r+O1adc6oPDn2LyAgyxKrky240y\nz8InhbmJ4bctYLSFD1ooQtYo8+dAs8xwHIi+GKyXVtbQV2s6IdFdb6ws9CX1f52L\ngivAY4DhaFwerVwcLxvsm1RrLIOKIDgH6nPlrf6I2KjDz5nD2tY0dcMfBA+OdhiU\nX6X7FEoPKa6VMDAlAG6a7C3Fr4Oaulnmt1a+xIYA/oB27SXL97LK5WgW3LibLo8J\nIJJIxUvxAgMBAAECggEANiWzQldHp/j0fh1AlBJoStSU8FfVuKHsglqefCb7dAHG\nUi3vw0LZS4rwnXepGQde/oYKCH02hZzI5wh2vszckHktnDVbYKWyLwAIvSOlw4mj\nS4pxWSO/f6anB/7ddHBBKjq9+2iaeTdmGNpJYjyWCnoJIDTDobrNXiyLQnkH9uTX\n828mPsN8tNDII6IuJ6W7Ih4yv+KjIVEsmEqG5W+47haPqhB6S8nuP0ZkwQM+ElwR\nmWmmE4hZ/fL+GzqFFmNSnBRV0/NE+nnSmvNHIDGx6eMZR0nr0AGm+5OrOe3GEtD1\n8INK4Y7mHP9pGRm23MxDaxsSviS8XMz9UYUwcDuegwKBgQD0tjs2JBjqx2hqPHjx\nKj/uIXk2lq+OtapeKkZ2rrqvqkYwjxLGPCLSZbZADn3t+t98TemXWgstxoquZwvY\nyHR4xuGojXFegFZBSIVE3cJnETRX1vMTtPNbWki1WaxGD17uXja/C94+X//abGll\nt7QVyLrClcWLAV3Lqb9At1vmMwKBgQC/fbrSKDOKiCYVhjsIrdRlG6ikxIAXtyZj\nI7xSeU3vZeY6ogQ1QA1sIMqaXkei6/hqkzkxyCEdb9UjP7mdYeRk5ZSN0ZVSA9wt\nW1FWD/Bb+BoL9t2yUO8NutEBCk1BOIVyyiy1c6nTIpokwbllePHJB360kYE1R3Nq\nPP56sIq5SwKBgDShSMTRKKa98l/+14gOrSc6/cXWzLUlrxmHgBYgaDhFp8jjzIbk\nAh08EOFf/IeFUDF81ENf802KCOOPeAXMvvgG1huZKAvKEEMEJN110Ey4b4iAy1Cu\ntzQri72tJpb+0Uz06FNYaxkBLpa8gEKHKu0QedJFwfGufozB2kdB6DrvAoGAKk8N\nSAG54ZHTWE4gHPrLQsuppz4DTzoYMS9kHJTQs2RAShQh+eH9FTbpjNHn4gdhC6sb\np/Qf3PEolnEuAafvXpubBvqXk1dm/l5+yhUbdjaLCrmwogVfzBjKtQAhsZdbZNFm\nr3CuxQeQJy7mV5UxVslhJWRAuBThW0e+sjzvaaECgYAocFKabFHDR9FG6oLQp5GS\nFDHdtaNbnu3/ESQKjkIeSBUzSyQnO+7bhJAezedzw0R5jc3elQe+INkrTBMvO9fJ\npIyypJ4xOJgtFzS8p8V3c3pHrf3UYTuH5WyALRS2TbXQr3HNlXoP6+yrS3f6++8k\nIhpkZ5Fe4R4u6YGzonmaog==\n-----END PRIVATE KEY-----\n",
  "client_email": "firebase-adminsdk-yuba4@ntravl.iam.gserviceaccount.com",
  "client_id": "112337019969708878630",
  "auth_uri": "https://accounts.google.com/o/oauth2/auth",
  "token_uri": "https://oauth2.googleapis.com/token",
  "auth_provider_x509_cert_url": "https://www.googleapis.com/oauth2/v1/certs",
  "client_x509_cert_url": "https://www.googleapis.com/robot/v1/metadata/x509/firebase-adminsdk-yuba4%40ntravl.iam.gserviceaccount.com"
}
