{
  "appId": "io.ionic.starter",
  "appName": "lumi_app",
  "bundledWebRuntime": false,
  "npmClient": "npm",
  "webDir": "www",
  "plugins": {
    "SplashScreen": {
      "launchShowDuration": 0
    },
    "LocalNotifications": {
      "smallIcon": "",
      "iconColor": "",
      "sound": "sound.mp3"
    }
  },
  "cordova": {}
}
