-------------------------------------------------------------------------------
Test set: com.notthebest.demo.controller.PersonControllerDiffblueTest
-------------------------------------------------------------------------------
Tests run: 5, Failures: 0, Errors: 0, Skipped: 3, Time elapsed: 9.171 s - in com.notthebest.demo.controller.PersonControllerDiffblueTest
