com\notthebest\demo\controller\PersonControllerDiffblueTest.class
com\notthebest\demo\model\PersonDiffblueTest.class
com\notthebest\demo\SecretsantaApplicationTests.class
com\notthebest\demo\service\PersonServiceDiffblueTest.class
