{
"variables":
 {
"instance_size": "t2.micro",
"ami_name": "ami-jatin",
"base_ami": "ami-18c436",
"ssh_username": "ec2-user",
"vpc_id": "",
"subnet_id": ""
},  
"builders": [
{
"type": "amazon-ebs",
"region": "us-east-1",
"source_ami": "{{user `base_ami`}}",
"instance_type": "{{user `instance_size`}}",
"ssh_username": "{{user `ssh_username`}}",
"associate_public_ip_address": "false",
"ssh_interface":"private_ip",
"ssh_timeout": "10m",
"ami_name": "{{user `ami_name`}}",
"ssh_pty" : "true",
"vpc_id": "{{user `vpc_id`}}",
"subnet_id": "{{user `subnet_id`}}",
"tags": {
"Name": "App Name",
"BuiltBy": "Packer"
}
}
],
"description": "AWS image",
"provisioners": [
{
"type": "shell",
"script":"script.sh"
}
]
}
