{
  "FVNTu8vnH9QMLDH24CPGn7mm2In2": [
    {
      "pulse": 97,
      "deviceId": null,
      "isManual": true,
      "createdAt": "2022-02-20T03:13:32"
    },
    {
      "pulse": 96,
      "deviceId": null,
      "isManual": true,
      "createdAt": "2022-01-02T09:42:46"
    },
    {
      "pulse": 92,
      "deviceId": null,
      "isManual": true,
      "createdAt": "2021-07-26T12:11:54"
    },
    {
      "pulse": 98,
      "deviceId": null,
      "isManual": true,
      "createdAt": "2021-12-01T16:53:04"
    },
    {
      "pulse": 100,
      "deviceId": null,
      "isManual": true,
      "createdAt": "2021-12-05T18:05:57"
    },
    {
      "pulse": 100,
      "deviceId": null,
      "isManual": true,
      "createdAt": "2021-11-22T08:39:08"
    },
    {
      "pulse": 96,
      "deviceId": null,
      "isManual": true,
      "createdAt": "2021-12-13T21:01:54"
    },
    {
      "pulse": 100,
      "deviceId": null,
      "isManual": true,
      "createdAt": "2021-10-23T18:42:41"
    },
    {
      "pulse": 96,
      "deviceId": null,
      "isManual": true,
      "createdAt": "2022-05-25T15:31:59"
    },
    {
      "pulse": 100,
      "deviceId": null,
      "isManual": true,
      "createdAt": "2021-07-20T12:48:55"
    }
  ],
  "HqhGhzsGQjWAtVTGGpLlKx0tlxq2": [
    {
      "pulse": 98,
      "deviceId": null,
      "isManual": true,
      "createdAt": "2021-12-20T17:50:20"
    },
    {
      "pulse": 95,
      "deviceId": null,
      "isManual": true,
      "createdAt": "2021-09-07T15:56:50"
    },
    {
      "pulse": 92,
      "deviceId": null,
      "isManual": true,
      "createdAt": "2021-08-13T18:04:58"
    },
    {
      "pulse": 91,
      "deviceId": null,
      "isManual": true,
      "createdAt": "2021-11-08T17:41:10"
    },
    {
      "pulse": 100,
      "deviceId": null,
      "isManual": true,
      "createdAt": "2022-02-19T05:47:02"
    },
    {
      "pulse": 93,
      "deviceId": null,
      "isManual": true,
      "createdAt": "2021-06-12T15:46:00"
    },
    {
      "pulse": 90,
      "deviceId": null,
      "isManual": true,
      "createdAt": "2022-03-23T05:51:37"
    },
    {
      "pulse": 96,
      "deviceId": null,
      "isManual": true,
      "createdAt": "2021-12-04T16:51:27"
    },
    {
      "pulse": 95,
      "deviceId": null,
      "isManual": true,
      "createdAt": "2022-05-27T03:18:43"
    },
    {
      "pulse": 91,
      "deviceId": null,
      "isManual": true,
      "createdAt": "2021-06-12T16:52:00"
    }
  ],
  "IDj3ExJJtxZiyzmIcqsIXxq0Vck1": [
    {
      "pulse": 92,
      "deviceId": null,
      "isManual": true,
      "createdAt": "2022-04-25T04:08:34"
    },
    {
      "pulse": 100,
      "deviceId": null,
      "isManual": true,
      "createdAt": "2021-06-13T03:34:19"
    },
    {
      "pulse": 95,
      "deviceId": null,
      "isManual": true,
      "createdAt": "2021-07-19T18:39:50"
    },
    {
      "pulse": 92,
      "deviceId": null,
      "isManual": true,
      "createdAt": "2021-06-10T10:16:36"
    },
    {
      "pulse": 99,
      "deviceId": null,
      "isManual": true,
      "createdAt": "2022-05-22T04:05:56"
    },
    {
      "pulse": 95,
      "deviceId": null,
      "isManual": true,
      "createdAt": "2021-12-23T10:44:24"
    },
    {
      "pulse": 97,
      "deviceId": null,
      "isManual": true,
      "createdAt": "2021-11-17T13:20:04"
    },
    {
      "pulse": 96,
      "deviceId": null,
      "isManual": true,
      "createdAt": "2021-06-29T00:22:35"
    },
    {
      "pulse": 99,
      "deviceId": null,
      "isManual": true,
      "createdAt": "2021-07-10T23:22:52"
    },
    {
      "pulse": 98,
      "deviceId": null,
      "isManual": true,
      "createdAt": "2022-02-25T19:38:28"
    }
  ],
  "IlqDGdBNocTL7hlLmki3LE4C5903": [
    {
      "pulse": 98,
      "deviceId": null,
      "isManual": true,
      "createdAt": "2021-11-08T05:35:58"
    },
    {
      "pulse": 91,
      "deviceId": null,
      "isManual": true,
      "createdAt": "2021-07-10T17:58:20"
    },
    {
      "pulse": 98,
      "deviceId": null,
      "isManual": true,
      "createdAt": "2021-07-11T01:31:02"
    },
    {
      "pulse": 97,
      "deviceId": null,
      "isManual": true,
      "createdAt": "2022-04-01T01:34:07"
    },
    {
      "pulse": 92,
      "deviceId": null,
      "isManual": true,
      "createdAt": "2022-04-30T18:18:08"
    },
    {
      "pulse": 92,
      "deviceId": null,
      "isManual": true,
      "createdAt": "2022-04-08T02:06:31"
    },
    {
      "pulse": 96,
      "deviceId": null,
      "isManual": true,
      "createdAt": "2022-05-24T04:56:58"
    },
    {
      "pulse": 96,
      "deviceId": null,
      "isManual": true,
      "createdAt": "2021-12-09T20:28:21"
    },
    {
      "pulse": 90,
      "deviceId": null,
      "isManual": true,
      "createdAt": "2021-08-15T07:29:18"
    },
    {
      "pulse": 99,
      "deviceId": null,
      "isManual": true,
      "createdAt": "2021-11-30T08:52:43"
    }
  ],
  "KpAYX7Q75zXvI8RZsBTBfriebPW2": [
    {
      "pulse": 95,
      "deviceId": null,
      "isManual": true,
      "createdAt": "2022-05-25T05:09:38"
    },
    {
      "pulse": 100,
      "deviceId": null,
      "isManual": true,
      "createdAt": "2021-07-26T01:51:01"
    },
    {
      "pulse": 91,
      "deviceId": null,
      "isManual": true,
      "createdAt": "2021-06-20T09:29:20"
    },
    {
      "pulse": 95,
      "deviceId": null,
      "isManual": true,
      "createdAt": "2022-01-02T23:02:50"
    },
    {
      "pulse": 95,
      "deviceId": null,
      "isManual": true,
      "createdAt": "2022-03-07T07:39:03"
    },
    {
      "pulse": 99,
      "deviceId": null,
      "isManual": true,
      "createdAt": "2021-07-28T06:04:10"
    },
    {
      "pulse": 98,
      "deviceId": null,
      "isManual": true,
      "createdAt": "2021-08-15T15:48:21"
    },
    {
      "pulse": 100,
      "deviceId": null,
      "isManual": true,
      "createdAt": "2022-01-12T10:57:51"
    },
    {
      "pulse": 97,
      "deviceId": null,
      "isManual": true,
      "createdAt": "2021-12-18T15:04:27"
    },
    {
      "pulse": 92,
      "deviceId": null,
      "isManual": true,
      "createdAt": "2022-01-07T01:06:46"
    }
  ],
  "KyLkaqwSyKeRqh3dgQhOjOXJhz43": [
    {
      "pulse": 98,
      "deviceId": null,
      "isManual": true,
      "createdAt": "2021-11-25T20:29:05"
    },
    {
      "pulse": 94,
      "deviceId": null,
      "isManual": true,
      "createdAt": "2021-10-29T09:35:21"
    },
    {
      "pulse": 95,
      "deviceId": null,
      "isManual": true,
      "createdAt": "2021-07-13T12:05:38"
    },
    {
      "pulse": 98,
      "deviceId": null,
      "isManual": true,
      "createdAt": "2022-01-05T10:34:31"
    },
    {
      "pulse": 92,
      "deviceId": null,
      "isManual": true,
      "createdAt": "2021-05-30T11:51:52"
    },
    {
      "pulse": 90,
      "deviceId": null,
      "isManual": true,
      "createdAt": "2022-03-15T18:24:00"
    },
    {
      "pulse": 100,
      "deviceId": null,
      "isManual": true,
      "createdAt": "2021-07-29T00:34:29"
    },
    {
      "pulse": 99,
      "deviceId": null,
      "isManual": true,
      "createdAt": "2021-12-07T10:56:34"
    },
    {
      "pulse": 94,
      "deviceId": null,
      "isManual": true,
      "createdAt": "2021-07-13T17:09:44"
    },
    {
      "pulse": 91,
      "deviceId": null,
      "isManual": true,
      "createdAt": "2021-12-15T11:12:35"
    }
  ],
  "LI9Xb6K4vMaw0UURuomn2PcrcaX2": [
    {
      "pulse": 95,
      "deviceId": null,
      "isManual": true,
      "createdAt": "2021-09-23T12:53:24"
    },
    {
      "pulse": 96,
      "deviceId": null,
      "isManual": true,
      "createdAt": "2022-03-13T12:48:45"
    },
    {
      "pulse": 100,
      "deviceId": null,
      "isManual": true,
      "createdAt": "2021-10-10T14:36:05"
    },
    {
      "pulse": 94,
      "deviceId": null,
      "isManual": true,
      "createdAt": "2021-10-17T09:51:58"
    },
    {
      "pulse": 94,
      "deviceId": null,
      "isManual": true,
      "createdAt": "2021-08-06T14:31:20"
    },
    {
      "pulse": 90,
      "deviceId": null,
      "isManual": true,
      "createdAt": "2022-05-28T11:35:29"
    },
    {
      "pulse": 92,
      "deviceId": null,
      "isManual": true,
      "createdAt": "2022-05-08T16:10:39"
    },
    {
      "pulse": 100,
      "deviceId": null,
      "isManual": true,
      "createdAt": "2021-06-13T07:05:54"
    },
    {
      "pulse": 94,
      "deviceId": null,
      "isManual": true,
      "createdAt": "2021-12-01T07:42:07"
    },
    {
      "pulse": 99,
      "deviceId": null,
      "isManual": true,
      "createdAt": "2022-01-11T23:33:50"
    }
  ],
  "NkyLU7G75zZR27zQiw2WTsE1Hxs2": [
    {
      "pulse": 98,
      "deviceId": null,
      "isManual": true,
      "createdAt": "2021-08-03T16:34:04"
    },
    {
      "pulse": 99,
      "deviceId": null,
      "isManual": true,
      "createdAt": "2022-05-25T02:23:46"
    },
    {
      "pulse": 91,
      "deviceId": null,
      "isManual": true,
      "createdAt": "2021-09-22T20:53:34"
    },
    {
      "pulse": 97,
      "deviceId": null,
      "isManual": true,
      "createdAt": "2021-12-07T14:18:39"
    },
    {
      "pulse": 94,
      "deviceId": null,
      "isManual": true,
      "createdAt": "2022-03-26T21:37:39"
    },
    {
      "pulse": 97,
      "deviceId": null,
      "isManual": true,
      "createdAt": "2021-07-11T23:32:04"
    },
    {
      "pulse": 96,
      "deviceId": null,
      "isManual": true,
      "createdAt": "2022-01-22T02:20:15"
    },
    {
      "pulse": 96,
      "deviceId": null,
      "isManual": true,
      "createdAt": "2022-03-26T02:48:27"
    },
    {
      "pulse": 99,
      "deviceId": null,
      "isManual": true,
      "createdAt": "2022-03-05T08:24:06"
    },
    {
      "pulse": 99,
      "deviceId": null,
      "isManual": true,
      "createdAt": "2021-12-13T10:10:36"
    }
  ],
  "WJWAQuwtHohWiz3I6Zi40RVHAAA3": [
    {
      "pulse": 91,
      "deviceId": null,
      "isManual": true,
      "createdAt": "2021-10-24T15:49:19"
    },
    {
      "pulse": 98,
      "deviceId": null,
      "isManual": true,
      "createdAt": "2021-06-05T16:47:42"
    },
    {
      "pulse": 97,
      "deviceId": null,
      "isManual": true,
      "createdAt": "2021-10-09T03:01:12"
    },
    {
      "pulse": 100,
      "deviceId": null,
      "isManual": true,
      "createdAt": "2022-05-23T04:30:25"
    },
    {
      "pulse": 93,
      "deviceId": null,
      "isManual": true,
      "createdAt": "2022-02-16T06:11:56"
    },
    {
      "pulse": 96,
      "deviceId": null,
      "isManual": true,
      "createdAt": "2021-08-30T10:28:46"
    },
    {
      "pulse": 95,
      "deviceId": null,
      "isManual": true,
      "createdAt": "2021-10-01T05:56:47"
    },
    {
      "pulse": 97,
      "deviceId": null,
      "isManual": true,
      "createdAt": "2022-03-09T05:54:25"
    },
    {
      "pulse": 98,
      "deviceId": null,
      "isManual": true,
      "createdAt": "2022-01-20T00:37:12"
    },
    {
      "pulse": 99,
      "deviceId": null,
      "isManual": true,
      "createdAt": "2021-07-24T15:37:32"
    }
  ],
  "b7P8EV6aEgViDbMdm46Wdh6gUY53": [
    {
      "pulse": 90,
      "deviceId": null,
      "isManual": true,
      "createdAt": "2022-01-13T09:55:04"
    },
    {
      "pulse": 90,
      "deviceId": null,
      "isManual": true,
      "createdAt": "2022-04-21T12:57:55"
    },
    {
      "pulse": 95,
      "deviceId": null,
      "isManual": true,
      "createdAt": "2021-06-13T11:08:24"
    },
    {
      "pulse": 92,
      "deviceId": null,
      "isManual": true,
      "createdAt": "2021-07-26T21:11:36"
    },
    {
      "pulse": 92,
      "deviceId": null,
      "isManual": true,
      "createdAt": "2022-04-16T21:10:38"
    },
    {
      "pulse": 92,
      "deviceId": null,
      "isManual": true,
      "createdAt": "2022-04-28T23:29:40"
    },
    {
      "pulse": 96,
      "deviceId": null,
      "isManual": true,
      "createdAt": "2022-01-22T10:55:09"
    },
    {
      "pulse": 93,
      "deviceId": null,
      "isManual": true,
      "createdAt": "2021-09-28T22:04:29"
    },
    {
      "pulse": 100,
      "deviceId": null,
      "isManual": true,
      "createdAt": "2022-05-18T12:48:49"
    },
    {
      "pulse": 92,
      "deviceId": null,
      "isManual": true,
      "createdAt": "2021-12-06T17:38:03"
    }
  ],
  "bn7AWF9XTZSMuq0ZpRxlJOaxwId2": [
    {
      "pulse": 99,
      "deviceId": null,
      "isManual": true,
      "createdAt": "2021-09-14T04:29:36"
    },
    {
      "pulse": 95,
      "deviceId": null,
      "isManual": true,
      "createdAt": "2021-10-22T20:19:30"
    },
    {
      "pulse": 92,
      "deviceId": null,
      "isManual": true,
      "createdAt": "2022-04-04T23:49:42"
    },
    {
      "pulse": 98,
      "deviceId": null,
      "isManual": true,
      "createdAt": "2021-10-17T14:19:49"
    },
    {
      "pulse": 93,
      "deviceId": null,
      "isManual": true,
      "createdAt": "2021-08-21T04:55:47"
    },
    {
      "pulse": 100,
      "deviceId": null,
      "isManual": true,
      "createdAt": "2021-07-13T07:05:23"
    },
    {
      "pulse": 100,
      "deviceId": null,
      "isManual": true,
      "createdAt": "2022-02-21T10:26:35"
    },
    {
      "pulse": 100,
      "deviceId": null,
      "isManual": true,
      "createdAt": "2021-09-11T18:25:00"
    },
    {
      "pulse": 99,
      "deviceId": null,
      "isManual": true,
      "createdAt": "2021-06-22T18:26:52"
    },
    {
      "pulse": 92,
      "deviceId": null,
      "isManual": true,
      "createdAt": "2021-08-20T02:41:56"
    }
  ],
  "fjFezImDKNbztMIYhALPHWWHwiY2": [
    {
      "pulse": 93,
      "deviceId": null,
      "isManual": true,
      "createdAt": "2021-09-02T13:21:56"
    },
    {
      "pulse": 99,
      "deviceId": null,
      "isManual": true,
      "createdAt": "2022-01-04T00:59:52"
    },
    {
      "pulse": 90,
      "deviceId": null,
      "isManual": true,
      "createdAt": "2021-12-10T11:18:17"
    },
    {
      "pulse": 100,
      "deviceId": null,
      "isManual": true,
      "createdAt": "2021-12-06T13:16:26"
    },
    {
      "pulse": 100,
      "deviceId": null,
      "isManual": true,
      "createdAt": "2021-08-25T06:22:42"
    },
    {
      "pulse": 99,
      "deviceId": null,
      "isManual": true,
      "createdAt": "2022-02-10T19:17:21"
    },
    {
      "pulse": 95,
      "deviceId": null,
      "isManual": true,
      "createdAt": "2021-08-19T12:18:41"
    },
    {
      "pulse": 95,
      "deviceId": null,
      "isManual": true,
      "createdAt": "2021-09-30T02:54:26"
    },
    {
      "pulse": 91,
      "deviceId": null,
      "isManual": true,
      "createdAt": "2021-11-29T11:34:00"
    },
    {
      "pulse": 93,
      "deviceId": null,
      "isManual": true,
      "createdAt": "2022-05-16T01:05:50"
    }
  ],
  "kwk9QQpS9XaT03fPJkibgAaXXnY2": [
    {
      "pulse": 97,
      "deviceId": null,
      "isManual": true,
      "createdAt": "2022-05-10T12:45:43"
    },
    {
      "pulse": 92,
      "deviceId": null,
      "isManual": true,
      "createdAt": "2021-06-15T01:52:37"
    },
    {
      "pulse": 100,
      "deviceId": null,
      "isManual": true,
      "createdAt": "2021-11-21T11:47:43"
    },
    {
      "pulse": 90,
      "deviceId": null,
      "isManual": true,
      "createdAt": "2021-12-05T04:04:02"
    },
    {
      "pulse": 91,
      "deviceId": null,
      "isManual": true,
      "createdAt": "2021-07-24T01:56:59"
    },
    {
      "pulse": 95,
      "deviceId": null,
      "isManual": true,
      "createdAt": "2021-07-21T05:01:33"
    },
    {
      "pulse": 100,
      "deviceId": null,
      "isManual": true,
      "createdAt": "2021-11-26T07:15:29"
    },
    {
      "pulse": 98,
      "deviceId": null,
      "isManual": true,
      "createdAt": "2022-04-26T20:20:09"
    },
    {
      "pulse": 90,
      "deviceId": null,
      "isManual": true,
      "createdAt": "2021-08-13T21:37:01"
    },
    {
      "pulse": 92,
      "deviceId": null,
      "isManual": true,
      "createdAt": "2021-10-29T22:18:15"
    }
  ],
  "mvFP0dIYUMWRwU35nm8zPJ40i993": [
    {
      "pulse": 100,
      "deviceId": null,
      "isManual": true,
      "createdAt": "2021-06-24T02:38:52"
    },
    {
      "pulse": 98,
      "deviceId": null,
      "isManual": true,
      "createdAt": "2022-03-24T13:06:43"
    },
    {
      "pulse": 93,
      "deviceId": null,
      "isManual": true,
      "createdAt": "2021-12-16T03:43:00"
    },
    {
      "pulse": 93,
      "deviceId": null,
      "isManual": true,
      "createdAt": "2021-09-08T07:36:03"
    },
    {
      "pulse": 95,
      "deviceId": null,
      "isManual": true,
      "createdAt": "2022-02-11T13:47:15"
    },
    {
      "pulse": 94,
      "deviceId": null,
      "isManual": true,
      "createdAt": "2021-11-20T19:41:46"
    },
    {
      "pulse": 100,
      "deviceId": null,
      "isManual": true,
      "createdAt": "2022-03-31T15:50:19"
    },
    {
      "pulse": 94,
      "deviceId": null,
      "isManual": true,
      "createdAt": "2022-03-28T17:22:13"
    },
    {
      "pulse": 96,
      "deviceId": null,
      "isManual": true,
      "createdAt": "2022-03-10T09:21:07"
    },
    {
      "pulse": 99,
      "deviceId": null,
      "isManual": true,
      "createdAt": "2021-06-19T08:55:12"
    }
  ],
  "rEsooenYdiazbbQm5pHKiMb4IVl1": [
    {
      "pulse": 99,
      "deviceId": null,
      "isManual": true,
      "createdAt": "2022-03-03T01:57:47"
    },
    {
      "pulse": 91,
      "deviceId": null,
      "isManual": true,
      "createdAt": "2021-09-26T04:00:17"
    },
    {
      "pulse": 96,
      "deviceId": null,
      "isManual": true,
      "createdAt": "2022-04-01T14:11:12"
    },
    {
      "pulse": 95,
      "deviceId": null,
      "isManual": true,
      "createdAt": "2021-11-25T17:27:57"
    },
    {
      "pulse": 100,
      "deviceId": null,
      "isManual": true,
      "createdAt": "2021-09-21T20:22:04"
    },
    {
      "pulse": 98,
      "deviceId": null,
      "isManual": true,
      "createdAt": "2022-04-17T00:14:18"
    },
    {
      "pulse": 96,
      "deviceId": null,
      "isManual": true,
      "createdAt": "2021-09-26T06:35:17"
    },
    {
      "pulse": 93,
      "deviceId": null,
      "isManual": true,
      "createdAt": "2022-04-17T02:22:12"
    },
    {
      "pulse": 94,
      "deviceId": null,
      "isManual": true,
      "createdAt": "2021-10-25T14:19:50"
    },
    {
      "pulse": 99,
      "deviceId": null,
      "isManual": true,
      "createdAt": "2021-09-01T14:16:23"
    }
  ],
  "tZ09JOUQCwOqK41Ehx9Zid45GnD2": [
    {
      "pulse": 96,
      "deviceId": null,
      "isManual": true,
      "createdAt": "2022-04-22T08:14:19"
    },
    {
      "pulse": 99,
      "deviceId": null,
      "isManual": true,
      "createdAt": "2021-12-25T11:44:19"
    },
    {
      "pulse": 92,
      "deviceId": null,
      "isManual": true,
      "createdAt": "2021-11-30T17:18:32"
    },
    {
      "pulse": 92,
      "deviceId": null,
      "isManual": true,
      "createdAt": "2021-12-03T20:57:46"
    },
    {
      "pulse": 99,
      "deviceId": null,
      "isManual": true,
      "createdAt": "2022-04-23T08:01:34"
    },
    {
      "pulse": 92,
      "deviceId": null,
      "isManual": true,
      "createdAt": "2021-12-15T17:55:09"
    },
    {
      "pulse": 94,
      "deviceId": null,
      "isManual": true,
      "createdAt": "2021-08-30T17:20:24"
    },
    {
      "pulse": 93,
      "deviceId": null,
      "isManual": true,
      "createdAt": "2022-04-24T04:36:20"
    },
    {
      "pulse": 90,
      "deviceId": null,
      "isManual": true,
      "createdAt": "2021-10-25T19:38:39"
    },
    {
      "pulse": 93,
      "deviceId": null,
      "isManual": true,
      "createdAt": "2022-02-26T03:42:01"
    }
  ],
  "thkDfFaoT4fudOTOLyZ4l77ghtX2": [
    {
      "pulse": 91,
      "deviceId": null,
      "isManual": true,
      "createdAt": "2021-07-12T07:03:33"
    },
    {
      "pulse": 97,
      "deviceId": null,
      "isManual": true,
      "createdAt": "2022-05-14T14:08:41"
    },
    {
      "pulse": 100,
      "deviceId": null,
      "isManual": true,
      "createdAt": "2021-09-22T03:09:11"
    },
    {
      "pulse": 97,
      "deviceId": null,
      "isManual": true,
      "createdAt": "2021-10-11T23:24:16"
    },
    {
      "pulse": 92,
      "deviceId": null,
      "isManual": true,
      "createdAt": "2021-12-12T05:21:19"
    },
    {
      "pulse": 94,
      "deviceId": null,
      "isManual": true,
      "createdAt": "2022-04-02T15:13:59"
    },
    {
      "pulse": 99,
      "deviceId": null,
      "isManual": true,
      "createdAt": "2021-07-30T02:38:55"
    },
    {
      "pulse": 92,
      "deviceId": null,
      "isManual": true,
      "createdAt": "2022-04-29T10:57:14"
    },
    {
      "pulse": 96,
      "deviceId": null,
      "isManual": true,
      "createdAt": "2021-10-05T16:49:06"
    },
    {
      "pulse": 91,
      "deviceId": null,
      "isManual": true,
      "createdAt": "2022-04-02T12:23:49"
    }
  ],
  "vkdGTsD5G2d5bICSN3aSYbpJW5o1": [
    {
      "pulse": 95,
      "deviceId": null,
      "isManual": true,
      "createdAt": "2021-08-07T02:30:03"
    },
    {
      "pulse": 96,
      "deviceId": null,
      "isManual": true,
      "createdAt": "2022-02-26T10:06:35"
    },
    {
      "pulse": 96,
      "deviceId": null,
      "isManual": true,
      "createdAt": "2021-08-12T08:27:11"
    },
    {
      "pulse": 93,
      "deviceId": null,
      "isManual": true,
      "createdAt": "2022-03-06T20:42:54"
    },
    {
      "pulse": 93,
      "deviceId": null,
      "isManual": true,
      "createdAt": "2021-08-04T03:56:13"
    },
    {
      "pulse": 99,
      "deviceId": null,
      "isManual": true,
      "createdAt": "2022-02-14T20:31:23"
    },
    {
      "pulse": 96,
      "deviceId": null,
      "isManual": true,
      "createdAt": "2022-05-04T13:51:36"
    },
    {
      "pulse": 99,
      "deviceId": null,
      "isManual": true,
      "createdAt": "2021-07-22T20:56:05"
    },
    {
      "pulse": 99,
      "deviceId": null,
      "isManual": true,
      "createdAt": "2021-09-18T06:20:29"
    },
    {
      "pulse": 99,
      "deviceId": null,
      "isManual": true,
      "createdAt": "2022-05-27T22:51:47"
    }
  ],
  "xSB6wettwqM3T4Nhs9qvcCvYsHU2": [
    {
      "pulse": 92,
      "deviceId": null,
      "isManual": true,
      "createdAt": "2021-08-10T06:04:15"
    },
    {
      "pulse": 100,
      "deviceId": null,
      "isManual": true,
      "createdAt": "2021-12-23T01:59:24"
    },
    {
      "pulse": 100,
      "deviceId": null,
      "isManual": true,
      "createdAt": "2021-07-23T04:34:55"
    },
    {
      "pulse": 99,
      "deviceId": null,
      "isManual": true,
      "createdAt": "2022-04-14T15:32:57"
    },
    {
      "pulse": 94,
      "deviceId": null,
      "isManual": true,
      "createdAt": "2022-03-17T15:33:16"
    },
    {
      "pulse": 92,
      "deviceId": null,
      "isManual": true,
      "createdAt": "2021-12-13T01:28:03"
    },
    {
      "pulse": 99,
      "deviceId": null,
      "isManual": true,
      "createdAt": "2021-09-18T20:25:42"
    },
    {
      "pulse": 92,
      "deviceId": null,
      "isManual": true,
      "createdAt": "2022-04-27T05:18:18"
    },
    {
      "pulse": 96,
      "deviceId": null,
      "isManual": true,
      "createdAt": "2021-08-13T14:17:58"
    },
    {
      "pulse": 93,
      "deviceId": null,
      "isManual": true,
      "createdAt": "2021-11-20T00:59:17"
    }
  ],
  "y6KzbaljzyPi8hpcw9gNHATcWqL2": [
    {
      "pulse": 94,
      "deviceId": null,
      "isManual": true,
      "createdAt": "2021-06-02T09:33:41"
    },
    {
      "pulse": 94,
      "deviceId": null,
      "isManual": true,
      "createdAt": "2021-09-04T22:58:39"
    },
    {
      "pulse": 99,
      "deviceId": null,
      "isManual": true,
      "createdAt": "2021-11-01T17:15:28"
    },
    {
      "pulse": 94,
      "deviceId": null,
      "isManual": true,
      "createdAt": "2021-11-21T01:22:24"
    },
    {
      "pulse": 94,
      "deviceId": null,
      "isManual": true,
      "createdAt": "2022-02-11T05:49:43"
    },
    {
      "pulse": 93,
      "deviceId": null,
      "isManual": true,
      "createdAt": "2021-06-23T20:45:41"
    },
    {
      "pulse": 99,
      "deviceId": null,
      "isManual": true,
      "createdAt": "2021-09-12T13:06:47"
    },
    {
      "pulse": 98,
      "deviceId": null,
      "isManual": true,
      "createdAt": "2022-03-21T11:01:06"
    },
    {
      "pulse": 95,
      "deviceId": null,
      "isManual": true,
      "createdAt": "2021-11-17T16:08:30"
    },
    {
      "pulse": 90,
      "deviceId": null,
      "isManual": true,
      "createdAt": "2022-05-11T22:23:48"
    }
  ],
  "zUCfqGAe5gUdcecoxHGJLyccSMx1": [
    {
      "pulse": 90,
      "deviceId": null,
      "isManual": true,
      "createdAt": "2021-09-06T17:46:44"
    },
    {
      "pulse": 91,
      "deviceId": null,
      "isManual": true,
      "createdAt": "2021-07-31T01:23:42"
    },
    {
      "pulse": 99,
      "deviceId": null,
      "isManual": true,
      "createdAt": "2022-04-18T00:29:17"
    },
    {
      "pulse": 98,
      "deviceId": null,
      "isManual": true,
      "createdAt": "2021-09-18T20:23:35"
    },
    {
      "pulse": 95,
      "deviceId": null,
      "isManual": true,
      "createdAt": "2022-04-16T02:05:54"
    },
    {
      "pulse": 97,
      "deviceId": null,
      "isManual": true,
      "createdAt": "2021-07-31T23:38:11"
    },
    {
      "pulse": 93,
      "deviceId": null,
      "isManual": true,
      "createdAt": "2022-05-28T22:39:11"
    },
    {
      "pulse": 96,
      "deviceId": null,
      "isManual": true,
      "createdAt": "2022-01-31T15:56:56"
    },
    {
      "pulse": 91,
      "deviceId": null,
      "isManual": true,
      "createdAt": "2022-03-03T09:14:53"
    },
    {
      "pulse": 90,
      "deviceId": null,
      "isManual": true,
      "createdAt": "2022-05-15T04:46:30"
    }
  ]
}