{
  "userroles":[
    {
      "name": "EndDashboardUser",
      "description": "EndDashboardUser",
      "id": "EndDashboardUser"
    },
    {
      "name": "EnvDashboardAdmin",
      "description": "",
      "id": "EnvDashboardAdmin",
      "defaultMapping": {}
    }
  ]
}