{
    "fieldValidators": [],
    "objectFunctions": [],
    "objectValidators": [],
    "triggers": [
        {
            "active": "inactive",
            "description": "populateProductTypeDesc",
            "displayName": "populateProductTypeDesc",
            "lastUpdate": "2020-10-14T18:19:30",
            "oid": "5b46a109-7aed-4241-a017-f9218d298e52",
            "scriptMimeType": "application/x-adf-groovy",
            "triggerEvents": [
                "AfterTransactionPosted"
            ],
            "workflow": {
                "nodeType": "criterion",
                "type": "always",
                "displayName": "Always Execute",
                "outcomes": {
                    "false": {
                        "for": "trigger",
                        "nodeType": "terminus",
                        "type": "end"
                    },
                    "true": {
                        "nodeType": "actionGroup",
                        "displayName": "Action Group",
                        "after": {
                            "nodeType": "terminus",
                            "type": "continue",
                            "for": "criteria"
                        }
                    }
                }
            }
        }
      ],
    "fieldTriggers": []
}