{
    "fields": [
        {
            "displayLabel": "Id",
            "internal": true,
            "key": true,
            "name": "id",
            "oid": "fd3f7c4c-2dbb-471a-8193-b6ffff15c63b",
            "required": true,
            "type": "number",
            "unique": true
        },
        {
            "displayLabel": "Created",
            "internal": true,
            "name": "creationDate",
            "oid": "76501c2a-f04b-4da6-9893-3d5d4821448e",
            "type": "datetime"
        },
        {
            "displayLabel": "Last Updated",
            "internal": true,
            "name": "lastUpdateDate",
            "oid": "a363d6dd-34f3-44f8-a215-8098cc34919c",
            "type": "datetime"
        },
        {
            "displayLabel": "Created By",
            "internal": true,
            "name": "createdBy",
            "oid": "fab03ead-1c72-45b5-bbd5-7135f05d788c",
            "type": "string"
        },
        {
            "displayLabel": "Last Updated By",
            "internal": true,
            "name": "lastUpdatedBy",
            "oid": "164c4d35-bb8e-493c-b313-dbe0d7b30448",
            "type": "string"
        },
        {
            "displayLabel": "<internal>",
            "hidden": true,
            "internal": true,
            "name": "abcsChangeNumber",
            "oid": "fcb51446-f161-4326-9e15-202014514223",
            "type": "number"
        },
        {
            "name": "teancyName",
            "oid": "c6045cd0-e83f-400f-8bd3-90597ea2c169",
            "displayLabel": "teancyName",
            "type": "reference"
        },
        {
            "name": "compartment",
            "oid": "1a7ce815-be20-49ad-b3f6-478162d7919d",
            "displayLabel": "Compartment",
            "type": "reference"
        },
        {
            "name": "uRL",
            "format": "uri",
            "oid": "8d88d158-f549-4e4f-a247-5886b2c1de10",
            "displayLabel": "URL",
            "type": "string"
        },
        {
            "name": "comments",
            "oid": "2c000a9e-7764-4809-bcf1-be69d0d81608",
            "displayLabel": "Comments",
            "type": "string"
        },
        {
            "name": "administrator",
            "oid": "8dc72b6d-8338-4e54-8cc8-761f80371f8b",
            "displayLabel": "Administrator",
            "type": "string"
        },
        {
            "name": "administratorEmail",
            "format": "email",
            "oid": "1a55f801-9c8d-4a04-961f-018e1894d186",
            "displayLabel": "Administrator Email",
            "type": "string"
        },
        {
            "name": "productName",
            "oid": "bc1e275b-ea5c-47f5-8cba-da88a903f5a8",
            "displayLabel": "productName",
            "type": "reference"
        },
        {
            "name": "environmentName",
            "oid": "081f25d9-e1b7-4764-891f-cf5906db5abe",
            "displayLabel": "Environment",
            "type": "string"
        },
        {
            "name": "tenancyNameDesc",
            "oid": "ab3a6fe3-8081-4790-991f-87bef2bbc6d7",
            "displayLabel": "Tenancy",
            "type": "string",
            "formula": {
                "server": {
                    "type": "groovy",
                    "value": "teancyNameObject.tenancyName"
                }
            },
            "updatable": false
        },
        {
            "name": "compartmentNameDesc",
            "oid": "e43724c5-c150-45ff-b13e-8702de4a0492",
            "displayLabel": "Compartment",
            "type": "string",
            "formula": {
                "server": {
                    "type": "groovy",
                    "value": "compartmentObject.compartmentName"
                }
            },
            "updatable": false
        },
        {
            "formula": {
                "server": {
                    "type": "groovy",
                    "value": "productNameObject.productName"
                }
            },
            "name": "productNameDesc",
            "oid": "69126da9-5be8-4f60-a2cb-9718795f0ec5",
            "updatable": false,
            "displayLabel": "Product",
            "type": "string"
        },
        {
            "name": "additionalDetails",
            "oid": "724a7daf-2418-4d50-8e4b-4b382e8cb67f",
            "displayLabel": "Additional Details",
            "type": "string"
        }
    ],
    "name": "EnvironmentBO",
    "oid": "1c2bb96b-493e-4517-ab46-a829434e9f1f",
    "displayLabel": "EnvironmentBO",
    "relationships": [
        {
            "name": "teancyNameObject",
            "reverseRelationship": "environmentBOCollection",
            "targetEntity": "TenancyBO",
            "type": "outgoing",
            "exposeAccessor": true,
            "mappingField": "teancyName",
            "deleteRule": "restrict"
        },
        {
            "name": "compartmentObject",
            "reverseRelationship": "environmentBOCollection",
            "targetEntity": "CompartmentBO",
            "type": "outgoing",
            "exposeAccessor": true,
            "mappingField": "compartment",
            "deleteRule": "restrict"
        },
        {
            "name": "productNameObject",
            "reverseRelationship": "environmentBOCollection",
            "targetEntity": "ProductLovBO",
            "type": "outgoing",
            "exposeAccessor": true,
            "mappingField": "productName",
            "deleteRule": "restrict"
        },
        {
            "name": "environmentChangeLogCol",
            "reverseRelationship": "envIdObject",
            "targetEntity": "EnvChangeLogBO",
            "type": "incoming",
            "exposeAccessor": false,
            "displayField": "environmentName"
        }
    ]
}