{
    "fields": [
        {
            "displayLabel": "Id",
            "internal": true,
            "key": true,
            "name": "id",
            "oid": "f2f4c3d7-42b8-47c2-8fd6-6b2c4774e1a2",
            "required": true,
            "type": "number",
            "unique": true
        },
        {
            "displayLabel": "Created",
            "internal": true,
            "name": "creationDate",
            "oid": "51f4a3cf-b956-4350-8aeb-83b9370d66ad",
            "type": "datetime"
        },
        {
            "displayLabel": "Last Updated",
            "internal": true,
            "name": "lastUpdateDate",
            "oid": "2fdbad85-9f23-47f6-be4c-6754d4013f72",
            "type": "datetime"
        },
        {
            "displayLabel": "Created By",
            "internal": true,
            "name": "createdBy",
            "oid": "85b4f680-f716-4dcc-b995-60ed83543138",
            "type": "string"
        },
        {
            "displayLabel": "Last Updated By",
            "internal": true,
            "name": "lastUpdatedBy",
            "oid": "0bda42ad-d66b-43c0-98df-1eb8f18f1bc8",
            "type": "string"
        },
        {
            "displayLabel": "<internal>",
            "hidden": true,
            "internal": true,
            "name": "abcsChangeNumber",
            "oid": "483ff060-fb09-4a6d-a576-b3db0b8fd687",
            "type": "number"
        },
        {
            "name": "productType",
            "oid": "7daa6812-4bc7-4ec6-ab40-5dc28ac111c1",
            "displayLabel": "Product Type",
            "type": "reference"
        },
        {
            "name": "productName",
            "oid": "6d5dc63b-3998-4e15-8887-a7aad84a0ed3",
            "displayLabel": "Product Name",
            "type": "string"
        },
        {
            "name": "description",
            "oid": "638e4cfb-6fed-419e-bc9f-bbdb7cf73bfb",
            "displayLabel": "Description",
            "type": "string"
        },
        {
            "name": "productTypeDesc",
            "oid": "8307b1cb-dbbd-4d40-8a02-2c8e8655a70d",
            "displayLabel": "Product Type",
            "type": "string",
            "formula": {
                "server": {
                    "type": "groovy",
                    "value": "productTypeObject.productType"
                }
            },
            "updatable": false
        }
    ],
    "name": "ProductLovBO",
    "oid": "314b6e01-264f-4f7c-8019-58fd2c759117",
    "displayLabel": "ProductLovBO",
    "relationships": [
        {
            "name": "productTypeObject",
            "reverseRelationship": "productLovBOCollection",
            "targetEntity": "ProductTypeLovBO",
            "type": "outgoing",
            "exposeAccessor": true,
            "mappingField": "productType",
            "deleteRule": "restrict"
        },
        {
            "name": "environmentBOCollection",
            "reverseRelationship": "productNameObject",
            "targetEntity": "EnvironmentBO",
            "type": "incoming",
            "exposeAccessor": false,
            "displayField": "productName"
        }
    ],
    "triggers": []
}