{
  "flowModelVersion": "19.4.3",
  "id": "admin-tenancy-subflow",
  "description": "Flow main",
  "defaultPage": "admin-tenancy-subflow-start",
  "chains": {},
  "services": {},
  "types": {},
  "variables": {}
}