{
    "fields": [
        {
            "displayLabel": "Id",
            "internal": true,
            "key": true,
            "name": "id",
            "oid": "a44b0cbe-9f9b-4228-b5e8-ef1b89196c22",
            "required": true,
            "type": "number",
            "unique": true
        },
        {
            "displayLabel": "Created",
            "internal": true,
            "name": "creationDate",
            "oid": "b76a9ebf-9e54-4181-a31a-e17335aea074",
            "type": "datetime"
        },
        {
            "displayLabel": "Last Updated",
            "internal": true,
            "name": "lastUpdateDate",
            "oid": "81583d7b-14fa-4b51-806e-508752780672",
            "type": "datetime"
        },
        {
            "displayLabel": "Created By",
            "internal": true,
            "name": "createdBy",
            "oid": "5e6d8e9f-2aa9-4569-93cf-82f845bf4887",
            "type": "string"
        },
        {
            "displayLabel": "Last Updated By",
            "internal": true,
            "name": "lastUpdatedBy",
            "oid": "836daacb-34d2-466f-9897-513e269ae191",
            "type": "string"
        },
        {
            "displayLabel": "<internal>",
            "hidden": true,
            "internal": true,
            "name": "abcsChangeNumber",
            "oid": "51b58b73-a094-48ec-95fb-5121787d4f14",
            "type": "number"
        },
        {
            "name": "productType",
            "oid": "811ad901-5e07-4b0c-83fa-882c3ba505be",
            "displayLabel": "productType",
            "type": "string"
        },
        {
            "name": "description",
            "oid": "e43087e5-0417-4ae5-b0c6-8b186fd0aec5",
            "displayLabel": "Description",
            "type": "string"
        }
    ],
    "name": "ProductTypeLovBO",
    "oid": "59f23347-d2fa-421c-93e7-7ad2a0f66d9e",
    "displayLabel": "ProductTypeLovBO",
    "relationships": [
        {
            "name": "productLovBOCollection",
            "reverseRelationship": "productTypeObject",
            "targetEntity": "ProductLovBO",
            "type": "incoming",
            "exposeAccessor": false,
            "displayField": "productType"
        }
    ]
}