[
    {
        "id":"1",
        "title":"Don number 1",
        "image":"https://catholicreview.org/wp-content/uploads/2021/07/20210623T1100-MOVIE-REVIEW-F9-FAST-SAGA-1250672.jpg"
    },
    {
        "id":"2",
        "title":"Bahuboli",
        "image":"https://fiverr-res.cloudinary.com/images/q_auto,f_auto/gigs/144420796/original/a6f8ea9c2b6381d61eadaf017a714a1392777a55/photoshop-your-face-into-your-favourite-movie-poster.jpeg"
    },
    {
        "id":"3",
        "title":"Moner Manus",
        "image":"https://i.pinimg.com/originals/bc/d5/c9/bcd5c9519581acc60bd60a429ab0c88f.jpg"
    },
    {
        "id":"4",
        "title":"Boss",
        "image":"https://www.washingtonpost.com/graphics/2019/entertainment/oscar-nominees-movie-poster-design/img/black-panther-web.jpg"
    }
]
