<svg width="45" height="41" viewBox="0 0 45 41" version="1.1" xmlns="http://www.w3.org/2000/svg" xmlns:xlink="http://www.w3.org/1999/xlink">
<title>noun_1185808_cc</title>
<desc>Created using Figma</desc>
<g id="Canvas" transform="translate(56735 12413)">
<g id="noun_1185808_cc">
<g id="Vector">
<use xlink:href="#path0_fill" transform="translate(-56712.8 -12381.3)" fill="#E0E0E0"/>
<use xlink:href="#path0_fill" transform="translate(-56712.8 -12381.3)" fill="url(#paint1_linear)"/>
</g>
<g id="Vector">
<use xlink:href="#path1_fill" transform="translate(-56712.8 -12381.3)" fill="#E0E0E0"/>
<use xlink:href="#path1_fill" transform="translate(-56712.8 -12381.3)" fill="url(#paint3_linear)"/>
</g>
<g id="Vector">
<use xlink:href="#path2_fill" transform="translate(-56734.8 -12390.8)" fill="#E0E0E0"/>
<use xlink:href="#path2_fill" transform="translate(-56734.8 -12390.8)" fill="url(#paint5_linear)"/>
</g>
<g id="Vector">
<use xlink:href="#path3_fill" transform="translate(-56712.8 -12381.3)" fill="#E0E0E0"/>
<use xlink:href="#path3_fill" transform="translate(-56712.8 -12381.3)" fill="url(#paint7_linear)"/>
</g>
<g id="Vector">
<use xlink:href="#path4_fill" transform="translate(-56717.4 -12407.9)" fill="#E0E0E0"/>
<use xlink:href="#path4_fill" transform="translate(-56717.4 -12407.9)" fill="url(#paint9_linear)"/>
</g>
<g id="Vector">
<use xlink:href="#path5_fill" transform="translate(-56707.4 -12402.9)" fill="#E0E0E0"/>
<use xlink:href="#path5_fill" transform="translate(-56707.4 -12402.9)" fill="url(#paint11_linear)"/>
</g>
<g id="Vector">
<use xlink:href="#path6_fill" transform="translate(-56709.3 -12397.9)" fill="#E0E0E0"/>
<use xlink:href="#path6_fill" transform="translate(-56709.3 -12397.9)" fill="url(#paint13_linear)"/>
</g>
<g id="Vector">
<use xlink:href="#path7_fill" transform="translate(-56716.5 -12397.9)" fill="#E0E0E0"/>
<use xlink:href="#path7_fill" transform="translate(-56716.5 -12397.9)" fill="url(#paint15_linear)"/>
</g>
<g id="Vector">
<use xlink:href="#path8_fill" transform="translate(-56709.2 -12412.4)" fill="#E0E0E0"/>
<use xlink:href="#path8_fill" transform="translate(-56709.2 -12412.4)" fill="url(#paint17_linear)"/>
</g>
<g id="Vector">
<use xlink:href="#path9_fill" transform="translate(-56712.2 -12397.9)" fill="#E0E0E0"/>
<use xlink:href="#path9_fill" transform="translate(-56712.2 -12397.9)" fill="url(#paint19_linear)"/>
</g>
<g id="Vector">
<use xlink:href="#path10_fill" transform="translate(-56712.2 -12413)" fill="#E0E0E0"/>
<use xlink:href="#path10_fill" transform="translate(-56712.2 -12413)" fill="url(#paint21_linear)"/>
</g>
<g id="Vector">
<use xlink:href="#path11_fill" transform="translate(-56722.3 -12402.9)" fill="#E0E0E0"/>
<use xlink:href="#path11_fill" transform="translate(-56722.3 -12402.9)" fill="url(#paint23_linear)"/>
</g>
<g id="Vector">
<use xlink:href="#path12_fill" transform="translate(-56722.3 -12407.9)" fill="#E0E0E0"/>
<use xlink:href="#path12_fill" transform="translate(-56722.3 -12407.9)" fill="url(#paint25_linear)"/>
</g>
<g id="Vector">
<use xlink:href="#path13_fill" transform="translate(-56720.4 -12412.4)" fill="#E0E0E0"/>
<use xlink:href="#path13_fill" transform="translate(-56720.4 -12412.4)" fill="url(#paint27_linear)"/>
</g>
<g id="Vector">
<use xlink:href="#path14_fill" transform="translate(-56720.4 -12397.9)" fill="#E0E0E0"/>
<use xlink:href="#path14_fill" transform="translate(-56720.4 -12397.9)" fill="url(#paint29_linear)"/>
</g>
<g id="Vector">
<use xlink:href="#path15_fill" transform="translate(-56716.5 -12413)" fill="#E0E0E0"/>
<use xlink:href="#path15_fill" transform="translate(-56716.5 -12413)" fill="url(#paint31_linear)"/>
</g>
<g id="Vector">
<use xlink:href="#path16_fill" transform="translate(-56717.4 -12402.9)" fill="#E0E0E0"/>
<use xlink:href="#path16_fill" transform="translate(-56717.4 -12402.9)" fill="url(#paint33_linear)"/>
</g>
<g id="Vector">
<use xlink:href="#path17_fill" transform="translate(-56707.4 -12407.9)" fill="#E0E0E0"/>
<use xlink:href="#path17_fill" transform="translate(-56707.4 -12407.9)" fill="url(#paint35_linear)"/>
</g>
<g id="Vector">
<use xlink:href="#path18_fill" transform="translate(-56712.2 -12407.9)" fill="#E0E0E0"/>
<use xlink:href="#path18_fill" transform="translate(-56712.2 -12407.9)" fill="url(#paint37_linear)"/>
</g>
<g id="Vector">
<use xlink:href="#path19_fill" transform="translate(-56712.2 -12402.9)" fill="#E0E0E0"/>
<use xlink:href="#path19_fill" transform="translate(-56712.2 -12402.9)" fill="url(#paint39_linear)"/>
</g>
</g>
</g>
<defs>
<linearGradient id="paint1_linear" x1="0" y1="0" x2="1" y2="0" gradientUnits="userSpaceOnUse" gradientTransform="matrix(0.0349402 0.0628422 -0.520638 15.5071 0.260677 -7.74918)">
<stop offset="0" stop-color="#2F80ED"/>
<stop offset="1" stop-color="#9B51E0"/>
</linearGradient>
<linearGradient id="paint3_linear" x1="0" y1="0" x2="1" y2="0" gradientUnits="userSpaceOnUse" gradientTransform="matrix(0.0076864 0.0139054 -0.114534 3.43132 0.0573457 -1.71469)">
<stop offset="0" stop-color="#2F80ED"/>
<stop offset="1" stop-color="#9B51E0"/>
</linearGradient>
<linearGradient id="paint5_linear" x1="0" y1="0" x2="1" y2="0" gradientUnits="userSpaceOnUse" gradientTransform="matrix(42.9503 15.9945 -639.996 3946.84 320.438 -1972.31)">
<stop offset="0" stop-color="#2F80ED"/>
<stop offset="1" stop-color="#9B51E0"/>
</linearGradient>
<linearGradient id="paint7_linear" x1="0" y1="0" x2="1" y2="0" gradientUnits="userSpaceOnUse" gradientTransform="matrix(0.0114595 0.0200847 -0.170756 4.95613 0.0854953 -2.47667)">
<stop offset="0" stop-color="#2F80ED"/>
<stop offset="1" stop-color="#9B51E0"/>
</linearGradient>
<linearGradient id="paint9_linear" x1="0" y1="0" x2="1" y2="0" gradientUnits="userSpaceOnUse" gradientTransform="matrix(3.66209 3.18497 -54.5683 785.93 27.3216 -392.744)">
<stop offset="0" stop-color="#2F80ED"/>
<stop offset="1" stop-color="#9B51E0"/>
</linearGradient>
<linearGradient id="paint11_linear" x1="0" y1="0" x2="1" y2="0" gradientUnits="userSpaceOnUse" gradientTransform="matrix(3.80904 3.1476 -56.758 776.708 28.418 -388.135)">
<stop offset="0" stop-color="#2F80ED"/>
<stop offset="1" stop-color="#9B51E0"/>
</linearGradient>
<linearGradient id="paint13_linear" x1="0" y1="0" x2="1" y2="0" gradientUnits="userSpaceOnUse" gradientTransform="matrix(3.81162 2.71712 -56.7965 670.483 28.4373 -335.053)">
<stop offset="0" stop-color="#2F80ED"/>
<stop offset="1" stop-color="#9B51E0"/>
</linearGradient>
<linearGradient id="paint15_linear" x1="0" y1="0" x2="1" y2="0" gradientUnits="userSpaceOnUse" gradientTransform="matrix(2.74544 3.22835 -40.9095 796.635 20.4828 -398.093)">
<stop offset="0" stop-color="#2F80ED"/>
<stop offset="1" stop-color="#9B51E0"/>
</linearGradient>
<linearGradient id="paint17_linear" x1="0" y1="0" x2="1" y2="0" gradientUnits="userSpaceOnUse" gradientTransform="matrix(3.74096 2.66587 -55.7435 657.837 27.91 -328.734)">
<stop offset="0" stop-color="#2F80ED"/>
<stop offset="1" stop-color="#9B51E0"/>
</linearGradient>
<linearGradient id="paint19_linear" x1="0" y1="0" x2="1" y2="0" gradientUnits="userSpaceOnUse" gradientTransform="matrix(2.74578 3.22887 -40.9145 796.762 20.4854 -398.157)">
<stop offset="0" stop-color="#2F80ED"/>
<stop offset="1" stop-color="#9B51E0"/>
</linearGradient>
<linearGradient id="paint21_linear" x1="0" y1="0" x2="1" y2="0" gradientUnits="userSpaceOnUse" gradientTransform="matrix(2.74578 3.22845 -40.9145 796.66 20.4854 -398.106)">
<stop offset="0" stop-color="#2F80ED"/>
<stop offset="1" stop-color="#9B51E0"/>
</linearGradient>
<linearGradient id="paint23_linear" x1="0" y1="0" x2="1" y2="0" gradientUnits="userSpaceOnUse" gradientTransform="matrix(3.80893 3.1476 -56.7563 776.708 28.4171 -388.135)">
<stop offset="0" stop-color="#2F80ED"/>
<stop offset="1" stop-color="#9B51E0"/>
</linearGradient>
<linearGradient id="paint25_linear" x1="0" y1="0" x2="1" y2="0" gradientUnits="userSpaceOnUse" gradientTransform="matrix(3.80882 3.18497 -56.7546 785.93 28.4163 -392.744)">
<stop offset="0" stop-color="#2F80ED"/>
<stop offset="1" stop-color="#9B51E0"/>
</linearGradient>
<linearGradient id="paint27_linear" x1="0" y1="0" x2="1" y2="0" gradientUnits="userSpaceOnUse" gradientTransform="matrix(3.74107 2.66587 -55.7451 657.837 27.9109 -328.734)">
<stop offset="0" stop-color="#2F80ED"/>
<stop offset="1" stop-color="#9B51E0"/>
</linearGradient>
<linearGradient id="paint29_linear" x1="0" y1="0" x2="1" y2="0" gradientUnits="userSpaceOnUse" gradientTransform="matrix(3.81151 2.71712 -56.7948 670.483 28.4364 -335.053)">
<stop offset="0" stop-color="#2F80ED"/>
<stop offset="1" stop-color="#9B51E0"/>
</linearGradient>
<linearGradient id="paint31_linear" x1="0" y1="0" x2="1" y2="0" gradientUnits="userSpaceOnUse" gradientTransform="matrix(2.74544 3.22824 -40.9095 796.609 20.4828 -398.08)">
<stop offset="0" stop-color="#2F80ED"/>
<stop offset="1" stop-color="#9B51E0"/>
</linearGradient>
<linearGradient id="paint33_linear" x1="0" y1="0" x2="1" y2="0" gradientUnits="userSpaceOnUse" gradientTransform="matrix(3.66052 3.1476 -54.5448 776.708 27.3099 -388.135)">
<stop offset="0" stop-color="#2F80ED"/>
<stop offset="1" stop-color="#9B51E0"/>
</linearGradient>
<linearGradient id="paint35_linear" x1="0" y1="0" x2="1" y2="0" gradientUnits="userSpaceOnUse" gradientTransform="matrix(3.80893 3.18497 -56.7563 785.93 28.4171 -392.744)">
<stop offset="0" stop-color="#2F80ED"/>
<stop offset="1" stop-color="#9B51E0"/>
</linearGradient>
<linearGradient id="paint37_linear" x1="0" y1="0" x2="1" y2="0" gradientUnits="userSpaceOnUse" gradientTransform="matrix(3.66254 3.18497 -54.575 785.93 27.325 -392.744)">
<stop offset="0" stop-color="#2F80ED"/>
<stop offset="1" stop-color="#9B51E0"/>
</linearGradient>
<linearGradient id="paint39_linear" x1="0" y1="0" x2="1" y2="0" gradientUnits="userSpaceOnUse" gradientTransform="matrix(3.66085 3.1476 -54.5498 776.708 27.3124 -388.135)">
<stop offset="0" stop-color="#2F80ED"/>
<stop offset="1" stop-color="#9B51E0"/>
</linearGradient>
<path id="path0_fill" d="M 0.0357747 0.069824C 0.0272624 0.0530293 0.0138031 0.0257674 -7.16141e-07 2.1063e-07C 0.0178292 0.0340497 0.0289879 0.0564803 0.0357747 0.069824Z"/>
<path id="path1_fill" d="M -4.63385e-07 2.8084e-07C 0.0115027 0.0228916 0.00943216 0.0181753 -4.63385e-07 2.8084e-07L -4.63385e-07 2.8084e-07Z"/>
<path id="path2_fill" d="M 42.7407 14.3188C 42.9032 14.3196 43.0656 14.3201 43.2312 14.3201C 43.755 14.3201 44.0883 13.737 43.8304 13.2854L 42.6384 11.215C 42.7657 11.2146 42.8929 11.2137 43.0217 11.2137C 43.5233 11.2137 43.8671 10.6677 43.6416 10.2166L 39.9298 0.383402C 39.8139 0.151727 39.571 0.000115088 39.3118 0.000115088C 34.5597 0.000115088 30.084 0.88471 26.7086 2.49148C 24.4109 3.58531 22.7845 6.09002 21.9258 7.58854C 21.0672 6.09002 19.4408 3.58543 17.1434 2.49148C 13.7683 0.88471 9.29291 1.19357e-07 4.54128 1.19357e-07C 4.28488 1.19357e-07 4.0371 0.150347 3.92391 0.381331L 0.18629 10.2145C -0.041818 10.6655 0.303508 11.2137 0.805392 11.2137C 1.00382 11.2137 1.20053 11.2143 1.39608 11.2157L 0.20458 13.2852C -0.0459591 13.7383 0.274175 14.3199 0.803782 14.3199C 0.969198 14.3199 1.13162 14.3194 1.29393 14.3187L 0.0719487 16.7301C -0.174105 17.2222 0.246452 17.8021 0.795039 17.7242L 17.9114 16.1782C 18.2753 17.8479 19.8023 17.7711 21.9399 17.7711C 24.0775 17.7711 25.6043 17.8479 25.9683 16.1782L 43.0858 17.7242C 43.8302 17.8415 44.0349 16.8721 43.963 16.7301L 42.7407 14.3188ZM 2.73034 9.85352C 2.64406 9.83535 2.55618 9.83385 2.47117 9.84857C 2.28723 9.84524 2.10249 9.84225 1.9166 9.84006L 4.96518 1.38533C 9.35583 1.43571 13.456 2.26486 16.55 3.73773C 19.4148 5.10144 21.0619 7.98793 21.2337 9.80693L 21.2381 14.9484C 18.1941 12.7032 11.2594 10.0358 2.73034 9.85352ZM 41.5398 9.84547C 41.4708 9.83592 41.4003 9.8373 41.3305 9.84892C 32.1461 10.0205 25.4419 12.4024 22.6299 14.9207L 22.618 9.80693C 22.7898 7.98793 24.4371 5.10144 27.3022 3.73773C 30.396 2.26509 34.4959 1.43571 38.8863 1.38521L 41.9134 9.83994C 41.7883 9.84156 41.664 9.84351 41.5398 9.84547Z"/>
<path id="path3_fill" d="M 5.47637e-07 4.2126e-07C 0.00425673 0.00828272 0.00736141 0.0148396 0.0117326 0.0223166C 0.00471568 0.00897294 5.47637e-07 4.2126e-07 5.47637e-07 4.2126e-07Z"/>
<path id="path4_fill" d="M 3.74958 -2.94882e-07L 0.486124 -2.94882e-07C 0.2181 1.0836 0.0476227 2.28074 -5.05511e-07 3.53884L 3.74958 3.53884L 3.74958 -2.94882e-07Z"/>
<path id="path5_fill" d="M 3.08924e-07 3.49732L 2.92618 3.49732C 3.46292 2.43028 3.80284 1.24936 3.90004 1.05315e-08L 0.439537 1.05315e-08C 0.394905 1.23832 0.243753 2.41441 3.08924e-07 3.49732Z"/>
<path id="path6_fill" d="M 7.02099e-08 3.01901C 1.55293 2.37138 2.89685 1.32126 3.90269 -1.09703e-09L 1.49265 -1.09703e-09C 1.10396 1.17505 0.596671 2.1978 7.02099e-08 3.01901Z"/>
<path id="path7_fill" d="M 8.56561e-07 -1.09703e-09C 0.685361 1.85017 1.68441 3.17626 2.81104 3.58704L 2.81104 -1.09703e-09L 8.56561e-07 -1.09703e-09Z"/>
<path id="path8_fill" d="M 3.83033 2.96207C 2.83726 1.6713 1.52015 0.642338 3.37008e-07 -1.68504e-07C 0.579301 0.81155 1.0729 1.81394 1.45285 2.96207L 3.83033 2.96207Z"/>
<path id="path9_fill" d="M -4.91469e-07 3.58762C 1.1272 3.17672 2.12625 1.85075 2.81138 7.2404e-09L -4.91469e-07 7.2404e-09L -4.91469e-07 3.58762Z"/>
<path id="path10_fill" d="M 2.81138 3.58716C 2.12625 1.73652 1.12708 0.410778 -4.91469e-07 -8.28477e-07L -4.91469e-07 3.58716L 2.81138 3.58716Z"/>
<path id="path11_fill" d="M 3.46073 1.05315e-08L 3.5105e-07 1.05315e-08C 0.0974324 1.24936 0.437351 2.43028 0.973975 3.49732L 3.89993 3.49732C 3.65641 2.41441 3.50525 1.23832 3.46073 1.05315e-08Z"/>
<path id="path12_fill" d="M 3.89981 -2.94882e-07L 0.995142 -2.94882e-07C 0.445979 1.07762 0.0982375 2.27361 2.87861e-07 3.53884L 3.45912 3.53884C 3.50157 2.28568 3.65341 1.09522 3.89981 -2.94882e-07Z"/>
<path id="path13_fill" d="M 3.83045 7.72309e-07C 2.31042 0.642224 0.993531 1.67141 -1.68504e-07 2.96207L 2.3776 2.96207C 2.75766 1.81371 3.2508 0.811551 3.83045 7.72309e-07Z"/>
<path id="path14_fill" d="M -7.16141e-07 -1.09703e-09C 1.00584 1.32172 2.34964 2.37138 3.90257 3.01901C 3.30567 2.1978 2.79896 1.17505 2.41026 -1.09703e-09L -7.16141e-07 -1.09703e-09Z"/>
<path id="path15_fill" d="M 2.81104 8.00393e-07C 1.68441 0.41078 0.685361 1.73687 8.56561e-07 3.58693L 2.81104 3.58693L 2.81104 8.00393e-07Z"/>
<path id="path16_fill" d="M -4.49343e-07 1.05315e-08C 0.0493482 1.24269 0.219481 2.42591 0.484515 3.49732L 3.74797 3.49732L 3.74797 1.05315e-08L -4.49343e-07 1.05315e-08Z"/>
<path id="path17_fill" d="M 0.440917 3.53884L 3.89993 3.53884C 3.8018 2.27349 3.4536 1.07762 2.90478 -2.94882e-07L 3.08924e-07 -2.94882e-07C 0.246399 1.09522 0.398585 2.28568 0.440917 3.53884Z"/>
<path id="path18_fill" d="M 3.75004 3.53884C 3.70253 2.28062 3.53206 1.0836 3.26392 -2.94882e-07L -3.65092e-07 -2.94882e-07L -3.65092e-07 3.53884L 3.75004 3.53884Z"/>
<path id="path19_fill" d="M -4.91469e-07 3.49732L 3.26369 3.49732C 3.52895 2.42591 3.69885 1.24257 3.74832 1.05315e-08L -4.91469e-07 1.05315e-08L -4.91469e-07 3.49732Z"/>
</defs>
</svg>
