[{
        "currentMetadata": {
            "identificationMetadata": {
                "clinicalProgrammeName": "CDISC Development programme",
                "projectName": "CDISC Dev",
                "projectNumber": "CDISC DEV",
                "registryIdentifiers": {
                    "ctGovId": null,
                    "ctGovIdNullValueCode": null,
                    "eudractId": null,
                    "eudractIdNullValueCode": null,
                    "investigationalNewDrugApplicationNumberIND": null,
                    "investigationalNewDrugApplicationNumberINDNullValueCode": null,
                    "japaneseTrialRegistryIdJAPIC": null,
                    "japaneseTrialRegistryIdJAPICNullValueCode": null,
                    "universalTrialNumberUTN": null,
                    "universalTrialNumberUTNNullValueCode": null
                },
                "studyAcronym": null,
                "studyId": "CDISC DEV-9999",
                "studyNumber": "9999"
            },
            "versionMetadata": {
                "lockedVersionAuthor": null,
                "lockedVersionInfo": null,
                "lockedVersionNumber": null,
                "studyStatus": "DRAFT",
                "versionTimestamp": "2022-06-20T23:35:02.378816"
            }
        },
        "projectNumber": "CDISC DEV",
        "studyAcronym": null,
        "studyId": "CDISC DEV-9999",
        "studyNumber": "9999",
        "studyStatus": "DRAFT",
        "uid": "Study_000001"
    },
    {
        "currentMetadata": {
            "identificationMetadata": {
                "clinicalProgrammeName": "CDISC Development programme",
                "projectName": "CDISC Dev",
                "projectNumber": "CDISC DEV",
                "registryIdentifiers": {
                    "ctGovId": null,
                    "ctGovIdNullValueCode": null,
                    "eudractId": null,
                    "eudractIdNullValueCode": null,
                    "investigationalNewDrugApplicationNumberIND": null,
                    "investigationalNewDrugApplicationNumberINDNullValueCode": null,
                    "japaneseTrialRegistryIdJAPIC": null,
                    "japaneseTrialRegistryIdJAPICNullValueCode": null,
                    "universalTrialNumberUTN": null,
                    "universalTrialNumberUTNNullValueCode": null
                },
                "studyAcronym": null,
                "studyId": "CDISC DEV-1234",
                "studyNumber": "1234"
            },
            "versionMetadata": {
                "lockedVersionAuthor": null,
                "lockedVersionInfo": null,
                "lockedVersionNumber": null,
                "studyStatus": "DRAFT",
                "versionTimestamp": "2022-06-20T23:35:02.378816"
            }
        },
        "projectNumber": "CDISC DEV",
        "studyAcronym": null,
        "studyId": "CDISC DEV-1234",
        "studyNumber": "1234",
        "studyStatus": "DRAFT",
        "uid": "Study_000002"
    }
]