[
   {
      "name": "Test POST create activity",
      "request": {
         "headers": {},
         "method": "POST",
         "request": {
            "name": "new_name",
            "nameSentenceCase": "name_sentence_case",
            "definition": "definition",
            "abbreviation": "abbv",
            "libraryName": "Sponsor",
            "activitySubGroup": "activity_sub_group_root1"
         },
         "url": "/concepts/activities/activities"
      },
      "response": {
         "code": 201,
         "headers": {},
         "result": {
            "uid": "Activity_000001",
            "name": "new_name",
            "nameSentenceCase": "name_sentence_case",
            "definition": "definition",
            "abbreviation": "abbv",
            "libraryName": "Sponsor",
            "activitySubGroup": {
                  "uid": "activity_sub_group_root1",
                  "name": "name1"
            },
            "activityGroup": {
                  "uid": "activity_group_root1",
                  "name": "name1"
            },
            "startDate": "2021-03-18T11:54:20.898Z",
            "endDate": null,
            "status": "Draft",
            "version": "0.1",
            "changeDescription": "Initial version",
            "userInitials": "TODO user initials",
            "possibleActions": [
               "approve",
               "delete",
               "edit"
            ]
         }
      }
   },
   {
      "name": "Test GET all activities",
      "request": {
         "headers": {},
         "method": "GET",
         "request": {},
         "url": "/concepts/activities/activities?totalCount=true"
      },
      "response": {
         "code": 200,
         "headers": {},
         "result": {
            "items": [
               {
                  "uid": "activity_root1",
                  "name": "name1",
                  "nameSentenceCase": "name_sentence_case1",
                  "definition": "definition1",
                  "abbreviation": "abbv",
                  "libraryName": "Sponsor",
                  "activitySubGroup": {
                        "uid": "activity_sub_group_root1",
                        "name": "name1"
                  },
                  "activityGroup": {
                        "uid": "activity_group_root1",
                        "name": "name1"
                  },
                  "startDate": "2021-03-18T11:54:20.898Z",
                  "endDate": null,
                  "status": "Final",
                  "version": "1.0",
                  "changeDescription": "Approved version",
                  "userInitials": "TODO user initials",
                  "possibleActions": [
                     "inactivate",
                     "newVersion"
                  ]
               },
               {
                  "uid": "activity_root2",
                  "name": "name2",
                  "nameSentenceCase": "name_sentence_case2",
                  "definition": "definition2",
                  "abbreviation": "abbv",
                  "libraryName": "Sponsor",
                  "activitySubGroup": {
                        "uid": "activity_sub_group_root2",
                        "name": "name2"
                  },
                  "activityGroup": {
                        "uid": "activity_group_root2",
                        "name": "name2"
                  },
                  "startDate": "2021-03-18T11:54:20.898Z",
                  "endDate": null,
                  "status": "Draft",
                  "version": "0.1",
                  "changeDescription": "New draft version",
                  "userInitials": "TODO user initials",
                  "possibleActions": [
                     "approve",
                     "delete",
                     "edit"
                  ]
               },
               {
                  "uid": "Activity_000001",
                  "name": "new_name",
                  "nameSentenceCase": "name_sentence_case",
                  "definition": "definition",
                  "abbreviation": "abbv",
                  "libraryName": "Sponsor",
                  "activitySubGroup": {
                        "uid": "activity_sub_group_root1",
                        "name": "name1"
                  },
                  "activityGroup": {
                        "uid": "activity_group_root1",
                        "name": "name1"
                  },
                  "startDate": "2021-03-18T11:54:20.898Z",
                  "endDate": null,
                  "status": "Draft",
                  "version": "0.1",
                  "changeDescription": "Initial version",
                  "userInitials": "TODO user initials",
                  "possibleActions": [
                     "approve",
                     "delete",
                     "edit"
                  ]
               }
            ],
            "total": 3,
            "page": 1,
            "size": 0
         }
      }
   },
   {
      "name": "Test GET all activities from a given activity sub group",
      "request": {
         "headers": {},
         "method": "GET",
         "request": {},
         "url": "/concepts/activities/activities?activitySubGroupUid=activity_sub_group_root2&totalCount=true"
      },
      "response": {
         "code": 200,
         "headers": {},
         "result": {
            "items": [
               {
                  "uid": "activity_root2",
                  "name": "name2",
                  "nameSentenceCase": "name_sentence_case2",
                  "definition": "definition2",
                  "abbreviation": "abbv",
                  "libraryName": "Sponsor",
                  "activitySubGroup": {
                        "uid": "activity_sub_group_root2",
                        "name": "name2"
                  },
                  "activityGroup": {
                        "uid": "activity_group_root2",
                        "name": "name2"
                  },
                  "startDate": "2021-03-18T11:54:20.898Z",
                  "endDate": null,
                  "status": "Draft",
                  "version": "0.1",
                  "changeDescription": "New draft version",
                  "userInitials": "TODO user initials",
                  "possibleActions": [
                     "approve",
                     "delete",
                     "edit"
                  ]
               }
            ],
            "total": 1,
            "page": 1,
            "size": 0
         }
      }
   },
   {
      "name": "Test GET all activities with a given name",
      "request": {
         "headers": {},
         "method": "GET",
         "request": {},
         "url": "/concepts/activities/activities?activityNames[]=name2&totalCount=true"
      },
      "response": {
         "code": 200,
         "headers": {},
         "result": {
            "items": [
               {
                  "uid": "activity_root2",
                  "name": "name2",
                  "nameSentenceCase": "name_sentence_case2",
                  "definition": "definition2",
                  "abbreviation": "abbv",
                  "libraryName": "Sponsor",
                  "activitySubGroup": {
                        "uid": "activity_sub_group_root2",
                        "name": "name2"
                  },
                  "activityGroup": {
                        "uid": "activity_group_root2",
                        "name": "name2"
                  },
                  "startDate": "2021-03-18T11:54:20.898Z",
                  "endDate": null,
                  "status": "Draft",
                  "version": "0.1",
                  "changeDescription": "New draft version",
                  "userInitials": "TODO user initials",
                  "possibleActions": [
                     "approve",
                     "delete",
                     "edit"
                  ]
               }
            ],
            "total": 1,
            "page": 1,
            "size": 0
         }
      }
   },
   {
      "name": "Test GET all activities from a given activity sub group using name",
      "request": {
         "headers": {},
         "method": "GET",
         "request": {},
         "url": "/concepts/activities/activities?activitySubGroupNames[]=name2&totalCount=true"
      },
      "response": {
         "code": 200,
         "headers": {},
         "result": {
            "items": [
               {
                  "uid": "activity_root2",
                  "name": "name2",
                  "nameSentenceCase": "name_sentence_case2",
                  "definition": "definition2",
                  "abbreviation": "abbv",
                  "libraryName": "Sponsor",
                  "activitySubGroup": {
                        "uid": "activity_sub_group_root2",
                        "name": "name2"
                  },
                  "activityGroup": {
                        "uid": "activity_group_root2",
                        "name": "name2"
                  },
                  "startDate": "2021-03-18T11:54:20.898Z",
                  "endDate": null,
                  "status": "Draft",
                  "version": "0.1",
                  "changeDescription": "New draft version",
                  "userInitials": "TODO user initials",
                  "possibleActions": [
                     "approve",
                     "delete",
                     "edit"
                  ]
               }
            ],
            "total": 1,
            "page": 1,
            "size": 0
         }
      }
   },
   {
      "name": "Test GET all activities from a given activity group using name",
      "request": {
         "headers": {},
         "method": "GET",
         "request": {},
         "url": "/concepts/activities/activities?activityGroupNames[]=name2&totalCount=true"
      },
      "response": {
         "code": 200,
         "headers": {},
         "result": {
            "items": [
               {
                  "uid": "activity_root2",
                  "name": "name2",
                  "nameSentenceCase": "name_sentence_case2",
                  "definition": "definition2",
                  "abbreviation": "abbv",
                  "libraryName": "Sponsor",
                  "activitySubGroup": {
                        "uid": "activity_sub_group_root2",
                        "name": "name2"
                  },
                  "activityGroup": {
                        "uid": "activity_group_root2",
                        "name": "name2"
                  },
                  "startDate": "2021-03-18T11:54:20.898Z",
                  "endDate": null,
                  "status": "Draft",
                  "version": "0.1",
                  "changeDescription": "New draft version",
                  "userInitials": "TODO user initials",
                  "possibleActions": [
                     "approve",
                     "delete",
                     "edit"
                  ]
               }
            ],
            "total": 1,
            "page": 1,
            "size": 0
         }
      }
   },
   {
      "name": "Test POST approve activity",
      "request": {
         "headers": {},
         "method": "POST",
         "request": {},
         "url": "/concepts/activities/activities/Activity_000001/approve"
      },
      "response": {
         "code": 201,
         "headers": {},
         "result": {
            "uid": "Activity_000001",
            "name": "new_name",
            "nameSentenceCase": "name_sentence_case",
            "definition": "definition",
            "abbreviation": "abbv",
            "libraryName": "Sponsor",
            "activitySubGroup": {
                  "uid": "activity_sub_group_root1",
                  "name": "name1"
            },
            "activityGroup": {
                  "uid": "activity_group_root1",
                  "name": "name1"
            },
            "startDate": "2021-03-18T11:54:20.898Z",
            "endDate": null,
            "status": "Final",
            "version": "1.0",
            "changeDescription": "Approved version",
            "userInitials": "TODO user initials",
            "possibleActions": [
               "inactivate",
               "newVersion"
            ]
         }
      }
   },
   {
      "name": "Test POST new-version activity",
      "request": {
         "headers": {},
         "method": "POST",
         "request": {},
         "url": "/concepts/activities/activities/Activity_000001/new-version"
      },
      "response": {
         "code": 201,
         "headers": {},
         "result": {
            "uid": "Activity_000001",
            "name": "new_name",
            "nameSentenceCase": "name_sentence_case",
            "definition": "definition",
            "abbreviation": "abbv",
            "libraryName": "Sponsor",
            "activitySubGroup": {
                  "uid": "activity_sub_group_root1",
                  "name": "name1"
            },
            "activityGroup": {
                  "uid": "activity_group_root1",
                  "name": "name1"
            },
            "startDate": "2021-03-18T11:54:20.898Z",
            "endDate": null,
            "status": "Draft",
            "version": "1.1",
            "changeDescription": "New draft created",
            "userInitials": "TODO user initials",
            "possibleActions": [
               "approve",
               "edit"
            ]
         }
      }
   },
   {
      "name": "Test POST inactivate activity",
      "request": {
         "headers": {},
         "method": "POST",
         "request": {},
         "url": "/concepts/activities/activities/activity_root1/inactivate"
      },
      "response": {
         "code": 201,
         "headers": {},
         "result": {
            "uid": "activity_root1",
            "name": "name1",
            "nameSentenceCase": "name_sentence_case1",
            "definition": "definition1",
            "abbreviation": "abbv",
            "libraryName": "Sponsor",
            "activitySubGroup": {
                  "uid": "activity_sub_group_root1",
                  "name": "name1"
            },
            "activityGroup": {
                  "uid": "activity_group_root1",
                  "name": "name1"
            },
            "startDate": "2021-03-18T11:54:20.898Z",
            "endDate": null,
            "status": "Retired",
            "version": "1.0",
            "changeDescription": "Deactivated version",
            "userInitials": "TODO user initials",
            "possibleActions": [
               "reactivate"
            ]
         }
      }
   },
   {
      "name": "Test POST reactivate activity",
      "request": {
         "headers": {},
         "method": "POST",
         "request": {},
         "url": "/concepts/activities/activities/activity_root1/reactivate"
      },
      "response": {
         "code": 201,
         "headers": {},
         "result": {
            "uid": "activity_root1",
            "name": "name1",
            "nameSentenceCase": "name_sentence_case1",
            "definition": "definition1",
            "abbreviation": "abbv",
            "libraryName": "Sponsor",
            "activitySubGroup": {
                  "uid": "activity_sub_group_root1",
                  "name": "name1"
            },
            "activityGroup": {
                  "uid": "activity_group_root1",
                  "name": "name1"
            },
            "startDate": "2021-03-18T11:54:20.898Z",
            "endDate": null,
            "status": "Final",
            "version": "1.0",
            "changeDescription": "Reactivated version",
            "userInitials": "TODO user initials",
            "possibleActions": [
               "inactivate",
               "newVersion"
            ]
         }
      }
   },
   {
      "name": "Test DELETE activity",
      "request": {
         "headers": {},
         "method": "DELETE",
         "request": {},
         "url": "/concepts/activities/activities/activity_root2"
      },
      "response": {
         "code": 204,
         "headers": {},
         "result": null
      }
   }
]