[
  {
    "acceptedVersion": false,
    "endpoint": {
      "changeDescription": "Approved version",
      "endDate": null,
      "endpointTemplate": {
        "name": "<p>Mean change from baseline in [ActivityInstance]</p>",
        "namePlain": "Mean change from baseline in [ActivityInstance]",
        "uid": "EndpointTemplate_000004"
      },
      "library": {
        "isEditable": true,
        "name": "Sponsor"
      },
      "name": "<p>Mean change from baseline in [hba1c]</p>",
      "namePlain": "Mean change from baseline in hba1c",
      "parameterValues": [
        {
          "conjunction": "",
          "position": 1,
          "values": [
            {
              "index": 1,
              "name": "hba1c",
              "type": "ActivityInstance",
              "uid": "NumericFinding_000191"
            }
          ]
        }
      ],
      "possibleActions": [
        "inactivate"
      ],
      "startDate": "2022-10-20T12:26:38.484886",
      "status": "Final",
      "studyCount": null,
      "uid": "Endpoint_000005",
      "userInitials": "MT",
      "version": "1.0"
    },
    "endpointLevel": {
      "catalogueName": "SDTM CT",
      "changeDescription": "Approved version",
      "codelistUid": "CTCodelist_000004",
      "endDate": null,
      "libraryName": "CDISC",
      "order": 1,
      "possibleActions": [
        "inactivate",
        "newVersion"
      ],
      "sponsorPreferredName": "Primary Endpoint",
      "sponsorPreferredNameSentenceCase": "primary endpoint",
      "startDate": "2022-10-18T12:52:44.445889",
      "status": "Final",
      "termUid": "C98772_OUTMSPRI",
      "userInitials": "MT",
      "version": "2.0"
    },
    "endpointSubLevel": null,
    "endpointUnits": {
      "separator": null,
      "units": [
        "UnitDefinition_000224"
      ]
    },
    "latestEndpoint": null,
    "latestTimeframe": null,
    "order": 1,
    "projectName": "CDISC Dev",
    "projectNumber": "CDISC DEV",
    "startDate": "2022-10-20T12:31:10.459807",
    "studyEndpointUid": "StudyEndpoint_000005",
    "studyObjective": {
      "acceptedVersion": false,
      "endpointCount": 1,
      "latestObjective": null,
      "objective": {
        "changeDescription": "Approved version",
        "endDate": null,
        "library": {
          "isEditable": true,
          "name": "User Defined"
        },
        "name": "<p>Time to first occurrence of MACE+, a composite endpoint consisting of: CV death, nonfatal MI,</p><p>nonfatal stroke, or hospitalization for unstable&nbsp;</p><p>angina</p>",
        "namePlain": "Time to first occurrence of MACE+, a composite endpoint consisting of: CV death, nonfatal MI,nonfatal stroke, or hospitalization for unstable\u00a0angina",
        "objectiveTemplate": {
          "name": "<p>Time to first occurrence of MACE+, a composite endpoint consisting of: CV death, nonfatal MI,</p><p>nonfatal stroke, or hospitalization for unstable&nbsp;</p><p>angina</p>",
          "namePlain": "Time to first occurrence of MACE+, a composite endpoint consisting of: CV death, nonfatal MI,nonfatal stroke, or hospitalization for unstable\u00a0angina",
          "uid": "ObjectiveTemplate_000005"
        },
        "parameterValues": [],
        "possibleActions": [
          "inactivate"
        ],
        "startDate": "2022-10-20T06:32:44.810374",
        "status": "Final",
        "studyCount": null,
        "uid": "Objective_000004",
        "userInitials": "MT",
        "version": "1.0"
      },
      "objectiveLevel": {
        "catalogueName": "SDTM CT",
        "changeDescription": "Approved version",
        "codelistUid": "CTCodelist_000001",
        "endDate": null,
        "libraryName": "CDISC",
        "order": 1,
        "possibleActions": [
          "inactivate",
          "newVersion"
        ],
        "sponsorPreferredName": "Primary Objective",
        "sponsorPreferredNameSentenceCase": "primary objective",
        "startDate": "2022-10-18T12:52:48.896938",
        "status": "Final",
        "termUid": "C85826_OBJPRIM",
        "userInitials": "MT",
        "version": "2.0"
      },
      "order": 1,
      "projectName": "CDISC Dev",
      "projectNumber": "CDISC DEV",
      "startDate": "2022-10-20T06:32:44.904961",
      "studyObjectiveUid": "StudyObjective_000001",
      "studyUid": "Study_000002",
      "userInitials": "MT"
    },
    "studyUid": "Study_000002",
    "timeframe": {
      "changeDescription": "Approved version",
      "endDate": null,
      "library": {
        "isEditable": true,
        "name": "Sponsor"
      },
      "name": "<p>after [26 weeks]</p>",
      "namePlain": "after 26 weeks",
      "parameterValues": [
        {
          "conjunction": "",
          "position": 1,
          "values": [
            {
              "index": 1,
              "name": "26 weeks",
              "type": "StudyDurationWeeks",
              "uid": "NumericValue_000074"
            }
          ]
        }
      ],
      "possibleActions": [
        "inactivate"
      ],
      "startDate": "2022-10-20T12:31:10.060341",
      "status": "Final",
      "timeframeTemplate": {
        "name": "<p>after [StudyDurationWeeks]</p>",
        "namePlain": "after [StudyDurationWeeks]",
        "uid": "TimeframeTemplate_000004"
      },
      "uid": "Timeframe_000004",
      "userInitials": "MT",
      "version": "1.0"
    },
    "userInitials": "MT"
  },
  {
    "acceptedVersion": false,
    "endpoint": {
      "changeDescription": "Approved version",
      "endDate": null,
      "endpointTemplate": {
        "name": "<p>Proportion of subjects with [ActivityInstance] [Operator] [NumericValue] [Unit]</p>",
        "namePlain": "Proportion of subjects with [ActivityInstance] [Operator] [NumericValue] [Unit]",
        "uid": "EndpointTemplate_000005"
      },
      "library": {
        "isEditable": true,
        "name": "Sponsor"
      },
      "name": "<p>Proportion of subjects with [hba1c] [<] [7] [%]</p>",
      "namePlain": "Proportion of subjects with hba1c < 7 %",
      "parameterValues": [
        {
          "conjunction": "",
          "position": 1,
          "values": [
            {
              "index": 1,
              "name": "hba1c",
              "type": "ActivityInstance",
              "uid": "NumericFinding_000191"
            }
          ]
        },
        {
          "conjunction": "",
          "position": 2,
          "values": [
            {
              "index": 1,
              "name": "<",
              "type": "Operator",
              "uid": "TemplateParameterValue_000418"
            }
          ]
        },
        {
          "conjunction": "",
          "position": 3,
          "values": [
            {
              "index": 1,
              "name": "7",
              "type": "7 days after Global anchor visit",
              "uid": "NumericValue_000011"
            }
          ]
        },
        {
          "conjunction": "",
          "position": 4,
          "values": [
            {
              "index": 1,
              "name": "%",
              "type": "Unit",
              "uid": "UnitDefinition_000224"
            }
          ]
        }
      ],
      "possibleActions": [
        "inactivate"
      ],
      "startDate": "2022-10-20T12:28:30.265170",
      "status": "Final",
      "studyCount": null,
      "uid": "Endpoint_000006",
      "userInitials": "MT",
      "version": "1.0"
    },
    "endpointLevel": {
      "catalogueName": "SDTM CT",
      "changeDescription": "Approved version",
      "codelistUid": "CTCodelist_000004",
      "endDate": null,
      "libraryName": "CDISC",
      "order": 2,
      "possibleActions": [
        "inactivate",
        "newVersion"
      ],
      "sponsorPreferredName": "Secondary Endpoint",
      "sponsorPreferredNameSentenceCase": "secondary endpoint",
      "startDate": "2022-10-18T12:52:45.400062",
      "status": "Final",
      "termUid": "C98781_OUTMSSEC",
      "userInitials": "MT",
      "version": "2.0"
    },
    "endpointSubLevel": null,
    "endpointUnits": {
      "separator": null,
      "units": [
        "UnitDefinition_000015"
      ]
    },
    "latestEndpoint": null,
    "latestTimeframe": null,
    "order": 2,
    "projectName": "CDISC Dev",
    "projectNumber": "CDISC DEV",
    "startDate": "2022-10-20T12:31:36.051740",
    "studyEndpointUid": "StudyEndpoint_000008",
    "studyObjective": {
      "acceptedVersion": false,
      "endpointCount": 1,
      "latestObjective": null,
      "objective": {
        "changeDescription": "Approved version",
        "endDate": null,
        "library": {
          "isEditable": true,
          "name": "User Defined"
        },
        "name": "<p>Time from randomisation to all cause death</p>",
        "namePlain": "Time from randomisation to all cause death",
        "objectiveTemplate": {
          "name": "<p>Time from randomisation to all cause death</p>",
          "namePlain": "Time from randomisation to all cause death",
          "uid": "ObjectiveTemplate_000006"
        },
        "parameterValues": [],
        "possibleActions": [
          "inactivate"
        ],
        "startDate": "2022-10-20T12:27:17.588804",
        "status": "Final",
        "studyCount": null,
        "uid": "Objective_000005",
        "userInitials": "MT",
        "version": "1.0"
      },
      "objectiveLevel": {
        "catalogueName": "SDTM CT",
        "changeDescription": "Approved version",
        "codelistUid": "CTCodelist_000001",
        "endDate": null,
        "libraryName": "CDISC",
        "order": 2,
        "possibleActions": [
          "inactivate",
          "newVersion"
        ],
        "sponsorPreferredName": "Secondary Objective",
        "sponsorPreferredNameSentenceCase": "secondary objective",
        "startDate": "2022-10-18T12:52:49.546806",
        "status": "Final",
        "termUid": "C85827_OBJSEC",
        "userInitials": "MT",
        "version": "2.0"
      },
      "order": 2,
      "projectName": "CDISC Dev",
      "projectNumber": "CDISC DEV",
      "startDate": "2022-10-20T12:27:17.685437",
      "studyObjectiveUid": "StudyObjective_000002",
      "studyUid": "Study_000002",
      "userInitials": "MT"
    },
    "studyUid": "Study_000002",
    "timeframe": {
      "changeDescription": "Approved version",
      "endDate": null,
      "library": {
        "isEditable": true,
        "name": "Sponsor"
      },
      "name": "<p>after [26 weeks]</p>",
      "namePlain": "after 26 weeks",
      "parameterValues": [
        {
          "conjunction": "",
          "position": 1,
          "values": [
            {
              "index": 1,
              "name": "26 weeks",
              "type": "StudyDurationWeeks",
              "uid": "NumericValue_000074"
            }
          ]
        }
      ],
      "possibleActions": [
        "inactivate"
      ],
      "startDate": "2022-10-20T12:31:10.060341",
      "status": "Final",
      "timeframeTemplate": {
        "name": "<p>after [StudyDurationWeeks]</p>",
        "namePlain": "after [StudyDurationWeeks]",
        "uid": "TimeframeTemplate_000004"
      },
      "uid": "Timeframe_000004",
      "userInitials": "MT",
      "version": "1.0"
    },
    "userInitials": "MT"
  }
]
