[
    {
        "name": "Create a new odm item group",
        "request": {
            "headers": {},
            "method": "POST",
            "request": {
                "libraryName": "Sponsor",
                "name": "name1",
                "oid": "oid1",
                "repeating": "No",
                "isReferenceData": "No",
                "sasDatasetName": "sasDatasetName1",
                "origin": "origin1",
                "purpose": "purpose1",
                "comment": "comment1",
                "descriptionUids": [
                    "odm_description1",
                    "odm_description2"
                ],
                "aliasUids": [
                    "odm_alias1"
                ],
                "sdtmDomainUids": [
                    "term1"
                ]
            },
            "url": "concepts/odms/item-groups/select"
        },
        "response": {
            "code": 201,
            "headers": {
                "content-length": "459",
                "content-type": "application/json"
            },
            "result": {
                "uid": "OdmItemGroup_000001",
                "libraryName": "Sponsor",
                "name": "name1",
                "oid": "oid1",
                "repeating": "No",
                "isReferenceData": "No",
                "sasDatasetName": "sasDatasetName1",
                "origin": "origin1",
                "purpose": "purpose1",
                "comment": "comment1",
                "startDate": "2022-03-03T11:17:56.799074",
                "endDate": null,
                "status": "Draft",
                "version": "0.1",
                "changeDescription": "Initial version",
                "userInitials": "TODO user initials",
                "descriptions": [
                    {
                        "uid": "odm_description1",
                        "name": "name1",
                        "language": "ENG",
                        "description": "description1",
                        "instruction": "instruction1",
                        "sponsorInstruction": "sponsorInstruction1",
                        "version": "0.1"
                    },
                    {
                        "uid": "odm_description2",
                        "name": "name2",
                        "language": "language2",
                        "description": "description2",
                        "instruction": "instruction2",
                        "sponsorInstruction": "sponsorInstruction2",
                        "version": "0.1"
                    }
                ],
                "aliases": [
                    {
                        "uid": "odm_alias1",
                        "context": "context1",
                        "name": "name1",
                        "version": "0.1"
                    }
                ],
                "sdtmDomains": [
                    {
                        "uid": "term1",
                        "codeSubmissionValue": "code_submission_value1",
                        "preferredTerm": "preferred_term1"
                    }
                ],
                "activitySubGroups": [],
                "items": [],
                "xmlExtensionTags": [],
                "xmlExtensionAttributes": [],
                "xmlExtensionTagAttributes": [],
                "possibleActions": [
                    "approve",
                    "delete",
                    "edit"
                ]
            }
        }
    },
    {
        "name": "Add odm xml extension tag to an odm item group",
        "request": {
            "headers": {},
            "method": "POST",
            "request": [
                {
                    "uid": "odm_xml_extension_tag1",
                    "value": "value1"
                }
            ],
            "url": "concepts/odms/item-groups/OdmItemGroup_000001/add-xml-extension-tags"
        },
        "response": {
            "code": 201,
            "headers": {
                "content-length": "459",
                "content-type": "application/json"
            },
            "result": {
                "uid": "OdmItemGroup_000001",
                "libraryName": "Sponsor",
                "name": "name1",
                "oid": "oid1",
                "repeating": "No",
                "isReferenceData": "No",
                "sasDatasetName": "sasDatasetName1",
                "origin": "origin1",
                "purpose": "purpose1",
                "comment": "comment1",
                "startDate": "2022-03-03T11:17:56.799074",
                "endDate": null,
                "status": "Draft",
                "version": "0.1",
                "changeDescription": "Initial version",
                "userInitials": "TODO user initials",
                "descriptions": [
                    {
                        "uid": "odm_description1",
                        "name": "name1",
                        "language": "ENG",
                        "description": "description1",
                        "instruction": "instruction1",
                        "sponsorInstruction": "sponsorInstruction1",
                        "version": "0.1"
                    },
                    {
                        "uid": "odm_description2",
                        "name": "name2",
                        "language": "language2",
                        "description": "description2",
                        "instruction": "instruction2",
                        "sponsorInstruction": "sponsorInstruction2",
                        "version": "0.1"
                    }
                ],
                "aliases": [
                    {
                        "uid": "odm_alias1",
                        "context": "context1",
                        "name": "name1",
                        "version": "0.1"
                    }
                ],
                "sdtmDomains": [
                    {
                        "uid": "term1",
                        "codeSubmissionValue": "code_submission_value1",
                        "preferredTerm": "preferred_term1"
                    }
                ],
                "activitySubGroups": [],
                "items": [],
                "xmlExtensionTags": [
                    {
                        "uid": "odm_xml_extension_tag1",
                        "name": "nameOne",
                        "value": "value1"
                    }
                ],
                "xmlExtensionAttributes": [],
                "xmlExtensionTagAttributes": [],
                "possibleActions": [
                    "approve",
                    "delete",
                    "edit"
                ]
            }
        }
    },
    {
        "name": "Add odm xml extension tag attribute to an odm item group",
        "request": {
            "headers": {},
            "method": "POST",
            "request": [
                {
                    "uid": "odm_xml_extension_attribute1",
                    "value": "value1"
                }
            ],
            "url": "concepts/odms/item-groups/OdmItemGroup_000001/add-xml-extension-tag-attributes"
        },
        "response": {
            "code": 201,
            "headers": {
                "content-length": "459",
                "content-type": "application/json"
            },
            "result": {
                "uid": "OdmItemGroup_000001",
                "libraryName": "Sponsor",
                "name": "name1",
                "oid": "oid1",
                "repeating": "No",
                "isReferenceData": "No",
                "sasDatasetName": "sasDatasetName1",
                "origin": "origin1",
                "purpose": "purpose1",
                "comment": "comment1",
                "startDate": "2022-03-03T11:17:56.799074",
                "endDate": null,
                "status": "Draft",
                "version": "0.1",
                "changeDescription": "Initial version",
                "userInitials": "TODO user initials",
                "descriptions": [
                    {
                        "uid": "odm_description1",
                        "name": "name1",
                        "language": "ENG",
                        "description": "description1",
                        "instruction": "instruction1",
                        "sponsorInstruction": "sponsorInstruction1",
                        "version": "0.1"
                    },
                    {
                        "uid": "odm_description2",
                        "name": "name2",
                        "language": "language2",
                        "description": "description2",
                        "instruction": "instruction2",
                        "sponsorInstruction": "sponsorInstruction2",
                        "version": "0.1"
                    }
                ],
                "aliases": [
                    {
                        "uid": "odm_alias1",
                        "context": "context1",
                        "name": "name1",
                        "version": "0.1"
                    }
                ],
                "sdtmDomains": [
                    {
                        "uid": "term1",
                        "codeSubmissionValue": "code_submission_value1",
                        "preferredTerm": "preferred_term1"
                    }
                ],
                "activitySubGroups": [],
                "items": [],
                "xmlExtensionTags": [
                    {
                        "uid": "odm_xml_extension_tag1",
                        "name": "nameOne",
                        "value": "value1"
                    }
                ],
                "xmlExtensionAttributes": [],
                "xmlExtensionTagAttributes": [
                    {
                        "uid": "odm_xml_extension_attribute1",
                        "name": "nameOne",
                        "value": "value1",
                        "odmXmlExtensionTagUid": "odm_xml_extension_tag1"
                    }
                ],
                "possibleActions": [
                    "approve",
                    "delete",
                    "edit"
                ]
            }
        }
    },
    {
        "name": "Test cannot create a new odm item group with existing name",
        "request": {
            "headers": {},
            "method": "POST",
            "request": {
                "libraryName": "Sponsor",
                "name": "name1",
                "oid": "oid2",
                "repeating": "No",
                "isReferenceData": "No",
                "sasDatasetName": "sasDatasetName1",
                "origin": "origin1",
                "purpose": "purpose1",
                "comment": "comment1",
                "descriptionUids": [
                    "odm_description1"
                ],
                "aliasUids": [],
                "sdtmDomainUids": []
            },
            "url": "concepts/odms/item-groups/select"
        },
        "response": {
            "code": 400,
            "headers": {
                "content-length": "459",
                "content-type": "application/json"
            },
            "result": {
                "message": "OdmItemGroup with name (name1) already exists.",
                "time": "2022-03-07T12: 14: 18.116363",
                "path": "http://testserver/concepts/odms/item-groups/select",
                "method": "POST",
                "type": "BusinessLogicException"
            }
        }
    },
    {
        "name": "Test cannot create a new odm item group with existing oid",
        "request": {
            "headers": {},
            "method": "POST",
            "request": {
                "libraryName": "Sponsor",
                "name": "name2",
                "oid": "oid1",
                "repeating": "No",
                "isReferenceData": "No",
                "sasDatasetName": "sasDatasetName1",
                "origin": "origin1",
                "purpose": "purpose1",
                "comment": "comment1",
                "descriptionUids": [
                    "odm_description1"
                ],
                "aliasUids": [],
                "sdtmDomainUids": []
            },
            "url": "concepts/odms/item-groups/select"
        },
        "response": {
            "code": 400,
            "headers": {
                "content-length": "459",
                "content-type": "application/json"
            },
            "result": {
                "message": "OdmItemGroup with OID (oid1) already exists.",
                "time": "2022-03-07T12: 14: 18.116363",
                "path": "http://testserver/concepts/odms/item-groups/select",
                "method": "POST",
                "type": "BusinessLogicException"
            }
        }
    },
    {
        "name": "Test getting error for retrieving non existing odm item group",
        "request": {
            "headers": {},
            "method": "GET",
            "request": {},
            "url": "concepts/odms/item-groups/OdmItemGroup_000002"
        },
        "response": {
            "code": 404,
            "headers": {
                "content-length": "340",
                "content-type": "application/json"
            },
            "result": {
                "message": "OdmItemGroupAR with uid OdmItemGroup_000002 does not exist or there's no version with requested status or version number.",
                "time": "2022-03-07T12:20:39.613764",
                "path": "http://testserver/concepts/odms/item-groups/OdmItemGroup_000002",
                "method": "GET",
                "type": "NotFoundException"
            }
        }
    },
    {
        "name": "Test cannot inactivate an odm item group that is in Draft status",
        "request": {
            "headers": {},
            "method": "POST",
            "request": {},
            "url": "concepts/odms/item-groups/OdmItemGroup_000001/inactivate"
        },
        "response": {
            "code": 400,
            "headers": {
                "content-length": "459",
                "content-type": "application/json"
            },
            "result": {
                "message": "Cannot retire draft version.",
                "time": "2022-03-07T12:24:39.980123",
                "path": "http://testserver/concepts/odms/item-groups/OdmItemGroup_000001/inactivate",
                "method": "POST",
                "type": "BusinessLogicException"
            }
        }
    },
    {
        "name": "Test cannot reactivate an odm item group that is not retired",
        "request": {
            "headers": {},
            "method": "POST",
            "request": {},
            "url": "concepts/odms/item-groups/OdmItemGroup_000001/reactivate"
        },
        "response": {
            "code": 400,
            "headers": {
                "content-length": "459",
                "content-type": "application/json"
            },
            "result": {
                "message": "Only RETIRED version can be reactivated.",
                "time": "2022-03-07T12:27:17.572613",
                "path": "http://testserver/concepts/odms/item-groups/OdmItemGroup_000001/reactivate",
                "method": "POST",
                "type": "BusinessLogicException"
            }
        }
    },
    {
        "name": "Test cannot override odm xml extension tag that has attributes connected this odm item group",
        "request": {
            "headers": {},
            "method": "POST",
            "request": [
                {
                    "uid": "odm_xml_extension_tag2",
                    "value": "value"
                }
            ],
            "url": "concepts/odms/item-groups/OdmItemGroup_000001/add-xml-extension-tags?override=true"
        },
        "response": {
            "code": 400,
            "headers": {
                "content-length": "459",
                "content-type": "application/json"
            },
            "result": {
                "message": "Cannot remove an OdmXmlExtensionTag whose attributes are connected to this ODM element.",
                "time": "2022-03-07T12:30:50.195156",
                "path": "http://testserver/concepts/odms/item-groups/OdmItemGroup_000001/add-xml-extension-tags?override=true",
                "method": "POST",
                "type": "BusinessLogicException"
            }
        }
    },
    {
        "name": "Test cannot add odm xml extension tag attribute to an odm item group as an xml extension attribute",
        "request": {
            "headers": {},
            "method": "POST",
            "request": [
                {
                    "uid": "odm_xml_extension_attribute1",
                    "value": "value"
                }
            ],
            "url": "concepts/odms/item-groups/OdmItemGroup_000001/add-xml-extension-attributes"
        },
        "response": {
            "code": 400,
            "headers": {
                "content-length": "459",
                "content-type": "application/json"
            },
            "result": {
                "message": "OdmXmlExtensionAttribute identified by (odm_xml_extension_attribute1) cannot not be added as an xml extension attribute.",
                "time": "2022-03-07T12:30:50.195156",
                "path": "http://testserver/concepts/odms/item-groups/OdmItemGroup_000001/add-xml-extension-attributes",
                "method": "POST",
                "type": "BusinessLogicException"
            }
        }
    },
    {
        "name": "Test cannot add odm xml extension attribute to an odm item group as an xml extension tag attribute",
        "request": {
            "headers": {},
            "method": "POST",
            "request": [
                {
                    "uid": "odm_xml_extension_attribute3",
                    "value": "value"
                }
            ],
            "url": "concepts/odms/item-groups/OdmItemGroup_000001/add-xml-extension-tag-attributes"
        },
        "response": {
            "code": 400,
            "headers": {
                "content-length": "459",
                "content-type": "application/json"
            },
            "result": {
                "message": "OdmXmlExtensionAttribute identified by (odm_xml_extension_attribute3) cannot not be added as an xml extension tag attribute.",
                "time": "2022-03-07T12:30:50.195156",
                "path": "http://testserver/concepts/odms/item-groups/OdmItemGroup_000001/add-xml-extension-tag-attributes",
                "method": "POST",
                "type": "BusinessLogicException"
            }
        }
    },
    {
        "name": "Approve odm item group",
        "request": {
            "headers": {},
            "method": "POST",
            "request": {},
            "url": "concepts/odms/item-groups/OdmItemGroup_000001/approve"
        },
        "response": {
            "code": 201,
            "headers": {
                "content-length": "459",
                "content-type": "application/json"
            },
            "result": {
                "uid": "OdmItemGroup_000001",
                "libraryName": "Sponsor",
                "name": "name1",
                "oid": "oid1",
                "repeating": "No",
                "isReferenceData": "No",
                "sasDatasetName": "sasDatasetName1",
                "origin": "origin1",
                "purpose": "purpose1",
                "comment": "comment1",
                "startDate": "2022-03-03T11:17:56.799074",
                "endDate": null,
                "status": "Final",
                "version": "1.0",
                "changeDescription": "Approved version",
                "userInitials": "TODO user initials",
                "descriptions": [
                    {
                        "uid": "odm_description1",
                        "name": "name1",
                        "language": "ENG",
                        "description": "description1",
                        "instruction": "instruction1",
                        "sponsorInstruction": "sponsorInstruction1",
                        "version": "0.1"
                    },
                    {
                        "uid": "odm_description2",
                        "name": "name2",
                        "language": "language2",
                        "description": "description2",
                        "instruction": "instruction2",
                        "sponsorInstruction": "sponsorInstruction2",
                        "version": "0.1"
                    }
                ],
                "aliases": [
                    {
                        "uid": "odm_alias1",
                        "context": "context1",
                        "name": "name1",
                        "version": "0.1"
                    }
                ],
                "sdtmDomains": [
                    {
                        "uid": "term1",
                        "codeSubmissionValue": "code_submission_value1",
                        "preferredTerm": "preferred_term1"
                    }
                ],
                "activitySubGroups": [],
                "items": [],
                "xmlExtensionTags": [
                    {
                        "uid": "odm_xml_extension_tag1",
                        "name": "nameOne",
                        "value": "value1"
                    }
                ],
                "xmlExtensionAttributes": [],
                "xmlExtensionTagAttributes": [
                    {
                        "uid": "odm_xml_extension_attribute1",
                        "name": "nameOne",
                        "value": "value1",
                        "odmXmlExtensionTagUid": "odm_xml_extension_tag1"
                    }
                ],
                "possibleActions": [
                    "inactivate",
                    "newVersion"
                ]
            }
        }
    },
    {
        "name": "Inactivate odm item group",
        "request": {
            "headers": {},
            "method": "POST",
            "request": {},
            "url": "concepts/odms/item-groups/OdmItemGroup_000001/inactivate"
        },
        "response": {
            "code": 201,
            "headers": {
                "content-length": "459",
                "content-type": "application/json"
            },
            "result": {
                "uid": "OdmItemGroup_000001",
                "libraryName": "Sponsor",
                "name": "name1",
                "oid": "oid1",
                "repeating": "No",
                "isReferenceData": "No",
                "sasDatasetName": "sasDatasetName1",
                "origin": "origin1",
                "purpose": "purpose1",
                "comment": "comment1",
                "startDate": "2022-03-03T11:17:56.799074",
                "endDate": null,
                "status": "Retired",
                "version": "1.0",
                "changeDescription": "Deactivated version",
                "userInitials": "TODO user initials",
                "descriptions": [
                    {
                        "uid": "odm_description1",
                        "name": "name1",
                        "language": "ENG",
                        "description": "description1",
                        "instruction": "instruction1",
                        "sponsorInstruction": "sponsorInstruction1",
                        "version": "0.1"
                    },
                    {
                        "uid": "odm_description2",
                        "name": "name2",
                        "language": "language2",
                        "description": "description2",
                        "instruction": "instruction2",
                        "sponsorInstruction": "sponsorInstruction2",
                        "version": "0.1"
                    }
                ],
                "aliases": [
                    {
                        "uid": "odm_alias1",
                        "context": "context1",
                        "name": "name1",
                        "version": "0.1"
                    }
                ],
                "sdtmDomains": [
                    {
                        "uid": "term1",
                        "codeSubmissionValue": "code_submission_value1",
                        "preferredTerm": "preferred_term1"
                    }
                ],
                "activitySubGroups": [],
                "items": [],
                "xmlExtensionTags": [
                    {
                        "uid": "odm_xml_extension_tag1",
                        "name": "nameOne",
                        "value": "value1"
                    }
                ],
                "xmlExtensionAttributes": [],
                "xmlExtensionTagAttributes": [
                    {
                        "uid": "odm_xml_extension_attribute1",
                        "name": "nameOne",
                        "value": "value1",
                        "odmXmlExtensionTagUid": "odm_xml_extension_tag1"
                    }
                ],
                "possibleActions": [
                    "delete",
                    "reactivate"
                ]
            }
        }
    },
    {
        "name": "Test cannot add odm items to an odm item group that is in Retired status",
        "request": {
            "headers": {},
            "method": "POST",
            "request": [
                {
                    "uid": "odm_item1",
                    "orderNumber": 1,
                    "mandatory": "Yes",
                    "dataEntryRequired": "Yes",
                    "sdv": "Yes",
                    "locked": "No",
                    "keySequence": "keySequence1",
                    "methodOid": "methodOid1",
                    "imputationMethodOid": "imputationMethodOid1",
                    "role": "role1",
                    "roleCodelistOid": "roleCodelistOid1",
                    "collectionExceptionConditionOid": "collectionExceptionConditionOid1"
                }
            ],
            "url": "concepts/odms/item-groups/OdmItemGroup_000001/add-items"
        },
        "response": {
            "code": 400,
            "headers": {
                "content-length": "459",
                "content-type": "application/json"
            },
            "result": {
                "message": "The object is inactive",
                "time": "2022-03-07T12:30:50.195156",
                "path": "http://testserver/concepts/odms/item-groups/OdmItemGroup_000001/add-items",
                "method": "POST",
                "type": "BusinessLogicException"
            }
        }
    },
    {
        "name": "Test cannot add odm activity sub groups to an odm item group that is in Retired status",
        "request": {
            "headers": {},
            "method": "POST",
            "request": [
                {
                    "uid": "activity_sub_group_root1"
                }
            ],
            "url": "concepts/odms/item-groups/OdmItemGroup_000001/add-activity-sub-groups"
        },
        "response": {
            "code": 400,
            "headers": {
                "content-length": "459",
                "content-type": "application/json"
            },
            "result": {
                "message": "The object is inactive",
                "time": "2022-03-07T12:30:50.195156",
                "path": "http://testserver/concepts/odms/item-groups/OdmItemGroup_000001/add-activity-sub-groups",
                "method": "POST",
                "type": "BusinessLogicException"
            }
        }
    },
    {
        "name": "Test cannot add odm xml extension tag to an odm item group that is in Retired status",
        "request": {
            "headers": {},
            "method": "POST",
            "request": [
                {
                    "uid": "odm_xml_extension_tag1",
                    "value": "value"
                }
            ],
            "url": "concepts/odms/item-groups/OdmItemGroup_000001/add-xml-extension-tags"
        },
        "response": {
            "code": 400,
            "headers": {
                "content-length": "459",
                "content-type": "application/json"
            },
            "result": {
                "message": "The object is inactive",
                "time": "2022-03-07T12:30:50.195156",
                "path": "http://testserver/concepts/odms/item-groups/OdmItemGroup_000001/add-xml-extension-tags",
                "method": "POST",
                "type": "BusinessLogicException"
            }
        }
    },
    {
        "name": "Test cannot add odm xml extension attribute to an odm item group that is in Retired status",
        "request": {
            "headers": {},
            "method": "POST",
            "request": [
                {
                    "uid": "odm_xml_extension_attribute1",
                    "value": "value"
                }
            ],
            "url": "concepts/odms/item-groups/OdmItemGroup_000001/add-xml-extension-attributes"
        },
        "response": {
            "code": 400,
            "headers": {
                "content-length": "459",
                "content-type": "application/json"
            },
            "result": {
                "message": "The object is inactive",
                "time": "2022-03-07T12:30:50.195156",
                "path": "http://testserver/concepts/odms/item-groups/OdmItemGroup_000001/add-xml-extension-attributes",
                "method": "POST",
                "type": "BusinessLogicException"
            }
        }
    },
    {
        "name": "Test cannot add odm xml extension tag attribute to an odm item group that is in Retired status",
        "request": {
            "headers": {},
            "method": "POST",
            "request": [
                {
                    "uid": "odm_xml_extension_attribute1",
                    "value": "value"
                }
            ],
            "url": "concepts/odms/item-groups/OdmItemGroup_000001/add-xml-extension-tag-attributes"
        },
        "response": {
            "code": 400,
            "headers": {
                "content-length": "459",
                "content-type": "application/json"
            },
            "result": {
                "message": "The object is inactive",
                "time": "2022-03-07T12:30:50.195156",
                "path": "http://testserver/concepts/odms/item-groups/OdmItemGroup_000001/add-xml-extension-tag-attributes",
                "method": "POST",
                "type": "BusinessLogicException"
            }
        }
    }
]