[
    {
        "name": "Create a new odm xml extension tag",
        "request": {
            "headers": {},
            "method": "POST",
            "request": {
                "libraryName": "Sponsor",
                "name": "nameTwo",
                "xmlExtensionUid": "odm_xml_extension1",
                "parentXmlExtensionTagUid": null
            },
            "url": "concepts/odms/xml-extension-tags"
        },
        "response": {
            "code": 201,
            "headers": {
                "content-length": "459",
                "content-type": "application/json"
            },
            "result": {
                "uid": "OdmXmlExtensionTag_000001",
                "libraryName": "Sponsor",
                "name": "nameTwo",
                "startDate": "2022-03-03T11:17:56.799074",
                "endDate": null,
                "status": "Draft",
                "version": "0.1",
                "changeDescription": "Initial version",
                "userInitials": "TODO user initials",
                "xmlExtension": {
                    "uid": "odm_xml_extension1",
                    "name": "nameOne",
                    "prefix": "prefix",
                    "namespace": "namespace1"
                },
                "parentXmlExtensionTag": null,
                "childXmlExtensionTags": [],
                "xmlExtensionAttributes": [],
                "possibleActions": [
                    "approve",
                    "delete",
                    "edit"
                ]
            }
        }
    },
    {
        "name": "Test getting error for retrieving non existing odm xml extension tag",
        "request": {
            "headers": {},
            "method": "GET",
            "request": {},
            "url": "concepts/odms/xml-extension-tags/OdmXmlExtensionTag_000002"
        },
        "response": {
            "code": 404,
            "headers": {
                "content-length": "340",
                "content-type": "application/json"
            },
            "result": {
                "message": "OdmXmlExtensionTagAR with uid OdmXmlExtensionTag_000002 does not exist or there's no version with requested status or version number.",
                "time": "2022-03-07T12:20:39.613764",
                "path": "http://testserver/concepts/odms/xml-extension-tags/OdmXmlExtensionTag_000002",
                "method": "GET",
                "type": "NotFoundException"
            }
        }
    },
    {
        "name": "Test cannot inactivate an odm xml extension tag that is in Draft status",
        "request": {
            "headers": {},
            "method": "POST",
            "request": {},
            "url": "concepts/odms/xml-extension-tags/OdmXmlExtensionTag_000001/inactivate"
        },
        "response": {
            "code": 400,
            "headers": {
                "content-length": "459",
                "content-type": "application/json"
            },
            "result": {
                "message": "Cannot retire draft version.",
                "time": "2022-03-07T12:24:39.980123",
                "path": "http://testserver/concepts/odms/xml-extension-tags/OdmXmlExtensionTag_000001/inactivate",
                "method": "POST",
                "type": "BusinessLogicException"
            }
        }
    },
    {
        "name": "Test cannot reactivate an odm xml extension tag that is not retired",
        "request": {
            "headers": {},
            "method": "POST",
            "request": {},
            "url": "concepts/odms/xml-extension-tags/OdmXmlExtensionTag_000001/reactivate"
        },
        "response": {
            "code": 400,
            "headers": {
                "content-length": "459",
                "content-type": "application/json"
            },
            "result": {
                "message": "Only RETIRED version can be reactivated.",
                "time": "2022-03-07T12:27:17.572613",
                "path": "http://testserver/concepts/odms/xml-extension-tags/OdmXmlExtensionTag_000001/reactivate",
                "method": "POST",
                "type": "BusinessLogicException"
            }
        }
    },
    {
        "name": "Create an odm form",
        "request": {
            "headers": {},
            "method": "POST",
            "request": {
                "libraryName": "Sponsor",
                "name": "name1",
                "oid": "oid1",
                "sdtmVersion": "0.1",
                "repeating": "No",
                "descriptionUids": [],
                "aliasUids": []
            },
            "url": "concepts/odms/forms/select"
        },
        "response": {
            "code": 201,
            "headers": {
                "content-length": "459",
                "content-type": "application/json"
            },
            "result": {
                "uid": "OdmForm_000001",
                "name": "name1",
                "libraryName": "Sponsor",
                "oid": "oid1",
                "sdtmVersion": "0.1",
                "repeating": "No",
                "startDate": "2022-03-03T11:17:56.799074",
                "endDate": null,
                "status": "Draft",
                "version": "0.1",
                "changeDescription": "Initial version",
                "userInitials": "TODO user initials",
                "scope": null,
                "descriptions": [],
                "aliases": [],
                "activityGroups": [],
                "itemGroups": [],
                "xmlExtensionTags": [],
                "xmlExtensionAttributes": [],
                "xmlExtensionTagAttributes": [],
                "possibleActions": [
                    "approve",
                    "delete",
                    "edit"
                ]
            }
        }
    },
    {
        "name": "Add odm xml extension tag to the odm form",
        "request": {
            "headers": {},
            "method": "POST",
            "request": [
                {
                    "uid": "OdmXmlExtensionTag_000001",
                    "value": "value1"
                }
            ],
            "url": "concepts/odms/forms/OdmForm_000001/add-xml-extension-tags"
        },
        "response": {
            "code": 201,
            "headers": {
                "content-length": "459",
                "content-type": "application/json"
            },
            "result": {
                "uid": "OdmForm_000001",
                "name": "name1",
                "libraryName": "Sponsor",
                "oid": "oid1",
                "repeating": "No",
                "startDate": "2022-03-03T11:17:56.799074",
                "endDate": null,
                "status": "Draft",
                "version": "0.1",
                "changeDescription": "Initial version",
                "userInitials": "TODO user initials",
                "sdtmVersion": "0.1",
                "scope": null,
                "descriptions": [],
                "aliases": [],
                "activityGroups": [],
                "itemGroups": [],
                "xmlExtensionTags": [
                    {
                        "uid": "OdmXmlExtensionTag_000001",
                        "name": "nameTwo",
                        "value": "value1"
                    }
                ],
                "xmlExtensionAttributes": [],
                "xmlExtensionTagAttributes": [],
                "possibleActions": [
                    "approve",
                    "delete",
                    "edit"
                ]
            }
        }
    },
    {
        "name": "Test cannot delete an odm xml extension tag that is being used",
        "request": {
            "headers": {},
            "method": "DELETE",
            "request": {},
            "url": "concepts/odms/xml-extension-tags/OdmXmlExtensionTag_000001"
        },
        "response": {
            "code": 400,
            "headers": {
                "content-length": "459",
                "content-type": "application/json"
            },
            "result": {
                "message": "This ODM Xml Extension Tag is in use.",
                "time": "2022-03-07T12:27:17.572613",
                "path": "http://testserver/concepts/odms/xml-extension-tags/OdmXmlExtensionTag_000001",
                "method": "DELETE",
                "type": "BusinessLogicException"
            }
        }
    }
]