[
    {
        "name": "Test POST brand",
        "request": {
            "headers": {},
            "method": "POST",
            "request": {
                "name": "Brand A"
            },
            "url": "/brands"
        },
        "response": {
            "code": 201,
            "headers": {},
            "result": {
                "uid": "Brand_000001",
                "name": "Brand A"
            }
        }
    },
    {
        "name": "Test POST brand",
        "request": {
            "headers": {},
            "method": "POST",
            "request": {
                "name": "Brand B"
            },
            "url": "/brands"
        },
        "response": {
            "code": 201,
            "headers": {},
            "result": {
                "uid": "Brand_000002",
                "name": "Brand B"
            }
        }
    },
    {
        "name": "Test POST lag time",
        "request": {
            "headers": {},
            "method": "POST",
            "request": {
                "value": 7.5,
                "unitDefinitionUid": "UnitDefinition_000001",
                "sdtmDomainUid": "sdtm_domain_uid1",
                "definition": "lag_time_definition1",
                "abbreviation": "abbv",
                "templateParameter": true,
                "libraryName": "Sponsor"
            },
            "url": "/concepts/lag-times"
        },
        "response": {
            "code": 201,
            "headers": {},
            "result": {
                "uid": "LagTime_000001",
                "name": "7.5 [UnitDefinition_000001] for SDTM domain [sdtm_domain_uid1]",
                "value": 7.5,
                "unitDefinitionUid": "UnitDefinition_000001",
                "sdtmDomainUid": "sdtm_domain_uid1",
                "nameSentenceCase": "7.5",
                "definition": "lag_time_definition1",
                "abbreviation": "abbv",
                "templateParameter": true,
                "libraryName": "Sponsor",
                "status": null,
                "version": null,
                "changeDescription": null,
                "userInitials": null,
                "startDate": null,
                "endDate": null
            }
        }
    },
    {
        "name": "Test POST create compound",
        "request": {
            "headers": {},
            "method": "POST",
            "request": {
                "name": "compound_name1",
                "nameSentenceCase": "compound_name_sentence_case1",
                "definition": "compound_definition1",
                "abbreviation": "abbv",
                "doseValuesUids": [
                    "NumericValueWithUnit_000001",
                    "NumericValueWithUnit_000002"
                ],
                "strengthValuesUids": [
                    "NumericValueWithUnit_000001",
                    "NumericValueWithUnit_000002"
                ],
                "lagTimesUids": [
                    "LagTime_000001"
                ],
                "deliveryDevicesUids": [
                    "delivery_device_uid1",
                    "delivery_device_uid2"
                ],
                "dispensersUids": [
                    "dispenser_uid1",
                    "dispenser_uid2"
                ],
                "projectsUids": [
                    "project_uid1",
                    "project_uid2"
                ],
                "brandsUids": [
                    "Brand_000001",
                    "Brand_000002"
                ],
                "doseFrequencyUids": [
                    "dose_frequency_uid1"
                ],
                "dosageFormUids": [
                    "dosage_form_uid1"
                ],
                "routeOfAdministrationUids": [
                    "route_of_administration_uid1"
                ],
                "halfLifeUid": "NumericValueWithUnit_000001",
                "analyteNumber": "analyteNumber",
                "nncShortNumber": "nncShortNumber",
                "nncLongNumber": "nncLongNumber",
                "isSponsorCompound": true,
                "isNameInn": true,
                "libraryName": "Sponsor"
            },
            "url": "/concepts/compounds"
        },
        "response": {
            "code": 201,
            "headers": {},
            "result": {
                "uid": "Compound_000001",
                "name": "compound_name1",
                "nameSentenceCase": "compound_name_sentence_case1",
                "definition": "compound_definition1",
                "abbreviation": "abbv",
                "doseValues": [
                    {
                        "uid": "NumericValueWithUnit_000001",
                        "value": 1.23,
                        "unitDefinitionUid": "UnitDefinition_000001",
                        "unitLabel": "name_1"
                    },
                    {
                        "uid": "NumericValueWithUnit_000002",
                        "value": 3.21,
                        "unitDefinitionUid": "UnitDefinition_000001",
                        "unitLabel": "name_1"
                    }
                ],
                "strengthValues": [
                    {
                        "uid": "NumericValueWithUnit_000001",
                        "value": 1.23,
                        "unitDefinitionUid": "UnitDefinition_000001",
                        "unitLabel": "name_1"
                    },
                    {
                        "uid": "NumericValueWithUnit_000002",
                        "value": 3.21,
                        "unitDefinitionUid": "UnitDefinition_000001",
                        "unitLabel": "name_1"
                    }
                ],
                "lagTimes": [
                    {
                        "value": 7.5,
                        "unitDefinitionUid": "UnitDefinition_000001",
                        "unitLabel": "name_1",
                        "sdtmDomainUid": "sdtm_domain_uid1",
                        "sdtmDomainLabel": "sdtm_domain_name1"
                    }
                ],
                "deliveryDevices": [
                    {
                        "termUid": "delivery_device_uid1",
                        "name": "delivery_device_name1"
                    },
                    {
                        "termUid": "delivery_device_uid2",
                        "name": "delivery_device_name2"
                    }
                ],
                "dispensers": [
                    {
                        "termUid": "dispenser_uid1",
                        "name": "dispenser_name1"
                    },
                    {
                        "termUid": "dispenser_uid2",
                        "name": "dispenser_name2"
                    }
                ],
                "projects": [
                    {
                        "uid": "project_uid1",
                        "projectNumber": "PRJ-001",
                        "clinicalProgramme": {
                            "uid": "cp_001",
                            "name": "CP"
                        },
                        "name": "Project 1",
                        "description": "Description 1"
                    },
                    {
                        "uid": "project_uid2",
                        "projectNumber": "PRJ-002",
                        "clinicalProgramme": {
                            "uid": "cp_001",
                            "name": "CP"
                        },
                        "name": "Project 2",
                        "description": "Description 2"
                    }
                ],
                "brands": [
                    {
                        "uid": "Brand_000001",
                        "name": "Brand A"
                    },
                    {
                        "uid": "Brand_000002",
                        "name": "Brand B"
                    }
                ],
                "halfLife": {
                    "uid": "NumericValueWithUnit_000001",
                    "value": 1.23,
                    "unitDefinitionUid": "UnitDefinition_000001",
                    "unitLabel": "name_1"
                },
                "doseFrequencies": [
                    {
                        "termUid": "dose_frequency_uid1",
                        "name": "dose_frequency_name1"
                    }
                ],
                "dosageForms": [
                    {
                        "termUid": "dosage_form_uid1",
                        "name": "dosage_form_name1"
                    }
                ],
                "routesOfAdministration": [
                    {
                        "termUid": "route_of_administration_uid1",
                        "name": "route_of_administration_name1"
                    }
                ],
                "analyteNumber": "analyteNumber",
                "nncShortNumber": "nncShortNumber",
                "nncLongNumber": "nncLongNumber",
                "isSponsorCompound": true,
                "isNameInn": true,
                "substances": [],
                "libraryName": "Sponsor",
                "status": "Draft",
                "version": "0.1",
                "changeDescription": "Initial version",
                "userInitials": "TODO user initials",
                "startDate": null,
                "endDate": null,
                "possibleActions": [
                    "approve",
                    "delete",
                    "edit"
                ]
            }
        }
    },
    {
        "name": "Test POST create compound alias (preferred synonym)",
        "request": {
            "headers": {},
            "method": "POST",
            "request": {
                "name": "compound_alias_name1",
                "nameSentenceCase": "compound_alias_name_sentence_case1",
                "definition": "compound_alias_definition1",
                "abbreviation": "abbv",
                "compoundUid": "Compound_000001",
                "isPreferredSynonym": true,
                "libraryName": "Sponsor"
            },
            "url": "/concepts/compound-aliases"
        },
        "response": {
            "code": 201,
            "headers": {},
            "result": {
                "uid": "CompoundAlias_000001",
                "name": "compound_alias_name1",
                "nameSentenceCase": "compound_alias_name_sentence_case1",
                "definition": "compound_alias_definition1",
                "abbreviation": "abbv",
                "compound": {
                    "uid": "Compound_000001",
                    "name": "compound_name1"
                },
                "isPreferredSynonym": true,
                "libraryName": "Sponsor",
                "status": "Draft",
                "version": "0.1",
                "changeDescription": "Initial version",
                "userInitials": "TODO user initials",
                "startDate": null,
                "endDate": null,
                "possibleActions": [
                    "approve",
                    "delete",
                    "edit"
                ]
            }
        }
    },
    {
        "name": "Test POST create second compound alias (not preferred synonym)",
        "request": {
            "headers": {},
            "method": "POST",
            "request": {
                "name": "compound_alias_name2",
                "nameSentenceCase": "compound_alias_name_sentence_case2",
                "definition": "compound_alias_definition2",
                "abbreviation": "abbv2",
                "compoundUid": "Compound_000001",
                "isPreferredSynonym": false,
                "libraryName": "Sponsor"
            },
            "url": "/concepts/compound-aliases"
        },
        "response": {
            "code": 201,
            "headers": {},
            "result": {
                "uid": "CompoundAlias_000002",
                "name": "compound_alias_name2",
                "nameSentenceCase": "compound_alias_name_sentence_case2",
                "definition": "compound_alias_definition2",
                "abbreviation": "abbv2",
                "compound": {
                    "uid": "Compound_000001",
                    "name": "compound_name1"
                },
                "isPreferredSynonym": false,
                "libraryName": "Sponsor",
                "status": "Draft",
                "version": "0.1",
                "changeDescription": "Initial version",
                "userInitials": "TODO user initials",
                "startDate": null,
                "endDate": null,
                "possibleActions": [
                    "approve",
                    "delete",
                    "edit"
                ]
            }
        }
    },
    {
        "name": "Test POST compound alias as second preferred synonym",
        "request": {
            "headers": {},
            "method": "POST",
            "request": {
                "name": "synonym_x",
                "nameSentenceCase": "synonym_x",
                "definition": "synonym_x",
                "abbreviation": "abbv_XYZ",
                "compoundUid": "Compound_000001",
                "isPreferredSynonym": true,
                "libraryName": "Sponsor"
            },
            "url": "/concepts/compound-aliases"
        },
        "response": {
            "code": 400,
            "result": {
                "message": "Preferred synonym(s) already defined for compound with uid 'Compound_000001'",
                "method": "POST",
                "path": "http://testserver/concepts/compound-aliases",
                "time": "2020-11-10T01:51:17.884429",
                "type": "ValidationException"
            }
        }
    },
    {
        "name": "Test PATCH compound alias as second preferred synonym",
        "request": {
            "headers": {},
            "method": "PATCH",
            "request": {
                "name": "synonym_x",
                "nameSentenceCase": "synonym_x",
                "definition": "synonym_x",
                "abbreviation": "abbv2",
                "compoundUid": "Compound_000001",
                "isPreferredSynonym": true,
                "libraryName": "Sponsor",
                "changeDescription": "patched"
            },
            "url": "/concepts/compound-aliases/CompoundAlias_000002"
        },
        "response": {
            "code": 400,
            "result": {
                "message": "Preferred synonym(s) already defined for compound with uid 'Compound_000001'",
                "method": "PATCH",
                "path": "http://testserver/concepts/compound-aliases/CompoundAlias_000002",
                "time": "2020-11-10T01:51:17.884429",
                "type": "ValidationException"
            }
        }
    },
    {
        "name": "Test GET all compound alias not existing Library passed",
        "request": {
            "headers": {},
            "method": "GET",
            "request": {},
            "url": "/concepts/compound-aliases?library=not_existing"
        },
        "response": {
            "code": 400,
            "result": {
                "message": "There is no library identified by provided library name (not_existing)",
                "method": "GET",
                "path": "http://testserver/concepts/compound-aliases?library=not_existing",
                "time": "2020-11-10T01:51:17.884429",
                "type": "BusinessLogicException"
            }
        }
    },
    {
        "name": "Test POST inactivate non FINAL compound alias",
        "request": {
            "headers": {},
            "method": "POST",
            "request": {},
            "url": "/concepts/compound-aliases/CompoundAlias_000001/inactivate"
        },
        "response": {
            "code": 400,
            "result": {
                "message": "Cannot retire draft version.",
                "method": "POST",
                "path": "http://testserver/concepts/compound-aliases/CompoundAlias_000001/inactivate",
                "time": "2020-11-10T01:51:17.884429",
                "type": "BusinessLogicException"
            }
        }
    },
    {
        "name": "Test POST approve compound alias",
        "request": {
            "headers": {},
            "method": "POST",
            "request": {},
            "url": "concepts/compound-aliases/CompoundAlias_000001/approve"
        },
        "response": {
            "code": 201,
            "headers": {},
            "result": {
                "uid": "CompoundAlias_000001",
                "compound": {
                    "uid": "Compound_000001",
                    "name": "compound_name1"
                },
                "isPreferredSynonym": true,
                "name": "compound_alias_name1",
                "nameSentenceCase": "compound_alias_name_sentence_case1",
                "definition": "compound_alias_definition1",
                "abbreviation": "abbv",
                "libraryName": "Sponsor",
                "status": "Final",
                "version": "1.0",
                "changeDescription": "Approved version",
                "userInitials": "TODO user initials",
                "startDate": null,
                "endDate": null,
                "possibleActions": [
                    "inactivate",
                    "newVersion"
                ]
            }
        }
    },
    {
        "name": "Test POST approve non DRAFT compound alias",
        "request": {
            "headers": {},
            "method": "POST",
            "request": {},
            "url": "/concepts/compound-aliases/CompoundAlias_000001/approve"
        },
        "response": {
            "code": 400,
            "result": {
                "message": "The object is not in draft status.",
                "method": "POST",
                "path": "http://testserver/concepts/compound-aliases/CompoundAlias_000001/approve",
                "time": "2020-11-10T01:51:17.884429",
                "type": "BusinessLogicException"
            }
        }
    },
    {
        "name": "Test POST reactivate non retired compound alias",
        "request": {
            "headers": {},
            "method": "POST",
            "request": {},
            "url": "/concepts/compound-aliases/CompoundAlias_000001/reactivate"
        },
        "response": {
            "code": 400,
            "result": {
                "message": "Only RETIRED version can be reactivated.",
                "method": "POST",
                "path": "http://testserver/concepts/compound-aliases/CompoundAlias_000001/reactivate",
                "time": "2020-11-10T01:51:17.884429",
                "type": "BusinessLogicException"
            }
        }
    },
    {
        "name": "Test DELETE accepted object",
        "request": {
            "headers": {},
            "method": "DELETE",
            "request": {},
            "url": "/concepts/compound-aliases/CompoundAlias_000001"
        },
        "response": {
            "code": 400,
            "result": {
                "message": "Object has been accepted",
                "method": "DELETE",
                "path": "http://testserver/concepts/compound-aliases/CompoundAlias_000001",
                "time": "2020-11-10T01:51:17.884429",
                "type": "BusinessLogicException"
            }
        }
    },
    {
        "name": "Test CREATE compound alias with name that already exists",
        "request": {
            "headers": {},
            "method": "POST",
            "request": {
                "name": "compound_alias_name1",
                "nameSentenceCase": "compound_alias_name_sentence_case1_XYZ",
                "definition": "compound_alias_definition1_XYZ",
                "abbreviation": "abbv_XYZ",
                "compoundUid": "Compound_000001",
                "isPreferredSynonym": true,
                "libraryName": "Sponsor"
            },
            "url": "/concepts/compound-aliases"
        },
        "response": {
            "code": 400,
            "result": {
                "message": "Compound alias with name (compound_alias_name1) already exists",
                "method": "POST",
                "path": "http://testserver/concepts/compound-aliases",
                "time": "2020-11-10T01:51:17.884429",
                "type": "ValidationException"
            }
        }
    },
    {
        "name": "Test CREATE compound alias with name sentence case that already exists",
        "request": {
            "headers": {},
            "method": "POST",
            "request": {
                "name": "compound_alias_name1_XYZ",
                "nameSentenceCase": "compound_alias_name_sentence_case1",
                "definition": "compound_alias_definition1_XYZ",
                "abbreviation": "abbv_XYZ",
                "compoundUid": "Compound_000001",
                "isPreferredSynonym": true,
                "libraryName": "Sponsor"
            },
            "url": "/concepts/compound-aliases"
        },
        "response": {
            "code": 400,
            "result": {
                "message": "Compound alias with name sentence case (compound_alias_name_sentence_case1) already exists",
                "method": "POST",
                "path": "http://testserver/concepts/compound-aliases",
                "time": "2020-11-10T01:51:17.884429",
                "type": "ValidationException"
            }
        }
    },
    {
        "name": "Test CREATE compound alias with abbreviation that already exists",
        "request": {
            "headers": {},
            "method": "POST",
            "request": {
                "name": "compound_alias_name1_XYZ",
                "nameSentenceCase": "compound_alias_name_sentence_case1_XYZ",
                "definition": "compound_alias_definition1_XYZ",
                "abbreviation": "abbv",
                "compoundUid": "Compound_000001",
                "isPreferredSynonym": true,
                "libraryName": "Sponsor"
            },
            "url": "/concepts/compound-aliases"
        },
        "response": {
            "code": 400,
            "result": {
                "message": "Compound alias with abbreviation (abbv) already exists",
                "method": "POST",
                "path": "http://testserver/concepts/compound-aliases",
                "time": "2020-11-10T01:51:17.884429",
                "type": "ValidationException"
            }
        }
    },
    {
        "name": "Test CREATE compound alias with non-existing compound",
        "request": {
            "headers": {},
            "method": "POST",
            "request": {
                "name": "compound_alias_name3",
                "nameSentenceCase": "compound_alias_name_sentence_case3",
                "definition": "compound_alias_definition3",
                "abbreviation": "abbv3",
                "compoundUid": "non-existing-uid",
                "isPreferredSynonym": true,
                "libraryName": "Sponsor"
            },
            "url": "/concepts/compound-aliases"
        },
        "response": {
            "code": 400,
            "result": {
                "message": "CompoundAliasVO tried to connect to non existing compound identified by uid (non-existing-uid)",
                "method": "POST",
                "path": "http://testserver/concepts/compound-aliases",
                "time": "2020-11-10T01:51:17.884429",
                "type": "ValidationException"
            }
        }
    }
]