{
	"__license": "This file has been derived from Unicode Common Locale Data Repository (CLDR) files (http://cldr.unicode.org). See the copyright and permission notice in the Unicode-Data-Files-LICENSE.txt available at the same location as this file or visit http://www.unicode.org/copyright.html",
	"languages": {
		"aa": "афарська",
		"ab": "абхазька",
		"ace": "ачехська",
		"ach": "ачолі",
		"ada": "адангме",
		"ady": "адигейська",
		"ae": "авестійська",
		"aeb": "aeb",
		"af": "африкаанс",
		"afh": "африхілі",
		"agq": "агем",
		"ain": "айнська",
		"ak": "акан",
		"akk": "аккадська",
		"akz": "алабама",
		"ale": "алеутська",
		"aln": "aln",
		"alt": "південноалтайська",
		"am": "амхарська",
		"an": "арагонська",
		"ang": "давньоанглійська",
		"anp": "ангіка",
		"ar": "арабська",
		"ar_001": "сучасна стандартна арабська",
		"arc": "арамейська",
		"arn": "арауканська",
		"aro": "араона",
		"arp": "арапахо",
		"arq": "алжирська арабська",
		"arw": "аравакська",
		"ary": "ary",
		"arz": "arz",
		"as": "ассамська",
		"asa": "асу",
		"ase": "американська мова рухів",
		"ast": "астурська",
		"av": "аварська",
		"avk": "avk",
		"awa": "авадхі",
		"ay": "аймара",
		"az": "азербайджанська",
		"az_alt-short": "азербайджанська",
		"az_Arab": "південноазербайджанська",
		"ba": "башкирська",
		"bal": "балучі",
		"ban": "балійська",
		"bar": "баеріш",
		"bas": "баса",
		"bax": "бамум",
		"bbc": "батак тоба",
		"bbj": "гомала",
		"be": "білоруська",
		"bej": "беджа",
		"bem": "бемба",
		"bew": "бетаві",
		"bez": "бена",
		"bfd": "бафут",
		"bfq": "бадага",
		"bg": "болгарська",
		"bgn": "східнобелуджійська",
		"bho": "бходжпурі",
		"bi": "біслама",
		"bik": "бікольська",
		"bin": "біні",
		"bjn": "банджарська",
		"bkm": "ком",
		"bla": "сіксіка",
		"bm": "бамбара",
		"bn": "бенгальська",
		"bo": "тибетська",
		"bpy": "bpy",
		"bqi": "бахтіарі",
		"br": "бретонська",
		"bra": "брадж",
		"brh": "brh",
		"brx": "бодо",
		"bs": "боснійська",
		"bss": "акус",
		"bua": "бурятська",
		"bug": "бугійська",
		"bum": "булу",
		"byn": "блін",
		"byv": "медумба",
		"ca": "каталонська",
		"cad": "каддо",
		"car": "карібська",
		"cay": "кайюга",
		"cch": "атсам",
		"ce": "чеченська",
		"ceb": "себуанська",
		"cgg": "кіга",
		"ch": "чаморро",
		"chb": "чібча",
		"chg": "чагатайська",
		"chk": "чуукська",
		"chm": "марійська",
		"chn": "чинук жаргон",
		"cho": "чокто",
		"chp": "чіпев’ян",
		"chr": "черокі",
		"chy": "чейєнн",
		"ckb": "курдська (сорані)",
		"co": "корсиканська",
		"cop": "коптська",
		"cps": "cps",
		"cr": "крі",
		"crh": "кримськотатарська",
		"cs": "чеська",
		"csb": "кашубська",
		"cu": "церковнослов’янська",
		"cv": "чуваська",
		"cy": "валлійська",
		"da": "данська",
		"dak": "дакота",
		"dar": "даргінська",
		"dav": "таіта",
		"de": "німецька",
		"de_AT": "німецька (Австрія)",
		"de_CH": "верхньонімецька (Швейцарія)",
		"del": "делаварська",
		"den": "слейв",
		"dgr": "догрибська",
		"din": "дінка",
		"dje": "джерма",
		"doi": "догрі",
		"dsb": "нижньолужицька",
		"dtp": "dtp",
		"dua": "дуала",
		"dum": "середньонідерландська",
		"dv": "дівехі",
		"dyo": "дьола-фоні",
		"dyu": "діула",
		"dz": "дзонг-ке",
		"dzg": "дазага",
		"ebu": "ембу",
		"ee": "еве",
		"efi": "ефік",
		"egl": "egl",
		"egy": "давньоєгипетська",
		"eka": "екаджук",
		"el": "грецька",
		"elx": "еламська",
		"en": "англійська",
		"en_AU": "англійська (Австралія)",
		"en_CA": "англійська (Канада)",
		"en_GB": "англійська британська",
		"en_GB-alt-short": "англійська (Велика Британія)",
		"en_US": "англійська (США)",
		"en_US-alt-short": "англійська (США)",
		"enm": "середньоанглійська",
		"eo": "есперанто",
		"es": "іспанська",
		"es_419": "іспанська (Латинська Америка)",
		"es_ES": "іспанська (Європа)",
		"es_MX": "іспанська (Мексика)",
		"esu": "esu",
		"et": "естонська",
		"eu": "баскська",
		"ewo": "евондо",
		"ext": "ext",
		"fa": "перська",
		"fan": "фанг",
		"fat": "фанті",
		"ff": "фула",
		"fi": "фінська",
		"fil": "філіппінська",
		"fit": "fit",
		"fj": "фіджі",
		"fo": "фарерська",
		"fon": "фон",
		"fr": "французька",
		"fr_CA": "французька (Канада)",
		"fr_CH": "французька (Швейцарія)",
		"frc": "frc",
		"frm": "середньофранцузька",
		"fro": "давньофранцузька",
		"frp": "арпітанська",
		"frr": "фризька північна",
		"frs": "фризька східна",
		"fur": "фріульська",
		"fy": "західнофризька",
		"ga": "ірландська",
		"gaa": "га",
		"gag": "гагаузька",
		"gan": "gan",
		"gay": "гайо",
		"gba": "гбайя",
		"gbz": "gbz",
		"gd": "гаельська",
		"gez": "гєез",
		"gil": "гільбертська",
		"gl": "галісійська",
		"glk": "glk",
		"gmh": "середньоверхньонімецька",
		"gn": "гуарані",
		"goh": "давньоверхньонімецька",
		"gom": "gom",
		"gon": "гонді",
		"gor": "горонтало",
		"got": "готська",
		"grb": "гребо",
		"grc": "давньогрецька",
		"gsw": "німецька (Швейцарія)",
		"gu": "гуджараті",
		"guc": "guc",
		"gur": "gur",
		"guz": "гусії",
		"gv": "менкська",
		"gwi": "кучін",
		"ha": "хауса",
		"hai": "хайда",
		"hak": "hak",
		"haw": "гавайська",
		"he": "іврит",
		"hi": "гінді",
		"hif": "hif",
		"hil": "хілігайнон",
		"hit": "хітіті",
		"hmn": "хмонг",
		"ho": "хірі-моту",
		"hr": "хорватська",
		"hsb": "верхньолужицька",
		"hsn": "hsn",
		"ht": "гаїтянська",
		"hu": "угорська",
		"hup": "хупа",
		"hy": "вірменська",
		"hz": "гереро",
		"ia": "інтерлінгва",
		"iba": "ібанська",
		"ibb": "ібібіо",
		"id": "індонезійська",
		"ie": "інтерлінгве",
		"ig": "ігбо",
		"ii": "сичуань",
		"ik": "інупіак",
		"ilo": "ілоканська",
		"inh": "інгуська",
		"io": "ідо",
		"is": "ісландська",
		"it": "італійська",
		"iu": "інуктітут",
		"izh": "izh",
		"ja": "японська",
		"jam": "jam",
		"jbo": "ложбан",
		"jgo": "нгомба",
		"jmc": "мачаме",
		"jpr": "іудео-перська",
		"jrb": "іудео-арабська",
		"jut": "jut",
		"jv": "яванська",
		"ka": "грузинська",
		"kaa": "каракалпацька",
		"kab": "кабільська",
		"kac": "качін",
		"kaj": "йю",
		"kam": "камба",
		"kaw": "каві",
		"kbd": "кабардинська",
		"kbl": "канембу",
		"kcg": "тіап",
		"kde": "маконде",
		"kea": "кабувердіану",
		"ken": "ken",
		"kfo": "коро",
		"kg": "конґолезька",
		"kgp": "kgp",
		"kha": "кхасі",
		"kho": "хотаносакська",
		"khq": "койра чіїні",
		"khw": "khw",
		"ki": "кікуйю",
		"kiu": "kiu",
		"kj": "кунама",
		"kk": "казахська",
		"kkj": "како",
		"kl": "калааллісут",
		"kln": "календжин",
		"km": "кхмерська",
		"kmb": "кімбунду",
		"kn": "каннада",
		"ko": "корейська",
		"koi": "комі-перм’яцька",
		"kok": "конкані",
		"kos": "косрае",
		"kpe": "кпеллє",
		"kr": "канурі",
		"krc": "карачаєво-балкарська",
		"kri": "kri",
		"krj": "krj",
		"krl": "карельська",
		"kru": "курукх",
		"ks": "кашмірська",
		"ksb": "шамбала",
		"ksf": "бафіа",
		"ksh": "колоніан",
		"ku": "курдська",
		"kum": "кумицька",
		"kut": "кутенаї",
		"kv": "комі",
		"kw": "корнійська",
		"ky": "киргизька",
		"la": "латинська",
		"lad": "ладіно",
		"lag": "лангі",
		"lah": "ланда",
		"lam": "ламба",
		"lb": "люксембурзька",
		"lez": "лезгінська",
		"lfn": "lfn",
		"lg": "ганда",
		"li": "лімбургійська",
		"lij": "lij",
		"liv": "liv",
		"lkt": "лакота",
		"lmo": "lmo",
		"ln": "лінгала",
		"lo": "лаоська",
		"lol": "монго",
		"loz": "лозі",
		"lrc": "північна лурська",
		"lt": "литовська",
		"ltg": "ltg",
		"lu": "луба-катанга",
		"lua": "луба-лулуа",
		"lui": "луїсеньо",
		"lun": "лунда",
		"luo": "луо",
		"lus": "лушей",
		"luy": "луйя",
		"lv": "латвійська",
		"lzh": "lzh",
		"lzz": "lzz",
		"mad": "мадурська",
		"maf": "мафа",
		"mag": "магадхі",
		"mai": "майтхілі",
		"mak": "макасарська",
		"man": "мандінго",
		"mas": "масаї",
		"mde": "маба",
		"mdf": "мокша",
		"mdh": "mdh",
		"mdr": "мандарська",
		"men": "менде",
		"mer": "меру",
		"mfe": "маврикійська креольська",
		"mg": "малагасійська",
		"mga": "середньоірландська",
		"mgh": "макува-меето",
		"mgo": "мета",
		"mh": "маршалльська",
		"mi": "маорі",
		"mic": "мікмак",
		"min": "мінангкабау",
		"mis": "mis",
		"mk": "македонська",
		"ml": "малаялам",
		"mn": "монгольська",
		"mnc": "манчжурська",
		"mni": "маніпурі",
		"moh": "магавк",
		"mos": "моссі",
		"mr": "маратхі",
		"mrj": "mrj",
		"ms": "малайська",
		"mt": "мальтійська",
		"mua": "мунданг",
		"mul": "декілька мов",
		"mus": "крік",
		"mwl": "мірандська",
		"mwr": "марварі",
		"mwv": "mwv",
		"my": "бірманська",
		"mye": "миін",
		"myv": "ерзя",
		"mzn": "мазандеранська",
		"na": "науру",
		"nan": "nan",
		"nap": "неаполітанська",
		"naq": "нама",
		"nb": "букмол (Норвегія)",
		"nd": "ндебелє північна",
		"nds": "нижньонімецька",
		"nds_NL": "нижньосаксонська",
		"ne": "непальська",
		"new": "неварі",
		"ng": "ндонга",
		"nia": "ніаська",
		"niu": "ніуе",
		"njo": "ао нага",
		"nl": "голландська",
		"nl_BE": "фламандська",
		"nmg": "квазіо",
		"nn": "нюношк (Норвегія)",
		"nnh": "нгємбун",
		"no": "норвезька",
		"nog": "ногайська",
		"non": "давньонорвезька",
		"nov": "nov",
		"nqo": "нко",
		"nr": "ндебелє південна",
		"nso": "сото північна",
		"nus": "нуер",
		"nv": "навахо",
		"nwc": "неварі класична",
		"ny": "ньянджа",
		"nym": "ньямвезі",
		"nyn": "ньянколе",
		"nyo": "ньоро",
		"nzi": "нзіма",
		"oc": "окитан",
		"oj": "оджібва",
		"om": "оромо",
		"or": "орія",
		"os": "осетинська",
		"osa": "осейдж",
		"ota": "османська",
		"pa": "панджабі",
		"pag": "пангасінанська",
		"pal": "пехлеві",
		"pam": "пампанга",
		"pap": "пап’яменто",
		"pau": "палауанська",
		"pcd": "pcd",
		"pdc": "pdc",
		"pdt": "pdt",
		"peo": "давньоперська",
		"pfl": "pfl",
		"phn": "фінікійсько-пунічна",
		"pi": "палі",
		"pl": "польська",
		"pms": "pms",
		"pnt": "pnt",
		"pon": "понапе",
		"prg": "prg",
		"pro": "давньопровансальська",
		"ps": "пушту",
		"pt": "португальська",
		"pt_BR": "португальська (Бразилія)",
		"pt_PT": "португальська (Європа)",
		"qu": "кечуа",
		"quc": "кіче",
		"qug": "qug",
		"raj": "раджастхані",
		"rap": "рапануї",
		"rar": "раротонга",
		"rgn": "rgn",
		"rif": "rif",
		"rm": "ретороманська",
		"rn": "рунді",
		"ro": "румунська",
		"ro_MD": "молдавська",
		"rof": "ромбо",
		"rom": "циганська",
		"root": "корінь",
		"rtm": "rtm",
		"ru": "російська",
		"rue": "rue",
		"rug": "rug",
		"rup": "арумунська",
		"rw": "кіньяруанда",
		"rwk": "рва",
		"sa": "санскрит",
		"sad": "сандаве",
		"sah": "якутська",
		"sam": "самаритянська арамейська",
		"saq": "самбуру",
		"sas": "сасакська",
		"sat": "сантальська",
		"saz": "saz",
		"sba": "нгамбай",
		"sbp": "сангу",
		"sc": "сардинська",
		"scn": "сицилійська",
		"sco": "шотландська",
		"sd": "сіндхі",
		"sdc": "sdc",
		"sdh": "південнокурдська",
		"se": "саамська північна",
		"see": "сенека",
		"seh": "сена",
		"sei": "sei",
		"sel": "селькупська",
		"ses": "койраборо сені",
		"sg": "санго",
		"sga": "давньоірландська",
		"sgs": "sgs",
		"sh": "сербсько-хорватська",
		"shi": "тачеліт",
		"shn": "шанська",
		"shu": "чадійська арабська",
		"si": "сингальська",
		"sid": "сідамо",
		"sk": "словацька",
		"sl": "словенська",
		"sli": "sli",
		"sly": "sly",
		"sm": "самоанська",
		"sma": "південносаамська",
		"smj": "саамська луле",
		"smn": "саамська інарі",
		"sms": "саамська скольт",
		"sn": "шона",
		"snk": "сонінке",
		"so": "сомалі",
		"sog": "согдійська",
		"sq": "албанська",
		"sr": "сербська",
		"srn": "сранан тонго",
		"srr": "серер",
		"ss": "сісваті",
		"ssy": "сахо",
		"st": "сото південна",
		"stq": "stq",
		"su": "сунданська",
		"suk": "сукума",
		"sus": "сусу",
		"sux": "шумерська",
		"sv": "шведська",
		"sw": "суахілі",
		"sw_CD": "конгійське суахілі",
		"swb": "коморська",
		"syc": "сирійська класична",
		"syr": "сирійська",
		"szl": "szl",
		"ta": "тамільська",
		"tcy": "tcy",
		"te": "телугу",
		"tem": "темне",
		"teo": "тесо",
		"ter": "терено",
		"tet": "тетум",
		"tg": "таджицька",
		"th": "тайська",
		"ti": "тигринья",
		"tig": "тигре",
		"tiv": "тів",
		"tk": "туркменська",
		"tkl": "токелау",
		"tkr": "tkr",
		"tl": "тагальська",
		"tlh": "клінгон",
		"tli": "тлінгіт",
		"tly": "tly",
		"tmh": "тамашек",
		"tn": "тсвана",
		"to": "тонганська",
		"tog": "ньяса тонга",
		"tpi": "ток-пісін",
		"tr": "турецька",
		"tru": "tru",
		"trv": "тароко",
		"ts": "тсонга",
		"tsd": "tsd",
		"tsi": "цимшиан",
		"tt": "татарська",
		"ttt": "ttt",
		"tum": "тумбука",
		"tvl": "тувалу",
		"tw": "тві",
		"twq": "тасавак",
		"ty": "таїтянська",
		"tyv": "тувинська",
		"tzm": "центральномароканська тамазіт",
		"udm": "удмуртська",
		"ug": "уйгурська",
		"uga": "угаритська",
		"uk": "українська",
		"umb": "умбунду",
		"und": "невідома мова",
		"ur": "урду",
		"uz": "узбецька",
		"vai": "ваї",
		"ve": "венда",
		"vec": "vec",
		"vep": "vep",
		"vi": "вʼєтнамська",
		"vls": "vls",
		"vmf": "vmf",
		"vo": "волап’юк",
		"vot": "водська",
		"vro": "vro",
		"vun": "вуньо",
		"wa": "валлонська",
		"wae": "валзерська",
		"wal": "валамо",
		"war": "варай",
		"was": "вашо",
		"wbp": "валпірі",
		"wo": "волоф",
		"wuu": "wuu",
		"xal": "калмицька",
		"xh": "кхоса",
		"xmf": "xmf",
		"xog": "сога",
		"yao": "яо",
		"yap": "яп",
		"yav": "янгбен",
		"ybb": "ємба",
		"yi": "ідиш",
		"yo": "йоруба",
		"yrl": "yrl",
		"yue": "кантонська",
		"za": "чжуан",
		"zap": "сапотекська",
		"zbl": "блісса мова",
		"zea": "zea",
		"zen": "зенага",
		"zgh": "стандартна марокканська берберська",
		"zh": "китайська",
		"zh_Hans": "китайська спрощена",
		"zh_Hant": "китайська традиційна",
		"zu": "зулуська",
		"zun": "зуньї",
		"zxx": "немає мовного вмісту",
		"zza": "зазакі"
	},
	"scripts": {
		"Adlm": "Adlm",
		"Afak": "афака",
		"Aghb": "кавказька албанська",
		"Ahom": "ахом",
		"Arab": "арабиця",
		"Arab-alt-variant": "персько-арабська",
		"Armi": "Армі",
		"Armn": "вірменська",
		"Avst": "Авестійський",
		"Bali": "Балійський",
		"Bamu": "Бамум",
		"Bass": "басса",
		"Batk": "Батак",
		"Beng": "бенгальська",
		"Bhks": "Bhks",
		"Blis": "символи Блісса",
		"Bopo": "бопомофо",
		"Brah": "Брахмі",
		"Brai": "шрифт Брайля",
		"Bugi": "Бугійський",
		"Buhd": "Бухід",
		"Cakm": "Чакма",
		"Cans": "уніфіковані символи канадських тубільців",
		"Cari": "Каріанський",
		"Cham": "Хамітський",
		"Cher": "Черокі",
		"Cirt": "Кирт",
		"Copt": "Коптський",
		"Cprt": "Кіпрський",
		"Cyrl": "кирилиця",
		"Cyrs": "Давньоцерковнословʼянський",
		"Deva": "деванагарі",
		"Dsrt": "Дезерет",
		"Dupl": "Dupl",
		"Egyd": "Єгипетський демотичний",
		"Egyh": "Єгипетський ієратичний",
		"Egyp": "Єгипетський ієрогліфічний",
		"Elba": "Elba",
		"Ethi": "ефіопська",
		"Geok": "Кхутсурі",
		"Geor": "грузинська",
		"Glag": "Глаголичний",
		"Goth": "Готичний",
		"Gran": "Gran",
		"Grek": "грецька",
		"Gujr": "гуджараті",
		"Guru": "гурмухі",
		"Hanb": "Hanb",
		"Hang": "хангиль",
		"Hani": "китайська",
		"Hano": "Хануну",
		"Hans": "спрощена",
		"Hans-alt-stand-alone": "китайська спрощена",
		"Hant": "традиційна",
		"Hant-alt-stand-alone": "китайська традиційна",
		"Hatr": "Hatr",
		"Hebr": "іврит",
		"Hira": "хірагана",
		"Hluw": "Hluw",
		"Hmng": "Пахау хмонг",
		"Hrkt": "Катакана чи хірагана",
		"Hung": "Давньоугорський",
		"Inds": "Харапський",
		"Ital": "Давньоіталійський",
		"Jamo": "Jamo",
		"Java": "Яванський",
		"Jpan": "японська",
		"Kali": "Кая Лі",
		"Kana": "катакана",
		"Khar": "Кхароштхі",
		"Khmr": "кхмерська",
		"Khoj": "Khoj",
		"Knda": "каннада",
		"Kore": "корейська",
		"Kthi": "Каїті",
		"Lana": "Ланна",
		"Laoo": "лаоська",
		"Latf": "Латинський фрактурний",
		"Latg": "Латинський гельський",
		"Latn": "латиниця",
		"Lepc": "Лепча",
		"Limb": "Лімбу",
		"Lina": "Лінійний А",
		"Linb": "Лінійний В",
		"Lisu": "абетка Фрейзера",
		"Loma": "лома",
		"Lyci": "Лікійський",
		"Lydi": "Лідійський",
		"Mahj": "Mahj",
		"Mand": "Мандейський",
		"Mani": "Маніхейський",
		"Marc": "Marc",
		"Maya": "Майя ієрогліфічний",
		"Mend": "Mend",
		"Merc": "Merc",
		"Mero": "Мероїтський",
		"Mlym": "малаяламська",
		"Modi": "Modi",
		"Mong": "монгольська",
		"Moon": "Мун",
		"Mroo": "Mroo",
		"Mtei": "Мейтей майєк",
		"Mult": "Mult",
		"Mymr": "мʼянмська",
		"Narb": "Narb",
		"Nbat": "Nbat",
		"Newa": "Newa",
		"Nkoo": "Нко",
		"Ogam": "Огамічний",
		"Olck": "Сантальський",
		"Orkh": "Орхонський",
		"Orya": "орія",
		"Osge": "Osge",
		"Osma": "Османський",
		"Palm": "Palm",
		"Pauc": "Pauc",
		"Perm": "Давньопермський",
		"Phag": "Пхагс-па",
		"Phli": "Пехлеві написів",
		"Phlp": "Пехлеві релігійний",
		"Phlv": "Пехлеві літературний",
		"Phnx": "Фінікійський",
		"Plrd": "писемність Полларда",
		"Prti": "Парфянський",
		"Qaaa": "Qaaa",
		"Qaab": "Qaab",
		"Qaac": "Qaac",
		"Qaad": "Qaad",
		"Qaae": "Qaae",
		"Qaaf": "Qaaf",
		"Qaag": "Qaag",
		"Qaah": "Qaah",
		"Qaaj": "Qaaj",
		"Qaak": "Qaak",
		"Qaal": "Qaal",
		"Qaam": "Qaam",
		"Qaan": "Qaan",
		"Qaao": "Qaao",
		"Qaap": "Qaap",
		"Qaaq": "Qaaq",
		"Qaar": "Qaar",
		"Qaas": "Qaas",
		"Qaat": "Qaat",
		"Qaau": "Qaau",
		"Qaav": "Qaav",
		"Qaaw": "Qaaw",
		"Qaax": "Qaax",
		"Qaay": "Qaay",
		"Qaaz": "Qaaz",
		"Qaba": "Qaba",
		"Qabb": "Qabb",
		"Qabc": "Qabc",
		"Qabd": "Qabd",
		"Qabe": "Qabe",
		"Qabf": "Qabf",
		"Qabg": "Qabg",
		"Qabh": "Qabh",
		"Qabi": "Qabi",
		"Qabj": "Qabj",
		"Qabk": "Qabk",
		"Qabl": "Qabl",
		"Qabm": "Qabm",
		"Qabn": "Qabn",
		"Qabo": "Qabo",
		"Qabp": "Qabp",
		"Qabq": "Qabq",
		"Qabr": "Qabr",
		"Qabs": "Qabs",
		"Qabt": "Qabt",
		"Qabu": "Qabu",
		"Qabv": "Qabv",
		"Qabw": "Qabw",
		"Qabx": "Qabx",
		"Rjng": "Реджанг",
		"Roro": "Ронго-ронго",
		"Runr": "Рунічний",
		"Samr": "Самаритянський",
		"Sara": "Сараті",
		"Sarb": "Sarb",
		"Saur": "Саураштра",
		"Sgnw": "Знаковий",
		"Shaw": "Шоу",
		"Shrd": "Shrd",
		"Sidd": "Sidd",
		"Sind": "Sind",
		"Sinh": "сингальська",
		"Sora": "Sora",
		"Sund": "Сунданський",
		"Sylo": "Сілоті нагрі",
		"Syrc": "Сирійський",
		"Syre": "Давньосирійський естрангело",
		"Syrj": "Давньосирійський західний",
		"Syrn": "Давньосирійський східний",
		"Tagb": "Тагбанва",
		"Takr": "Takr",
		"Tale": "Тай-лі",
		"Talu": "Новий тайський луе",
		"Taml": "тамільська",
		"Tang": "тангут",
		"Tavt": "Тай-вʼєт",
		"Telu": "телугу",
		"Teng": "Тенгвар",
		"Tfng": "Тифінаг",
		"Tglg": "Тагальський",
		"Thaa": "таана",
		"Thai": "тайська",
		"Tibt": "тибетська",
		"Tirh": "Tirh",
		"Ugar": "Угаритський",
		"Vaii": "Ваї",
		"Visp": "видиме мовлення",
		"Wara": "Wara",
		"Xpeo": "Давньоперський",
		"Xsux": "Шумеро-аккадський клінопис",
		"Yiii": "Йї",
		"Zinh": "успадкована",
		"Zmth": "математична",
		"Zsye": "Zsye",
		"Zsym": "символьна",
		"Zxxx": "безписемна",
		"Zyyy": "звичайна",
		"Zzzz": "невідома система письма"
	},
	"territories": {
		"142": "Азія",
		"143": "Центральна Азія",
		"145": "Західна Азія",
		"150": "Європа",
		"151": "Східна Європа",
		"154": "Північна Європа",
		"155": "Західна Європа",
		"419": "Латинська Америка",
		"001": "Світ",
		"002": "Африка",
		"003": "Північна Америка",
		"005": "Південна Америка",
		"009": "Океанія",
		"011": "Західна Африка",
		"013": "Центральна Америка",
		"014": "Східна Африка",
		"015": "Північна Африка",
		"017": "Центральна Африка",
		"018": "Південна Африка",
		"019": "Америка",
		"021": "Північна Америка (регіон)",
		"029": "Карибський басейн",
		"030": "Східна Азія",
		"034": "Південна Азія",
		"035": "Південно-Східна Азія",
		"039": "Південна Європа",
		"053": "Австралазія",
		"054": "Меланезія",
		"057": "Мікронезійський регіон",
		"061": "Полінезія",
		"AC": "Острів Вознесіння",
		"AD": "Андорра",
		"AE": "Обʼєднані Арабські Емірати",
		"AF": "Афганістан",
		"AG": "Антигуа і Барбуда",
		"AI": "Ангілья",
		"AL": "Албанія",
		"AM": "Вірменія",
		"AO": "Ангола",
		"AQ": "Антарктика",
		"AR": "Аргентина",
		"AS": "Американське Самоа",
		"AT": "Австрія",
		"AU": "Австралія",
		"AW": "Аруба",
		"AX": "Аландські острови",
		"AZ": "Азербайджан",
		"BA": "Боснія і Герцоговина",
		"BB": "Барбадос",
		"BD": "Бангладеш",
		"BE": "Бельгія",
		"BF": "Буркіна-Фасо",
		"BG": "Болгарія",
		"BH": "Бахрейн",
		"BI": "Бурунді",
		"BJ": "Бенін",
		"BL": "Сен-Бартельмі",
		"BM": "Бермудські острови",
		"BN": "Бруней",
		"BO": "Болівія",
		"BQ": "Нідерландські Карибські острови",
		"BR": "Бразилія",
		"BS": "Багамські Острови",
		"BT": "Бутан",
		"BV": "Острів Буве",
		"BW": "Ботсвана",
		"BY": "Білорусь",
		"BZ": "Беліз",
		"CA": "Канада",
		"CC": "Кокосові (Кілінгові) острови",
		"CD": "Конго – Кіншаса",
		"CD-alt-variant": "Конго (ДРК)",
		"CF": "Центральноафриканська Республіка",
		"CG": "Конго – Браззавіль",
		"CG-alt-variant": "Конго (Республіка)",
		"CH": "Швейцарія",
		"CI": "Кот-д’Івуар",
		"CI-alt-variant": "Берег Слонової Кістки",
		"CK": "Острови Кука",
		"CL": "Чилі",
		"CM": "Камерун",
		"CN": "Китай",
		"CO": "Колумбія",
		"CP": "Острів Кліппертон",
		"CR": "Коста-Рика",
		"CU": "Куба",
		"CV": "Кабо Верде",
		"CW": "Кюрасао",
		"CX": "Острів Різдва",
		"CY": "Кіпр",
		"CZ": "Чехія",
		"DE": "Німеччина",
		"DG": "Дієго-Гарсія",
		"DJ": "Джибуті",
		"DK": "Данія",
		"DM": "Домініка",
		"DO": "Домініканська Республіка",
		"DZ": "Алжир",
		"EA": "Сеута і Мелілья",
		"EC": "Еквадор",
		"EE": "Естонія",
		"EG": "Єгипет",
		"EH": "Західна Сахара",
		"ER": "Еритрея",
		"ES": "Іспанія",
		"ET": "Ефіопія",
		"EU": "Європейський Союз",
		"FI": "Фінляндія",
		"FJ": "Фіджі",
		"FK": "Фолклендські острови",
		"FK-alt-variant": "Фолклендські (Мальвінські) острови",
		"FM": "Мікронезія",
		"FM-alt-variant": "Федеративні Штати Мікронезії",
		"FO": "Фарерські острови",
		"FR": "Франція",
		"GA": "Габон",
		"GB": "Велика Британія",
		"GB-alt-short": "Велика Британія",
		"GD": "Гренада",
		"GE": "Грузія",
		"GF": "Французька Гвіана",
		"GG": "Гернсі",
		"GH": "Гана",
		"GI": "Гібралтар",
		"GL": "Гренландія",
		"GM": "Гамбія",
		"GN": "Гвінея",
		"GP": "Гваделупа",
		"GQ": "Екваторіальна Гвінея",
		"GR": "Греція",
		"GS": "Південна Джорджія та Південні Сандвічеві острови",
		"GT": "Гватемала",
		"GU": "Гуам",
		"GW": "Гвінея-Бісау",
		"GY": "Гаяна",
		"HK": "Гонконг, О.А.Р. Китаю",
		"HK-alt-short": "Гонконг",
		"HM": "Острови Херд і Мак-Дональд",
		"HN": "Гондурас",
		"HR": "Хорватія",
		"HT": "Гаїті",
		"HU": "Угорщина",
		"IC": "Канарські острови",
		"ID": "Індонезія",
		"IE": "Ірландія",
		"IL": "Ізраїль",
		"IM": "Острів Мен",
		"IN": "Індія",
		"IO": "Британські території в Індійському океані",
		"IQ": "Ірак",
		"IR": "Іран",
		"IS": "Ісландія",
		"IT": "Італія",
		"JE": "Джерсі",
		"JM": "Ямайка",
		"JO": "Йорданія",
		"JP": "Японія",
		"KE": "Кенія",
		"KG": "Киргизстан",
		"KH": "Камбоджа",
		"KI": "Кірибаті",
		"KM": "Коморські острови",
		"KN": "Сент-Кітс і Невіс",
		"KP": "Північна Корея",
		"KR": "Південна Корея",
		"KW": "Кувейт",
		"KY": "Кайманові острови",
		"KZ": "Казахстан",
		"LA": "Лаос",
		"LB": "Ліван",
		"LC": "Сент-Люсія",
		"LI": "Ліхтенштейн",
		"LK": "Шрі-Ланка",
		"LR": "Ліберія",
		"LS": "Лесото",
		"LT": "Литва",
		"LU": "Люксембург",
		"LV": "Латвія",
		"LY": "Лівія",
		"MA": "Марокко",
		"MC": "Монако",
		"MD": "Молдова",
		"ME": "Чорногорія",
		"MF": "Сен-Мартен",
		"MG": "Мадагаскар",
		"MH": "Маршаллові Острови",
		"MK": "Македонія",
		"MK-alt-variant": "Македонія (КЮРМ)",
		"ML": "Малі",
		"MM": "Мʼянма (Бірма)",
		"MN": "Монголія",
		"MO": "Макао, О.А.Р Китаю",
		"MO-alt-short": "Макао",
		"MP": "Північні Маріанські острови",
		"MQ": "Мартиніка",
		"MR": "Мавританія",
		"MS": "Монтсеррат",
		"MT": "Мальта",
		"MU": "Маврикій",
		"MV": "Мальдіви",
		"MW": "Малаві",
		"MX": "Мексика",
		"MY": "Малайзія",
		"MZ": "Мозамбік",
		"NA": "Намібія",
		"NC": "Нова Каледонія",
		"NE": "Нігер",
		"NF": "Острів Норфолк",
		"NG": "Нігерія",
		"NI": "Нікарагуа",
		"NL": "Нідерланди",
		"NO": "Норвегія",
		"NP": "Непал",
		"NR": "Науру",
		"NU": "Ніуе",
		"NZ": "Нова Зеландія",
		"OM": "Оман",
		"PA": "Панама",
		"PE": "Перу",
		"PF": "Французька Полінезія",
		"PG": "Папуа Нова Гвінея",
		"PH": "Філіппіни",
		"PK": "Пакистан",
		"PL": "Польща",
		"PM": "Сен-Пʼєр і Мікелон",
		"PN": "Острови Піткерн",
		"PR": "Пуерто-Рико",
		"PS": "Палестинські території",
		"PS-alt-short": "Палестина",
		"PT": "Португалія",
		"PW": "Палау",
		"PY": "Парагвай",
		"QA": "Катар",
		"QO": "Віддалені острови Океанії",
		"RE": "Реюньйон",
		"RO": "Румунія",
		"RS": "Сербія",
		"RU": "Росія",
		"RW": "Руанда",
		"SA": "Саудівська Аравія",
		"SB": "Соломонові Острови",
		"SC": "Сейшельські острови",
		"SD": "Судан",
		"SE": "Швеція",
		"SG": "Сінгапур",
		"SH": "Острів Святої Єлени",
		"SI": "Словенія",
		"SJ": "Острови Свальбард і Ян-Маєн",
		"SK": "Словаччина",
		"SL": "Сьєрра-Леоне",
		"SM": "Сан-Марино",
		"SN": "Сенегал",
		"SO": "Сомалі",
		"SR": "Суринам",
		"SS": "Південний Судан",
		"ST": "Сан-Томе і Прінсіпі",
		"SV": "Сальвадор",
		"SX": "Сінт-Мартен",
		"SY": "Сирія",
		"SZ": "Свазіленд",
		"TA": "Трістан-да-Кунья",
		"TC": "Острови Теркс і Кайкос",
		"TD": "Чад",
		"TF": "Французькі Південні Території",
		"TG": "Того",
		"TH": "Таїланд",
		"TJ": "Таджикистан",
		"TK": "Токелау",
		"TL": "Тимор-Лешті",
		"TL-alt-variant": "Східний Тимор",
		"TM": "Туркменістан",
		"TN": "Туніс",
		"TO": "Тонга",
		"TR": "Туреччина",
		"TT": "Тринідад і Тобаго",
		"TV": "Тувалу",
		"TW": "Тайвань",
		"TZ": "Танзанія",
		"UA": "Україна",
		"UG": "Уганда",
		"UM": "Віддалені острови США",
		"US": "США",
		"US-alt-short": "США",
		"UY": "Уругвай",
		"UZ": "Узбекистан",
		"VA": "Ватикан",
		"VC": "Сент-Вінсент і Гренадини",
		"VE": "Венесуела",
		"VG": "Британські Віргінські острови",
		"VI": "Віргінські острови, США",
		"VN": "Вʼєтнам",
		"VU": "Вануату",
		"WF": "Волліс і Футуна",
		"WS": "Самоа",
		"XK": "Косово",
		"YE": "Ємен",
		"YT": "Майотта",
		"ZA": "Південно-Африканська Республіка",
		"ZM": "Замбія",
		"ZW": "Зімбабве",
		"ZZ": "Невідомий регіон"
	},
	"orientation": "left-to-right",
	"ca-gregorian": {
		"dateFormats": {
			"full": "EEEE, d MMMM y 'р'.",
			"long": "d MMMM y 'р'.",
			"medium": "d MMM y 'р'.",
			"short": "dd.MM.yy"
		},
		"timeFormats": {
			"full": "HH:mm:ss zzzz",
			"long": "HH:mm:ss z",
			"medium": "HH:mm:ss",
			"short": "HH:mm"
		},
		"dateTimeFormats": {
			"full": "{1} 'о' {0}",
			"long": "{1} 'о' {0}",
			"medium": "{1}, {0}",
			"short": "{1}, {0}",
			"availableFormats": {
				"d": "d",
				"E": "ccc",
				"Ed": "E, d",
				"Ehm": "E h:mm a",
				"EHm": "E HH:mm",
				"Ehms": "E h:mm:ss a",
				"EHms": "E HH:mm:ss",
				"Gy": "y G",
				"GyMMM": "LLL y G",
				"GyMMMd": "d MMM y G",
				"GyMMMEd": "E, d MMM y G",
				"h": "h a",
				"H": "HH",
				"hm": "h:mm a",
				"Hm": "HH:mm",
				"hms": "h:mm:ss a",
				"Hms": "HH:mm:ss",
				"hmsv": "h:mm:ss a v",
				"Hmsv": "HH:mm:ss v",
				"hmv": "h:mm a v",
				"Hmv": "HH:mm v",
				"M": "LL",
				"Md": "dd.MM",
				"MEd": "E, dd.MM",
				"MMM": "LLL",
				"MMMd": "d MMM",
				"MMMEd": "E, d MMM",
				"MMMMd": "d MMMM",
				"MMMMEd": "E, d MMMM",
				"ms": "mm:ss",
				"y": "y",
				"yM": "MM.y",
				"yMd": "dd.MM.y",
				"yMEd": "E, dd.MM.y",
				"yMMM": "LLL y",
				"yMMMd": "d MMM y",
				"yMMMEd": "E, d MMM y",
				"yMMMM": "LLLL y",
				"yQQQ": "QQQ y",
				"yQQQQ": "QQQQ y 'р'."
			},
			"appendItems": {
				"Day": "{0} ({2}: {1})",
				"Day-Of-Week": "{0} {1}",
				"Era": "{1} {0}",
				"Hour": "{0} ({2}: {1})",
				"Minute": "{0} ({2}: {1})",
				"Month": "{0} ({2}: {1})",
				"Quarter": "{0} ({2}: {1})",
				"Second": "{0} ({2}: {1})",
				"Timezone": "{0} {1}",
				"Week": "{0} ({2}: {1})",
				"Year": "{1} {0}"
			},
			"intervalFormats": {
				"intervalFormatFallback": "{0} – {1}",
				"d": {
					"d": "d–d"
				},
				"h": {
					"a": "h a – h a",
					"h": "h–h a"
				},
				"H": {
					"H": "HH–HH"
				},
				"hm": {
					"a": "h:mm a – h:mm a",
					"h": "h:mm–h:mm a",
					"m": "h:mm–h:mm a"
				},
				"Hm": {
					"H": "HH:mm–HH:mm",
					"m": "HH:mm–HH:mm"
				},
				"hmv": {
					"a": "h:mm a – h:mm a v",
					"h": "h:mm–h:mm a v",
					"m": "h:mm–h:mm a v"
				},
				"Hmv": {
					"H": "HH:mm–HH:mm v",
					"m": "HH:mm–HH:mm v"
				},
				"hv": {
					"a": "h a – h a v",
					"h": "h–h a v"
				},
				"Hv": {
					"H": "HH–HH v"
				},
				"M": {
					"M": "M–M"
				},
				"Md": {
					"d": "dd.MM – dd.MM",
					"M": "dd.MM – dd.MM"
				},
				"MEd": {
					"d": "E, dd.MM – E, dd.MM",
					"M": "E, dd.MM – E, dd.MM"
				},
				"MMM": {
					"M": "LLL–LLL"
				},
				"MMMd": {
					"d": "d–d MMM",
					"M": "d MMM – d MMM"
				},
				"MMMEd": {
					"d": "E, d – E, d MMM",
					"M": "E, d MMM – E, d MMM"
				},
				"y": {
					"y": "y–y"
				},
				"yM": {
					"M": "MM.y – MM.y",
					"y": "MM.y – MM.y"
				},
				"yMd": {
					"d": "dd.MM.y – dd.MM.y",
					"M": "dd.MM.y – dd.MM.y",
					"y": "dd.MM.y – dd.MM.y"
				},
				"yMEd": {
					"d": "E, dd.MM.y – E, dd.MM.y",
					"M": "E, dd.MM.y – E, dd.MM.y",
					"y": "E, dd.MM.y – E, dd.MM.y"
				},
				"yMMM": {
					"M": "LLL–LLL y",
					"y": "LLL y – LLL y"
				},
				"yMMMd": {
					"d": "d–d MMM y",
					"M": "d MMM – d MMM y",
					"y": "d MMM y – d MMM y"
				},
				"yMMMEd": {
					"d": "E, d – E, d MMM y",
					"M": "E, d MMM – E, d MMM y",
					"y": "E, d MMM y – E, d MMM y"
				},
				"yMMMM": {
					"M": "LLLL – LLLL y",
					"y": "LLLL y – LLLL y"
				}
			}
		},
		"months": {
			"format": {
				"abbreviated": [
					"січ.",
					"лют.",
					"бер.",
					"квіт.",
					"трав.",
					"черв.",
					"лип.",
					"серп.",
					"вер.",
					"жовт.",
					"лист.",
					"груд."
				],
				"narrow": [
					"С",
					"Л",
					"Б",
					"К",
					"Т",
					"Ч",
					"Л",
					"С",
					"В",
					"Ж",
					"Л",
					"Г"
				],
				"wide": [
					"січня",
					"лютого",
					"березня",
					"квітня",
					"травня",
					"червня",
					"липня",
					"серпня",
					"вересня",
					"жовтня",
					"листопада",
					"грудня"
				]
			},
			"stand-alone": {
				"abbreviated": [
					"Січ",
					"Лют",
					"Бер",
					"Кві",
					"Тра",
					"Чер",
					"Лип",
					"Сер",
					"Вер",
					"Жов",
					"Лис",
					"Гру"
				],
				"narrow": [
					"С",
					"Л",
					"Б",
					"К",
					"Т",
					"Ч",
					"Л",
					"С",
					"В",
					"Ж",
					"Л",
					"Г"
				],
				"wide": [
					"січень",
					"лютий",
					"березень",
					"квітень",
					"травень",
					"червень",
					"липень",
					"серпень",
					"вересень",
					"жовтень",
					"листопад",
					"грудень"
				]
			}
		},
		"days": {
			"format": {
				"abbreviated": [
					"Нд",
					"Пн",
					"Вт",
					"Ср",
					"Чт",
					"Пт",
					"Сб"
				],
				"narrow": [
					"Н",
					"П",
					"В",
					"С",
					"Ч",
					"П",
					"С"
				],
				"short": [
					"Нд",
					"Пн",
					"Вт",
					"Ср",
					"Чт",
					"Пт",
					"Сб"
				],
				"wide": [
					"неділя",
					"понеділок",
					"вівторок",
					"середа",
					"четвер",
					"пʼятниця",
					"субота"
				]
			},
			"stand-alone": {
				"abbreviated": [
					"Нд",
					"Пн",
					"Вт",
					"Ср",
					"Чт",
					"Пт",
					"Сб"
				],
				"narrow": [
					"Н",
					"П",
					"В",
					"С",
					"Ч",
					"П",
					"С"
				],
				"short": [
					"Нд",
					"Пн",
					"Вт",
					"Ср",
					"Чт",
					"Пт",
					"Сб"
				],
				"wide": [
					"неділя",
					"понеділок",
					"вівторок",
					"середа",
					"четвер",
					"пʼятниця",
					"субота"
				]
			}
		},
		"quarters": {
			"format": {
				"abbreviated": [
					"1-й кв.",
					"2-й кв.",
					"3-й кв.",
					"4-й кв."
				],
				"narrow": [
					"1",
					"2",
					"3",
					"4"
				],
				"wide": [
					"1-й квартал",
					"2-й квартал",
					"3-й квартал",
					"4-й квартал"
				]
			},
			"stand-alone": {
				"abbreviated": [
					"1-й кв.",
					"2-й кв.",
					"3-й кв.",
					"4-й кв."
				],
				"narrow": [
					"1",
					"2",
					"3",
					"4"
				],
				"wide": [
					"1-й квартал",
					"2-й квартал",
					"3-й квартал",
					"4-й квартал"
				]
			}
		},
		"dayPeriods": {
			"format": {
				"abbreviated": [
					"дп",
					"пп"
				],
				"narrow": [
					"дп",
					"пп"
				],
				"wide": [
					"дп",
					"пп"
				]
			},
			"stand-alone": {
				"abbreviated": [
					"дп",
					"пп"
				],
				"narrow": [
					"дп",
					"пп"
				],
				"wide": [
					"дп",
					"пп"
				]
			}
		},
		"era-wide": {
			"0": "до нашої ери",
			"1": "нашої ери"
		},
		"era-abbreviated": {
			"0": "до н. е.",
			"1": "н. е."
		},
		"era-narrow": {
			"0": "до н.е.",
			"1": "н.е."
		}
	},
	"ca-islamic": {
		"dateFormats": {
			"full": "EEEE, d MMMM y 'р'. G",
			"long": "d MMMM y 'р'. G",
			"medium": "d MMM y G",
			"short": "dd.MM.yy GGGGG"
		},
		"timeFormats": {
			"full": "HH:mm:ss zzzz",
			"long": "HH:mm:ss z",
			"medium": "HH:mm:ss",
			"short": "HH:mm"
		},
		"dateTimeFormats": {
			"full": "{1} 'о' {0}",
			"long": "{1} 'о' {0}",
			"medium": "{1} {0}",
			"short": "{1} {0}",
			"availableFormats": {
				"d": "d",
				"E": "ccc",
				"Ed": "E, d",
				"Ehm": "E h:mm a",
				"EHm": "E HH:mm",
				"Ehms": "E h:mm:ss a",
				"EHms": "E HH:mm:ss",
				"Gy": "y G",
				"GyMMM": "LLL y G",
				"GyMMMd": "d MMM y G",
				"GyMMMEd": "E, d MMM y G",
				"h": "h a",
				"H": "HH",
				"hm": "h:mm a",
				"Hm": "HH:mm",
				"hms": "h:mm:ss a",
				"Hms": "HH:mm:ss",
				"M": "L",
				"Md": "dd.MM",
				"MEd": "E, dd.MM",
				"MMM": "LLL",
				"MMMd": "d MMM",
				"MMMEd": "E, d MMM",
				"MMMMd": "d MMMM",
				"MMMMEd": "E, d MMMM",
				"ms": "mm:ss",
				"y": "y G",
				"yyyy": "y G",
				"yyyyM": "MM.y G",
				"yyyyMd": "dd.MM.y G",
				"yyyyMEd": "E, dd.MM.y G",
				"yyyyMMM": "LLL y G",
				"yyyyMMMd": "d MMM y G",
				"yyyyMMMEd": "E, d MMM y G",
				"yyyyMMMM": "LLLL y G",
				"yyyyQQQ": "QQQ y G",
				"yyyyQQQQ": "QQQQ y 'р'. G"
			},
			"appendItems": {
				"Day": "{0} ({2}: {1})",
				"Day-Of-Week": "{0} {1}",
				"Era": "{1} {0}",
				"Hour": "{0} ({2}: {1})",
				"Minute": "{0} ({2}: {1})",
				"Month": "{0} ({2}: {1})",
				"Quarter": "{0} ({2}: {1})",
				"Second": "{0} ({2}: {1})",
				"Timezone": "{0} {1}",
				"Week": "{0} ({2}: {1})",
				"Year": "{1} {0}"
			},
			"intervalFormats": {
				"intervalFormatFallback": "{0} – {1}",
				"d": {
					"d": "d–d"
				},
				"h": {
					"a": "h a – h a",
					"h": "h–h a"
				},
				"H": {
					"H": "HH–HH"
				},
				"hm": {
					"a": "h:mm a – h:mm a",
					"h": "h:mm–h:mm a",
					"m": "h:mm–h:mm a"
				},
				"Hm": {
					"H": "HH:mm–HH:mm",
					"m": "HH:mm–HH:mm"
				},
				"hmv": {
					"a": "h:mm a – h:mm a v",
					"h": "h:mm–h:mm a v",
					"m": "h:mm–h:mm a v"
				},
				"Hmv": {
					"H": "HH:mm–HH:mm v",
					"m": "HH:mm–HH:mm v"
				},
				"hv": {
					"a": "h a – h a v",
					"h": "h–h a v"
				},
				"Hv": {
					"H": "HH–HH v"
				},
				"M": {
					"M": "M–M"
				},
				"Md": {
					"d": "dd.MM – dd.MM",
					"M": "dd.MM – dd.MM"
				},
				"MEd": {
					"d": "E, dd.MM – E, dd.MM",
					"M": "E, dd.MM – E, dd.MM"
				},
				"MMM": {
					"M": "LLL–LLL"
				},
				"MMMd": {
					"d": "d–d MMM",
					"M": "d MMM – d MMM"
				},
				"MMMEd": {
					"d": "E, d – E, d MMM",
					"M": "E, d MMM – E, d MMM"
				},
				"y": {
					"y": "y–y"
				},
				"yM": {
					"M": "MM.y – MM.y",
					"y": "MM.y – MM.y"
				},
				"yMd": {
					"d": "dd.MM.y – dd.MM.y",
					"M": "dd.MM.y – dd.MM.y",
					"y": "dd.MM.y – dd.MM.y"
				},
				"yMEd": {
					"d": "E, dd.MM.y – E, dd.MM.y",
					"M": "E, dd.MM.y – E, dd.MM.y",
					"y": "E, dd.MM.y – E, dd.MM.y"
				},
				"yMMM": {
					"M": "LLL–LLL y",
					"y": "LLL y – LLL y"
				},
				"yMMMd": {
					"d": "d–d MMM y",
					"M": "d MMM – d MMM y",
					"y": "d MMM y – d MMM y"
				},
				"yMMMEd": {
					"d": "E, d – E, d MMM y",
					"M": "E, d MMM – E, d MMM y",
					"y": "E, d MMM y – E, d MMM y"
				},
				"yMMMM": {
					"M": "LLLL – LLLL y",
					"y": "LLLL y – LLLL y"
				}
			}
		},
		"months": {
			"format": {
				"abbreviated": [
					"Muh.",
					"Saf.",
					"Rab. I",
					"Rab. II",
					"Jum. I",
					"Jum. II",
					"Raj.",
					"Sha.",
					"Ram.",
					"Shaw.",
					"Dhuʻl-Q.",
					"Dhuʻl-H."
				],
				"narrow": [
					"1",
					"2",
					"3",
					"4",
					"5",
					"6",
					"7",
					"8",
					"9",
					"10",
					"11",
					"12"
				],
				"wide": [
					"Мухаррам",
					"Сафар",
					"Рабі I",
					"Рабі II",
					"Джумада I",
					"Джумада II",
					"Раджаб",
					"Шаабан",
					"Рамадан",
					"Даввал",
					"Зу-ль-каада",
					"Зу-ль-хіджа"
				]
			},
			"stand-alone": {
				"abbreviated": [
					"Muh.",
					"Saf.",
					"Rab. I",
					"Rab. II",
					"Jum. I",
					"Jum. II",
					"Raj.",
					"Sha.",
					"Ram.",
					"Shaw.",
					"Dhuʻl-Q.",
					"Dhuʻl-H."
				],
				"narrow": [
					"1",
					"2",
					"3",
					"4",
					"5",
					"6",
					"7",
					"8",
					"9",
					"10",
					"11",
					"12"
				],
				"wide": [
					"Мухаррам",
					"Сафар",
					"Рабі I",
					"Рабі II",
					"Джумада I",
					"Джумада II",
					"Раджаб",
					"Шаабан",
					"Рамадан",
					"Даввал",
					"Зу-ль-каада",
					"Зу-ль-хіджа"
				]
			}
		},
		"days": {
			"format": {
				"abbreviated": [
					"Нд",
					"Пн",
					"Вт",
					"Ср",
					"Чт",
					"Пт",
					"Сб"
				],
				"narrow": [
					"Н",
					"П",
					"В",
					"С",
					"Ч",
					"П",
					"С"
				],
				"short": [
					"Нд",
					"Пн",
					"Вт",
					"Ср",
					"Чт",
					"Пт",
					"Сб"
				],
				"wide": [
					"неділя",
					"понеділок",
					"вівторок",
					"середа",
					"четвер",
					"пʼятниця",
					"субота"
				]
			},
			"stand-alone": {
				"abbreviated": [
					"Нд",
					"Пн",
					"Вт",
					"Ср",
					"Чт",
					"Пт",
					"Сб"
				],
				"narrow": [
					"Н",
					"П",
					"В",
					"С",
					"Ч",
					"П",
					"С"
				],
				"short": [
					"Нд",
					"Пн",
					"Вт",
					"Ср",
					"Чт",
					"Пт",
					"Сб"
				],
				"wide": [
					"неділя",
					"понеділок",
					"вівторок",
					"середа",
					"четвер",
					"пʼятниця",
					"субота"
				]
			}
		},
		"quarters": {
			"format": {
				"abbreviated": [
					"1-й кв.",
					"2-й кв.",
					"3-й кв.",
					"4-й кв."
				],
				"narrow": [
					"1",
					"2",
					"3",
					"4"
				],
				"wide": [
					"1-й квартал",
					"2-й квартал",
					"3-й квартал",
					"4-й квартал"
				]
			},
			"stand-alone": {
				"abbreviated": [
					"1-й кв.",
					"2-й кв.",
					"3-й кв.",
					"4-й кв."
				],
				"narrow": [
					"1",
					"2",
					"3",
					"4"
				],
				"wide": [
					"1-й квартал",
					"2-й квартал",
					"3-й квартал",
					"4-й квартал"
				]
			}
		},
		"dayPeriods": {
			"format": {
				"abbreviated": [
					"дп",
					"пп"
				],
				"narrow": [
					"дп",
					"пп"
				],
				"wide": [
					"дп",
					"пп"
				]
			},
			"stand-alone": {
				"abbreviated": [
					"дп",
					"пп"
				],
				"narrow": [
					"дп",
					"пп"
				],
				"wide": [
					"дп",
					"пп"
				]
			}
		},
		"era-wide": {
			"0": "AH"
		},
		"era-abbreviated": {
			"0": "AH"
		},
		"era-narrow": {
			"0": "AH"
		}
	},
	"ca-japanese": {
		"dateFormats": {
			"full": "EEEE, d MMMM y 'р'. G",
			"long": "d MMMM y 'р'. G",
			"medium": "d MMM y G",
			"short": "dd.MM.yy GGGGG"
		},
		"timeFormats": {
			"full": "HH:mm:ss zzzz",
			"long": "HH:mm:ss z",
			"medium": "HH:mm:ss",
			"short": "HH:mm"
		},
		"dateTimeFormats": {
			"full": "{1} 'о' {0}",
			"long": "{1} 'о' {0}",
			"medium": "{1} {0}",
			"short": "{1} {0}",
			"availableFormats": {
				"d": "d",
				"E": "ccc",
				"Ed": "E, d",
				"Ehm": "E h:mm a",
				"EHm": "E HH:mm",
				"Ehms": "E h:mm:ss a",
				"EHms": "E HH:mm:ss",
				"Gy": "y G",
				"GyMMM": "LLL y G",
				"GyMMMd": "d MMM y G",
				"GyMMMEd": "E, d MMM y G",
				"h": "h a",
				"H": "HH",
				"hm": "h:mm a",
				"Hm": "HH:mm",
				"hms": "h:mm:ss a",
				"Hms": "HH:mm:ss",
				"M": "L",
				"Md": "dd.MM",
				"MEd": "E, dd.MM",
				"MMM": "LLL",
				"MMMd": "d MMM",
				"MMMEd": "E, d MMM",
				"MMMMd": "d MMMM",
				"MMMMEd": "E, d MMMM",
				"ms": "mm:ss",
				"y": "y G",
				"yyyy": "y G",
				"yyyyM": "MM.y G",
				"yyyyMd": "dd.MM.y G",
				"yyyyMEd": "E, dd.MM.y G",
				"yyyyMMM": "LLL y G",
				"yyyyMMMd": "d MMM y G",
				"yyyyMMMEd": "E, d MMM y G",
				"yyyyMMMM": "LLLL y G",
				"yyyyQQQ": "QQQ y G",
				"yyyyQQQQ": "QQQQ y 'р'. G"
			},
			"appendItems": {
				"Day": "{0} ({2}: {1})",
				"Day-Of-Week": "{0} {1}",
				"Era": "{1} {0}",
				"Hour": "{0} ({2}: {1})",
				"Minute": "{0} ({2}: {1})",
				"Month": "{0} ({2}: {1})",
				"Quarter": "{0} ({2}: {1})",
				"Second": "{0} ({2}: {1})",
				"Timezone": "{0} {1}",
				"Week": "{0} ({2}: {1})",
				"Year": "{1} {0}"
			},
			"intervalFormats": {
				"intervalFormatFallback": "{0} – {1}",
				"d": {
					"d": "d–d"
				},
				"h": {
					"a": "h a – h a",
					"h": "h–h a"
				},
				"H": {
					"H": "HH–HH"
				},
				"hm": {
					"a": "h:mm a – h:mm a",
					"h": "h:mm–h:mm a",
					"m": "h:mm–h:mm a"
				},
				"Hm": {
					"H": "HH:mm–HH:mm",
					"m": "HH:mm–HH:mm"
				},
				"hmv": {
					"a": "h:mm a – h:mm a v",
					"h": "h:mm–h:mm a v",
					"m": "h:mm–h:mm a v"
				},
				"Hmv": {
					"H": "HH:mm–HH:mm v",
					"m": "HH:mm–HH:mm v"
				},
				"hv": {
					"a": "h a – h a v",
					"h": "h–h a v"
				},
				"Hv": {
					"H": "HH–HH v"
				},
				"M": {
					"M": "M–M"
				},
				"Md": {
					"d": "dd.MM – dd.MM",
					"M": "dd.MM – dd.MM"
				},
				"MEd": {
					"d": "E, dd.MM – E, dd.MM",
					"M": "E, dd.MM – E, dd.MM"
				},
				"MMM": {
					"M": "LLL–LLL"
				},
				"MMMd": {
					"d": "d–d MMM",
					"M": "d MMM – d MMM"
				},
				"MMMEd": {
					"d": "E, d – E, d MMM",
					"M": "E, d MMM – E, d MMM"
				},
				"y": {
					"y": "y–y"
				},
				"yM": {
					"M": "MM.y – MM.y",
					"y": "MM.y – MM.y"
				},
				"yMd": {
					"d": "dd.MM.y – dd.MM.y",
					"M": "dd.MM.y – dd.MM.y",
					"y": "dd.MM.y – dd.MM.y"
				},
				"yMEd": {
					"d": "E, dd.MM.y – E, dd.MM.y",
					"M": "E, dd.MM.y – E, dd.MM.y",
					"y": "E, dd.MM.y – E, dd.MM.y"
				},
				"yMMM": {
					"M": "LLL–LLL y",
					"y": "LLL y – LLL y"
				},
				"yMMMd": {
					"d": "d–d MMM y",
					"M": "d MMM – d MMM y",
					"y": "d MMM y – d MMM y"
				},
				"yMMMEd": {
					"d": "E, d – E, d MMM y",
					"M": "E, d MMM – E, d MMM y",
					"y": "E, d MMM y – E, d MMM y"
				},
				"yMMMM": {
					"M": "LLLL – LLLL y",
					"y": "LLLL y – LLLL y"
				}
			}
		},
		"months": {
			"format": {
				"abbreviated": [
					"січ.",
					"лют.",
					"бер.",
					"квіт.",
					"трав.",
					"черв.",
					"лип.",
					"серп.",
					"вер.",
					"жовт.",
					"лист.",
					"груд."
				],
				"narrow": [
					"С",
					"Л",
					"Б",
					"К",
					"Т",
					"Ч",
					"Л",
					"С",
					"В",
					"Ж",
					"Л",
					"Г"
				],
				"wide": [
					"січня",
					"лютого",
					"березня",
					"квітня",
					"травня",
					"червня",
					"липня",
					"серпня",
					"вересня",
					"жовтня",
					"листопада",
					"грудня"
				]
			},
			"stand-alone": {
				"abbreviated": [
					"Січ",
					"Лют",
					"Бер",
					"Кві",
					"Тра",
					"Чер",
					"Лип",
					"Сер",
					"Вер",
					"Жов",
					"Лис",
					"Гру"
				],
				"narrow": [
					"С",
					"Л",
					"Б",
					"К",
					"Т",
					"Ч",
					"Л",
					"С",
					"В",
					"Ж",
					"Л",
					"Г"
				],
				"wide": [
					"січень",
					"лютий",
					"березень",
					"квітень",
					"травень",
					"червень",
					"липень",
					"серпень",
					"вересень",
					"жовтень",
					"листопад",
					"грудень"
				]
			}
		},
		"days": {
			"format": {
				"abbreviated": [
					"Нд",
					"Пн",
					"Вт",
					"Ср",
					"Чт",
					"Пт",
					"Сб"
				],
				"narrow": [
					"Н",
					"П",
					"В",
					"С",
					"Ч",
					"П",
					"С"
				],
				"short": [
					"Нд",
					"Пн",
					"Вт",
					"Ср",
					"Чт",
					"Пт",
					"Сб"
				],
				"wide": [
					"неділя",
					"понеділок",
					"вівторок",
					"середа",
					"четвер",
					"пʼятниця",
					"субота"
				]
			},
			"stand-alone": {
				"abbreviated": [
					"Нд",
					"Пн",
					"Вт",
					"Ср",
					"Чт",
					"Пт",
					"Сб"
				],
				"narrow": [
					"Н",
					"П",
					"В",
					"С",
					"Ч",
					"П",
					"С"
				],
				"short": [
					"Нд",
					"Пн",
					"Вт",
					"Ср",
					"Чт",
					"Пт",
					"Сб"
				],
				"wide": [
					"неділя",
					"понеділок",
					"вівторок",
					"середа",
					"четвер",
					"пʼятниця",
					"субота"
				]
			}
		},
		"quarters": {
			"format": {
				"abbreviated": [
					"1-й кв.",
					"2-й кв.",
					"3-й кв.",
					"4-й кв."
				],
				"narrow": [
					"1",
					"2",
					"3",
					"4"
				],
				"wide": [
					"1-й квартал",
					"2-й квартал",
					"3-й квартал",
					"4-й квартал"
				]
			},
			"stand-alone": {
				"abbreviated": [
					"1-й кв.",
					"2-й кв.",
					"3-й кв.",
					"4-й кв."
				],
				"narrow": [
					"1",
					"2",
					"3",
					"4"
				],
				"wide": [
					"1-й квартал",
					"2-й квартал",
					"3-й квартал",
					"4-й квартал"
				]
			}
		},
		"dayPeriods": {
			"format": {
				"abbreviated": [
					"дп",
					"пп"
				],
				"narrow": [
					"дп",
					"пп"
				],
				"wide": [
					"дп",
					"пп"
				]
			},
			"stand-alone": {
				"abbreviated": [
					"дп",
					"пп"
				],
				"narrow": [
					"дп",
					"пп"
				],
				"wide": [
					"дп",
					"пп"
				]
			}
		},
		"era-wide": {
			"232": "Meiji",
			"233": "Taishō",
			"234": "Shōwa",
			"235": "Heisei"
		},
		"era-abbreviated": {
			"232": "Meiji",
			"233": "Taishō",
			"234": "Shōwa",
			"235": "Heisei"
		},
		"era-narrow": {
			"232": "M",
			"233": "T",
			"234": "S",
			"235": "H"
		}
	},
	"ca-persian": {
		"dateFormats": {
			"full": "EEEE, d MMMM y 'р'. G",
			"long": "d MMMM y 'р'. G",
			"medium": "d MMM y G",
			"short": "dd.MM.yy GGGGG"
		},
		"timeFormats": {
			"full": "HH:mm:ss zzzz",
			"long": "HH:mm:ss z",
			"medium": "HH:mm:ss",
			"short": "HH:mm"
		},
		"dateTimeFormats": {
			"full": "{1} 'о' {0}",
			"long": "{1} 'о' {0}",
			"medium": "{1} {0}",
			"short": "{1} {0}",
			"availableFormats": {
				"d": "d",
				"E": "ccc",
				"Ed": "E, d",
				"Ehm": "E h:mm a",
				"EHm": "E HH:mm",
				"Ehms": "E h:mm:ss a",
				"EHms": "E HH:mm:ss",
				"Gy": "y G",
				"GyMMM": "LLL y G",
				"GyMMMd": "d MMM y G",
				"GyMMMEd": "E, d MMM y G",
				"h": "h a",
				"H": "HH",
				"hm": "h:mm a",
				"Hm": "HH:mm",
				"hms": "h:mm:ss a",
				"Hms": "HH:mm:ss",
				"M": "L",
				"Md": "dd.MM",
				"MEd": "E, dd.MM",
				"MMM": "LLL",
				"MMMd": "d MMM",
				"MMMEd": "E, d MMM",
				"MMMMd": "d MMMM",
				"MMMMEd": "E, d MMMM",
				"ms": "mm:ss",
				"y": "y G",
				"yyyy": "y G",
				"yyyyM": "MM.y G",
				"yyyyMd": "dd.MM.y G",
				"yyyyMEd": "E, dd.MM.y G",
				"yyyyMMM": "LLL y G",
				"yyyyMMMd": "d MMM y G",
				"yyyyMMMEd": "E, d MMM y G",
				"yyyyMMMM": "LLLL y G",
				"yyyyQQQ": "QQQ y G",
				"yyyyQQQQ": "QQQQ y 'р'. G"
			},
			"appendItems": {
				"Day": "{0} ({2}: {1})",
				"Day-Of-Week": "{0} {1}",
				"Era": "{1} {0}",
				"Hour": "{0} ({2}: {1})",
				"Minute": "{0} ({2}: {1})",
				"Month": "{0} ({2}: {1})",
				"Quarter": "{0} ({2}: {1})",
				"Second": "{0} ({2}: {1})",
				"Timezone": "{0} {1}",
				"Week": "{0} ({2}: {1})",
				"Year": "{1} {0}"
			},
			"intervalFormats": {
				"intervalFormatFallback": "{0} – {1}",
				"d": {
					"d": "d–d"
				},
				"h": {
					"a": "h a – h a",
					"h": "h–h a"
				},
				"H": {
					"H": "HH–HH"
				},
				"hm": {
					"a": "h:mm a – h:mm a",
					"h": "h:mm–h:mm a",
					"m": "h:mm–h:mm a"
				},
				"Hm": {
					"H": "HH:mm–HH:mm",
					"m": "HH:mm–HH:mm"
				},
				"hmv": {
					"a": "h:mm a – h:mm a v",
					"h": "h:mm–h:mm a v",
					"m": "h:mm–h:mm a v"
				},
				"Hmv": {
					"H": "HH:mm–HH:mm v",
					"m": "HH:mm–HH:mm v"
				},
				"hv": {
					"a": "h a – h a v",
					"h": "h–h a v"
				},
				"Hv": {
					"H": "HH–HH v"
				},
				"M": {
					"M": "M–M"
				},
				"Md": {
					"d": "dd.MM – dd.MM",
					"M": "dd.MM – dd.MM"
				},
				"MEd": {
					"d": "E, dd.MM – E, dd.MM",
					"M": "E, dd.MM – E, dd.MM"
				},
				"MMM": {
					"M": "LLL–LLL"
				},
				"MMMd": {
					"d": "d–d MMM",
					"M": "d MMM – d MMM"
				},
				"MMMEd": {
					"d": "E, d – E, d MMM",
					"M": "E, d MMM – E, d MMM"
				},
				"y": {
					"y": "y–y"
				},
				"yM": {
					"M": "MM.y – MM.y",
					"y": "MM.y – MM.y"
				},
				"yMd": {
					"d": "dd.MM.y – dd.MM.y",
					"M": "dd.MM.y – dd.MM.y",
					"y": "dd.MM.y – dd.MM.y"
				},
				"yMEd": {
					"d": "E, dd.MM.y – E, dd.MM.y",
					"M": "E, dd.MM.y – E, dd.MM.y",
					"y": "E, dd.MM.y – E, dd.MM.y"
				},
				"yMMM": {
					"M": "LLL–LLL y",
					"y": "LLL y – LLL y"
				},
				"yMMMd": {
					"d": "d–d MMM y",
					"M": "d MMM – d MMM y",
					"y": "d MMM y – d MMM y"
				},
				"yMMMEd": {
					"d": "E, d – E, d MMM y",
					"M": "E, d MMM – E, d MMM y",
					"y": "E, d MMM y – E, d MMM y"
				},
				"yMMMM": {
					"M": "LLLL – LLLL y",
					"y": "LLLL y – LLLL y"
				}
			}
		},
		"months": {
			"format": {
				"abbreviated": [
					"Фарвардін",
					"Ордібехешт",
					"Хордад",
					"Тір",
					"Мордад",
					"Шахрівер",
					"Мехр",
					"Абан",
					"Азер",
					"Дей",
					"Бахман",
					"Есфанд"
				],
				"narrow": [
					"1",
					"2",
					"3",
					"4",
					"5",
					"6",
					"7",
					"8",
					"9",
					"10",
					"11",
					"12"
				],
				"wide": [
					"Фарвардін",
					"Ордібехешт",
					"Хордад",
					"Тір",
					"Мордад",
					"Шахрівер",
					"Мехр",
					"Абан",
					"Азер",
					"Дей",
					"Бахман",
					"Есфанд"
				]
			},
			"stand-alone": {
				"abbreviated": [
					"Фарвардін",
					"Ордібехешт",
					"Хордад",
					"Тір",
					"Мордад",
					"Шахрівер",
					"Мехр",
					"Абан",
					"Азер",
					"Дей",
					"Бахман",
					"Есфанд"
				],
				"narrow": [
					"1",
					"2",
					"3",
					"4",
					"5",
					"6",
					"7",
					"8",
					"9",
					"10",
					"11",
					"12"
				],
				"wide": [
					"Фарвардін",
					"Ордібехешт",
					"Хордад",
					"Тір",
					"Мордад",
					"Шахрівер",
					"Мехр",
					"Абан",
					"Азер",
					"Дей",
					"Бахман",
					"Есфанд"
				]
			}
		},
		"days": {
			"format": {
				"abbreviated": [
					"Нд",
					"Пн",
					"Вт",
					"Ср",
					"Чт",
					"Пт",
					"Сб"
				],
				"narrow": [
					"Н",
					"П",
					"В",
					"С",
					"Ч",
					"П",
					"С"
				],
				"short": [
					"Нд",
					"Пн",
					"Вт",
					"Ср",
					"Чт",
					"Пт",
					"Сб"
				],
				"wide": [
					"неділя",
					"понеділок",
					"вівторок",
					"середа",
					"четвер",
					"пʼятниця",
					"субота"
				]
			},
			"stand-alone": {
				"abbreviated": [
					"Нд",
					"Пн",
					"Вт",
					"Ср",
					"Чт",
					"Пт",
					"Сб"
				],
				"narrow": [
					"Н",
					"П",
					"В",
					"С",
					"Ч",
					"П",
					"С"
				],
				"short": [
					"Нд",
					"Пн",
					"Вт",
					"Ср",
					"Чт",
					"Пт",
					"Сб"
				],
				"wide": [
					"неділя",
					"понеділок",
					"вівторок",
					"середа",
					"четвер",
					"пʼятниця",
					"субота"
				]
			}
		},
		"quarters": {
			"format": {
				"abbreviated": [
					"1-й кв.",
					"2-й кв.",
					"3-й кв.",
					"4-й кв."
				],
				"narrow": [
					"1",
					"2",
					"3",
					"4"
				],
				"wide": [
					"1-й квартал",
					"2-й квартал",
					"3-й квартал",
					"4-й квартал"
				]
			},
			"stand-alone": {
				"abbreviated": [
					"1-й кв.",
					"2-й кв.",
					"3-й кв.",
					"4-й кв."
				],
				"narrow": [
					"1",
					"2",
					"3",
					"4"
				],
				"wide": [
					"1-й квартал",
					"2-й квартал",
					"3-й квартал",
					"4-й квартал"
				]
			}
		},
		"dayPeriods": {
			"format": {
				"abbreviated": [
					"дп",
					"пп"
				],
				"narrow": [
					"дп",
					"пп"
				],
				"wide": [
					"дп",
					"пп"
				]
			},
			"stand-alone": {
				"abbreviated": [
					"дп",
					"пп"
				],
				"narrow": [
					"дп",
					"пп"
				],
				"wide": [
					"дп",
					"пп"
				]
			}
		},
		"era-wide": {
			"0": "AP"
		},
		"era-abbreviated": {
			"0": "AP"
		},
		"era-narrow": {
			"0": "AP"
		}
	},
	"dateFields": {
		"era": {
			"displayName": "ера"
		},
		"year-wide": {
			"displayName": "рік",
			"relative-type--1": "торік",
			"relative-type-0": "цього року",
			"relative-type-1": "наступного року",
			"relativeTime-type-future": {
				"relativeTimePattern-count-one": "через {0} рік",
				"relativeTimePattern-count-few": "через {0} роки",
				"relativeTimePattern-count-many": "через {0} років",
				"relativeTimePattern-count-other": "через {0} року"
			},
			"relativeTime-type-past": {
				"relativeTimePattern-count-one": "{0} рік тому",
				"relativeTimePattern-count-few": "{0} роки тому",
				"relativeTimePattern-count-many": "{0} років тому",
				"relativeTimePattern-count-other": "{0} року тому"
			}
		},
		"year-short": {
			"displayName": "р.",
			"relative-type--1": "торік",
			"relative-type-0": "цього року",
			"relative-type-1": "наступного року",
			"relativeTime-type-future": {
				"relativeTimePattern-count-one": "через {0} р.",
				"relativeTimePattern-count-few": "через {0} р.",
				"relativeTimePattern-count-many": "через {0} р.",
				"relativeTimePattern-count-other": "через {0} р."
			},
			"relativeTime-type-past": {
				"relativeTimePattern-count-one": "{0} р. тому",
				"relativeTimePattern-count-few": "{0} р. тому",
				"relativeTimePattern-count-many": "{0} р. тому",
				"relativeTimePattern-count-other": "{0} р. тому"
			}
		},
		"year-narrow": {
			"displayName": "р.",
			"relative-type--1": "торік",
			"relative-type-0": "цього року",
			"relative-type-1": "наступного року",
			"relativeTime-type-future": {
				"relativeTimePattern-count-one": "+{0} р.",
				"relativeTimePattern-count-few": "+{0} р.",
				"relativeTimePattern-count-many": "+{0} р.",
				"relativeTimePattern-count-other": "+{0} р."
			},
			"relativeTime-type-past": {
				"relativeTimePattern-count-one": "-{0} р.",
				"relativeTimePattern-count-few": "-{0} р.",
				"relativeTimePattern-count-many": "-{0} р.",
				"relativeTimePattern-count-other": "-{0} р."
			}
		},
		"quarter-wide": {
			"displayName": "квартал",
			"relative-type--1": "минулого кварталу",
			"relative-type-0": "цього кварталу",
			"relative-type-1": "наступного кварталу",
			"relativeTime-type-future": {
				"relativeTimePattern-count-one": "через {0} квартал",
				"relativeTimePattern-count-few": "через {0} квартали",
				"relativeTimePattern-count-many": "через {0} кварталів",
				"relativeTimePattern-count-other": "через {0} кварталу"
			},
			"relativeTime-type-past": {
				"relativeTimePattern-count-one": "{0} квартал тому",
				"relativeTimePattern-count-few": "{0} квартали тому",
				"relativeTimePattern-count-many": "{0} кварталів тому",
				"relativeTimePattern-count-other": "{0} кварталу тому"
			}
		},
		"quarter-short": {
			"displayName": "кв.",
			"relative-type--1": "минулого кв.",
			"relative-type-0": "цього кв.",
			"relative-type-1": "наступного кв.",
			"relativeTime-type-future": {
				"relativeTimePattern-count-one": "через {0} кв.",
				"relativeTimePattern-count-few": "через {0} кв.",
				"relativeTimePattern-count-many": "через {0} кв.",
				"relativeTimePattern-count-other": "через {0} кв."
			},
			"relativeTime-type-past": {
				"relativeTimePattern-count-one": "{0} кв. тому",
				"relativeTimePattern-count-few": "{0} кв. тому",
				"relativeTimePattern-count-many": "{0} кв. тому",
				"relativeTimePattern-count-other": "{0} кв. тому"
			}
		},
		"quarter-narrow": {
			"displayName": "кв.",
			"relative-type--1": "минулого кв.",
			"relative-type-0": "цього кв.",
			"relative-type-1": "наступного кв.",
			"relativeTime-type-future": {
				"relativeTimePattern-count-one": "+{0} кв.",
				"relativeTimePattern-count-few": "+{0} кв.",
				"relativeTimePattern-count-many": "+{0} кв.",
				"relativeTimePattern-count-other": "+{0} кв."
			},
			"relativeTime-type-past": {
				"relativeTimePattern-count-one": "-{0} кв.",
				"relativeTimePattern-count-few": "-{0} кв.",
				"relativeTimePattern-count-many": "-{0} кв.",
				"relativeTimePattern-count-other": "-{0} кв."
			}
		},
		"month-wide": {
			"displayName": "місяць",
			"relative-type--1": "минулого місяця",
			"relative-type-0": "цього місяця",
			"relative-type-1": "наступного місяця",
			"relativeTime-type-future": {
				"relativeTimePattern-count-one": "через {0} місяць",
				"relativeTimePattern-count-few": "через {0} місяці",
				"relativeTimePattern-count-many": "через {0} місяців",
				"relativeTimePattern-count-other": "через {0} місяця"
			},
			"relativeTime-type-past": {
				"relativeTimePattern-count-one": "{0} місяць тому",
				"relativeTimePattern-count-few": "{0} місяці тому",
				"relativeTimePattern-count-many": "{0} місяців тому",
				"relativeTimePattern-count-other": "{0} місяця тому"
			}
		},
		"month-short": {
			"displayName": "міс.",
			"relative-type--1": "минулого місяця",
			"relative-type-0": "цього місяця",
			"relative-type-1": "наступного місяця",
			"relativeTime-type-future": {
				"relativeTimePattern-count-one": "через {0} міс.",
				"relativeTimePattern-count-few": "через {0} міс.",
				"relativeTimePattern-count-many": "через {0} міс.",
				"relativeTimePattern-count-other": "через {0} міс."
			},
			"relativeTime-type-past": {
				"relativeTimePattern-count-one": "{0} міс. тому",
				"relativeTimePattern-count-few": "{0} міс. тому",
				"relativeTimePattern-count-many": "{0} міс. тому",
				"relativeTimePattern-count-other": "{0} міс. тому"
			}
		},
		"month-narrow": {
			"displayName": "міс.",
			"relative-type--1": "минулого місяця",
			"relative-type-0": "цього місяця",
			"relative-type-1": "наступного місяця",
			"relativeTime-type-future": {
				"relativeTimePattern-count-one": "+{0} міс.",
				"relativeTimePattern-count-few": "+{0} міс.",
				"relativeTimePattern-count-many": "+{0} міс.",
				"relativeTimePattern-count-other": "+{0} міс."
			},
			"relativeTime-type-past": {
				"relativeTimePattern-count-one": "-{0} міс.",
				"relativeTimePattern-count-few": "-{0} міс.",
				"relativeTimePattern-count-many": "-{0} міс.",
				"relativeTimePattern-count-other": "-{0} міс."
			}
		},
		"week-wide": {
			"displayName": "тиждень",
			"relative-type--1": "минулого тижня",
			"relative-type-0": "цього тижня",
			"relative-type-1": "наступного тижня",
			"relativeTime-type-future": {
				"relativeTimePattern-count-one": "через {0} тиждень",
				"relativeTimePattern-count-few": "через {0} тижні",
				"relativeTimePattern-count-many": "через {0} тижнів",
				"relativeTimePattern-count-other": "через {0} тижня"
			},
			"relativeTime-type-past": {
				"relativeTimePattern-count-one": "{0} тиждень тому",
				"relativeTimePattern-count-few": "{0} тижні тому",
				"relativeTimePattern-count-many": "{0} тижнів тому",
				"relativeTimePattern-count-other": "{0} тижня тому"
			}
		},
		"week-short": {
			"displayName": "тиж.",
			"relative-type--1": "минулого тижня",
			"relative-type-0": "цього тижня",
			"relative-type-1": "наступного тижня",
			"relativeTime-type-future": {
				"relativeTimePattern-count-one": "через {0} тиж.",
				"relativeTimePattern-count-few": "через {0} тиж.",
				"relativeTimePattern-count-many": "через {0} тиж.",
				"relativeTimePattern-count-other": "через {0} тиж."
			},
			"relativeTime-type-past": {
				"relativeTimePattern-count-one": "{0} тиж. тому",
				"relativeTimePattern-count-few": "{0} тиж. тому",
				"relativeTimePattern-count-many": "{0} тиж. тому",
				"relativeTimePattern-count-other": "{0} тиж. тому"
			}
		},
		"week-narrow": {
			"displayName": "тиж.",
			"relative-type--1": "минулого тижня",
			"relative-type-0": "цього тижня",
			"relative-type-1": "наступного тижня",
			"relativeTime-type-future": {
				"relativeTimePattern-count-one": "+{0} тиж.",
				"relativeTimePattern-count-few": "+{0} тиж.",
				"relativeTimePattern-count-many": "+{0} тиж.",
				"relativeTimePattern-count-other": "+{0} тиж."
			},
			"relativeTime-type-past": {
				"relativeTimePattern-count-one": "-{0} тиж.",
				"relativeTimePattern-count-few": "-{0} тиж.",
				"relativeTimePattern-count-many": "-{0} тиж.",
				"relativeTimePattern-count-other": "-{0} тиж."
			}
		},
		"day-wide": {
			"displayName": "день",
			"relative-type--2": "позавчора",
			"relative-type--1": "учора",
			"relative-type-0": "сьогодні",
			"relative-type-1": "завтра",
			"relative-type-2": "післязавтра",
			"relativeTime-type-future": {
				"relativeTimePattern-count-one": "через {0} день",
				"relativeTimePattern-count-few": "через {0} дні",
				"relativeTimePattern-count-many": "через {0} днів",
				"relativeTimePattern-count-other": "через {0} дня"
			},
			"relativeTime-type-past": {
				"relativeTimePattern-count-one": "{0} день тому",
				"relativeTimePattern-count-few": "{0} дні тому",
				"relativeTimePattern-count-many": "{0} днів тому",
				"relativeTimePattern-count-other": "{0} дня тому"
			}
		},
		"day-short": {
			"displayName": "д.",
			"relative-type--2": "позавчора",
			"relative-type--1": "учора",
			"relative-type-0": "сьогодні",
			"relative-type-1": "завтра",
			"relative-type-2": "післязавтра",
			"relativeTime-type-future": {
				"relativeTimePattern-count-one": "через {0} д.",
				"relativeTimePattern-count-few": "через {0} дн.",
				"relativeTimePattern-count-many": "через {0} дн.",
				"relativeTimePattern-count-other": "через {0} дн."
			},
			"relativeTime-type-past": {
				"relativeTimePattern-count-one": "{0} д. тому",
				"relativeTimePattern-count-few": "{0} дн. тому",
				"relativeTimePattern-count-many": "{0} дн. тому",
				"relativeTimePattern-count-other": "{0} дн. тому"
			}
		},
		"day-narrow": {
			"displayName": "д.",
			"relative-type--2": "позавчора",
			"relative-type--1": "учора",
			"relative-type-0": "сьогодні",
			"relative-type-1": "завтра",
			"relative-type-2": "післязавтра",
			"relativeTime-type-future": {
				"relativeTimePattern-count-one": "+{0} день",
				"relativeTimePattern-count-few": "+{0} дн.",
				"relativeTimePattern-count-many": "+{0} дн.",
				"relativeTimePattern-count-other": "+{0} дн."
			},
			"relativeTime-type-past": {
				"relativeTimePattern-count-one": "-{0} день",
				"relativeTimePattern-count-few": "-{0} дн.",
				"relativeTimePattern-count-many": "-{0} дн.",
				"relativeTimePattern-count-other": "-{0} дн."
			}
		},
		"weekday": {
			"displayName": "день тижня"
		},
		"hour-wide": {
			"displayName": "година",
			"relativeTime-type-future": {
				"relativeTimePattern-count-one": "через {0} годину",
				"relativeTimePattern-count-few": "через {0} години",
				"relativeTimePattern-count-many": "через {0} годин",
				"relativeTimePattern-count-other": "через {0} години"
			},
			"relativeTime-type-past": {
				"relativeTimePattern-count-one": "{0} годину тому",
				"relativeTimePattern-count-few": "{0} години тому",
				"relativeTimePattern-count-many": "{0} годин тому",
				"relativeTimePattern-count-other": "{0} години тому"
			}
		},
		"hour-short": {
			"displayName": "год",
			"relativeTime-type-future": {
				"relativeTimePattern-count-one": "через {0} год",
				"relativeTimePattern-count-few": "через {0} год",
				"relativeTimePattern-count-many": "через {0} год",
				"relativeTimePattern-count-other": "через {0} год"
			},
			"relativeTime-type-past": {
				"relativeTimePattern-count-one": "{0} год тому",
				"relativeTimePattern-count-few": "{0} год тому",
				"relativeTimePattern-count-many": "{0} год тому",
				"relativeTimePattern-count-other": "{0} год тому"
			}
		},
		"hour-narrow": {
			"displayName": "год",
			"relativeTime-type-future": {
				"relativeTimePattern-count-one": "+{0} год",
				"relativeTimePattern-count-few": "+{0} год",
				"relativeTimePattern-count-many": "+{0} год",
				"relativeTimePattern-count-other": "+{0} год"
			},
			"relativeTime-type-past": {
				"relativeTimePattern-count-one": "-{0} год",
				"relativeTimePattern-count-few": "-{0} год",
				"relativeTimePattern-count-many": "-{0} год",
				"relativeTimePattern-count-other": "-{0} год"
			}
		},
		"minute-wide": {
			"displayName": "хвилина",
			"relativeTime-type-future": {
				"relativeTimePattern-count-one": "через {0} хвилину",
				"relativeTimePattern-count-few": "через {0} хвилини",
				"relativeTimePattern-count-many": "через {0} хвилин",
				"relativeTimePattern-count-other": "через {0} хвилини"
			},
			"relativeTime-type-past": {
				"relativeTimePattern-count-one": "{0} хвилину тому",
				"relativeTimePattern-count-few": "{0} хвилини тому",
				"relativeTimePattern-count-many": "{0} хвилин тому",
				"relativeTimePattern-count-other": "{0} хвилини тому"
			}
		},
		"minute-short": {
			"displayName": "хв",
			"relativeTime-type-future": {
				"relativeTimePattern-count-one": "через {0} хв",
				"relativeTimePattern-count-few": "через {0} хв",
				"relativeTimePattern-count-many": "через {0} хв",
				"relativeTimePattern-count-other": "через {0} хв"
			},
			"relativeTime-type-past": {
				"relativeTimePattern-count-one": "{0} хв тому",
				"relativeTimePattern-count-few": "{0} хв тому",
				"relativeTimePattern-count-many": "{0} хв тому",
				"relativeTimePattern-count-other": "{0} хв тому"
			}
		},
		"minute-narrow": {
			"displayName": "хв",
			"relativeTime-type-future": {
				"relativeTimePattern-count-one": "+{0} хв",
				"relativeTimePattern-count-few": "+{0} хв",
				"relativeTimePattern-count-many": "+{0} хв",
				"relativeTimePattern-count-other": "+{0} хв"
			},
			"relativeTime-type-past": {
				"relativeTimePattern-count-one": "-{0} хв",
				"relativeTimePattern-count-few": "-{0} хв",
				"relativeTimePattern-count-many": "-{0} хв",
				"relativeTimePattern-count-other": "-{0} хв"
			}
		},
		"second-wide": {
			"displayName": "секунда",
			"relative-type-0": "зараз",
			"relativeTime-type-future": {
				"relativeTimePattern-count-one": "через {0} секунду",
				"relativeTimePattern-count-few": "через {0} секунди",
				"relativeTimePattern-count-many": "через {0} секунд",
				"relativeTimePattern-count-other": "через {0} секунди"
			},
			"relativeTime-type-past": {
				"relativeTimePattern-count-one": "{0} секунду тому",
				"relativeTimePattern-count-few": "{0} секунди тому",
				"relativeTimePattern-count-many": "{0} секунд тому",
				"relativeTimePattern-count-other": "{0} секунди тому"
			}
		},
		"second-short": {
			"displayName": "с",
			"relative-type-0": "зараз",
			"relativeTime-type-future": {
				"relativeTimePattern-count-one": "через {0} с",
				"relativeTimePattern-count-few": "через {0} с",
				"relativeTimePattern-count-many": "через {0} с",
				"relativeTimePattern-count-other": "через {0} с"
			},
			"relativeTime-type-past": {
				"relativeTimePattern-count-one": "{0} с тому",
				"relativeTimePattern-count-few": "{0} с тому",
				"relativeTimePattern-count-many": "{0} с тому",
				"relativeTimePattern-count-other": "{0} с тому"
			}
		},
		"second-narrow": {
			"displayName": "с",
			"relative-type-0": "зараз",
			"relativeTime-type-future": {
				"relativeTimePattern-count-one": "+{0} с",
				"relativeTimePattern-count-few": "+{0} с",
				"relativeTimePattern-count-many": "+{0} с",
				"relativeTimePattern-count-other": "+{0} с"
			},
			"relativeTime-type-past": {
				"relativeTimePattern-count-one": "-{0} с",
				"relativeTimePattern-count-few": "-{0} с",
				"relativeTimePattern-count-many": "-{0} с",
				"relativeTimePattern-count-other": "-{0} с"
			}
		},
		"zone": {
			"displayName": "часовий пояс"
		}
	},
	"decimalFormat": {
		"standard": "#,##0.###"
	},
	"decimalFormat-long": {
		"1000-one": "0 тисяча",
		"1000-few": "0 тисячі",
		"1000-many": "0 тисяч",
		"1000-other": "0 тисячі",
		"10000-one": "00 тисяча",
		"10000-few": "00 тисячі",
		"10000-many": "00 тисяч",
		"10000-other": "00 тисячі",
		"100000-one": "000 тисяча",
		"100000-few": "000 тисячі",
		"100000-many": "000 тисяч",
		"100000-other": "000 тисячі",
		"1000000-one": "0 мільйон",
		"1000000-few": "0 мільйони",
		"1000000-many": "0 мільйонів",
		"1000000-other": "0 мільйона",
		"10000000-one": "00 мільйон",
		"10000000-few": "00 мільйони",
		"10000000-many": "00 мільйонів",
		"10000000-other": "00 мільйона",
		"100000000-one": "000 мільйон",
		"100000000-few": "000 мільйони",
		"100000000-many": "000 мільйонів",
		"100000000-other": "000 мільйона",
		"1000000000-one": "0 мільярд",
		"1000000000-few": "0 мільярди",
		"1000000000-many": "0 мільярдів",
		"1000000000-other": "0 мільярда",
		"10000000000-one": "00 мільярд",
		"10000000000-few": "00 мільярди",
		"10000000000-many": "00 мільярдів",
		"10000000000-other": "00 мільярда",
		"100000000000-one": "000 мільярд",
		"100000000000-few": "000 мільярди",
		"100000000000-many": "000 мільярдів",
		"100000000000-other": "000 мільярда",
		"1000000000000-one": "0 трильйон",
		"1000000000000-few": "0 трильйони",
		"1000000000000-many": "0 трильйонів",
		"1000000000000-other": "0 трильйона",
		"10000000000000-one": "00 трильйон",
		"10000000000000-few": "00 трильйони",
		"10000000000000-many": "00 трильйонів",
		"10000000000000-other": "00 трильйона",
		"100000000000000-one": "000 трильйон",
		"100000000000000-few": "000 трильйони",
		"100000000000000-many": "000 трильйонів",
		"100000000000000-other": "000 трильйона"
	},
	"decimalFormat-short": {
		"1000-one": "0 тис'.'",
		"1000-few": "0 тис'.'",
		"1000-many": "0 тис'.'",
		"1000-other": "0 тис'.'",
		"10000-one": "00 тис'.'",
		"10000-few": "00 тис'.'",
		"10000-many": "00 тис'.'",
		"10000-other": "00 тис'.'",
		"100000-one": "000 тис'.'",
		"100000-few": "000 тис'.'",
		"100000-many": "000 тис'.'",
		"100000-other": "000 тис'.'",
		"1000000-one": "0 млн",
		"1000000-few": "0 млн",
		"1000000-many": "0 млн",
		"1000000-other": "0 млн",
		"10000000-one": "00 млн",
		"10000000-few": "00 млн",
		"10000000-many": "00 млн",
		"10000000-other": "00 млн",
		"100000000-one": "000 млн",
		"100000000-few": "000 млн",
		"100000000-many": "000 млн",
		"100000000-other": "000 млн",
		"1000000000-one": "0 млрд",
		"1000000000-few": "0 млрд",
		"1000000000-many": "0 млрд",
		"1000000000-other": "0 млрд",
		"10000000000-one": "00 млрд",
		"10000000000-few": "00 млрд",
		"10000000000-many": "00 млрд",
		"10000000000-other": "00 млрд",
		"100000000000-one": "000 млрд",
		"100000000000-few": "000 млрд",
		"100000000000-many": "000 млрд",
		"100000000000-other": "000 млрд",
		"1000000000000-one": "0 трлн",
		"1000000000000-few": "0 трлн",
		"1000000000000-many": "0 трлн",
		"1000000000000-other": "0 трлн",
		"10000000000000-one": "00 трлн",
		"10000000000000-few": "00 трлн",
		"10000000000000-many": "00 трлн",
		"10000000000000-other": "00 трлн",
		"100000000000000-one": "000 трлн",
		"100000000000000-few": "000 трлн",
		"100000000000000-many": "000 трлн",
		"100000000000000-other": "000 трлн"
	},
	"scientificFormat": {
		"standard": "#E0"
	},
	"percentFormat": {
		"standard": "#,##0%"
	},
	"currencyFormat": {
		"standard": "#,##0.00 ¤",
		"accounting": "#,##0.00¤;(#,##0.00¤)",
		"currencySpacing": {
			"beforeCurrency": {
				"currencyMatch": "[:^S:]",
				"surroundingMatch": "[:digit:]",
				"insertBetween": " "
			},
			"afterCurrency": {
				"currencyMatch": "[:^S:]",
				"surroundingMatch": "[:digit:]",
				"insertBetween": " "
			}
		}
	},
	"symbols-latn-decimal": ",",
	"symbols-latn-group": " ",
	"symbols-latn-list": ";",
	"symbols-latn-percentSign": "%",
	"symbols-latn-plusSign": "+",
	"symbols-latn-minusSign": "-",
	"symbols-latn-exponential": "Е",
	"symbols-latn-superscriptingExponent": "×",
	"symbols-latn-perMille": "‰",
	"symbols-latn-infinity": "∞",
	"symbols-latn-nan": "NaN",
	"symbols-latn-timeSeparator": ":",
	"currencySymbols": {
		"JPY": "¥",
		"UAH": "₴",
		"UAK": "крб.",
		"XAF": "FCFA",
		"XOF": "CFA",
		"XPF": "CFPF"
	},
	"currencyDigits": {
		"ADP": 0,
		"AFN": 0,
		"ALL": 0,
		"AMD": 0,
		"BHD": 3,
		"BIF": 0,
		"BYR": 0,
		"CAD": 2,
		"CHF": 2,
		"CLF": 4,
		"CLP": 0,
		"COP": 0,
		"CRC": 0,
		"CZK": 0,
		"DEFAULT": 2,
		"DJF": 0,
		"ESP": 0,
		"GNF": 0,
		"GYD": 0,
		"HUF": 0,
		"IDR": 0,
		"IQD": 0,
		"IRR": 0,
		"ISK": 0,
		"ITL": 0,
		"JOD": 3,
		"JPY": 0,
		"KMF": 0,
		"KPW": 0,
		"KRW": 0,
		"KWD": 3,
		"LAK": 0,
		"LBP": 0,
		"LUF": 0,
		"LYD": 3,
		"MGA": 0,
		"MGF": 0,
		"MMK": 0,
		"MNT": 0,
		"MRO": 0,
		"MUR": 0,
		"OMR": 3,
		"PKR": 0,
		"PYG": 0,
		"RSD": 0,
		"RWF": 0,
		"SLL": 0,
		"SOS": 0,
		"STD": 0,
		"SYP": 0,
		"TMM": 0,
		"TND": 3,
		"TRL": 0,
		"TWD": 0,
		"TZS": 0,
		"UGX": 0,
		"UYI": 0,
		"UZS": 0,
		"VND": 0,
		"VUV": 0,
		"XAF": 0,
		"XOF": 0,
		"XPF": 0,
		"YER": 0,
		"ZMK": 0,
		"ZWD": 0
	},
	"weekData-minDays": 1,
	"weekData-firstDay": 1,
	"weekData-weekendStart": 6,
	"weekData-weekendEnd": 0,
	"timeData": {
		"_allowed": "H hB h",
		"_preferred": "H"
	},
	"eras-gregorian": {
		"0": {
			"_end": "0-12-31"
		},
		"1": {
			"_start": "1-01-01"
		}
	},
	"eras-islamic": {
		"0": {
			"_start": "622-7-15"
		}
	},
	"eras-persian": {
		"0": {
			"_start": "622-01-01"
		}
	},
	"eras-japanese": {
		"232": {
			"_start": "1868-9-8"
		},
		"233": {
			"_start": "1912-7-30"
		},
		"234": {
			"_start": "1926-12-25"
		},
		"235": {
			"_start": "1989-1-8"
		}
	}
}