{
	"__license": "This file has been derived from Unicode Common Locale Data Repository (CLDR) files (http://cldr.unicode.org). See the copyright and permission notice in the Unicode-Data-Files-LICENSE.txt available at the same location as this file or visit http://www.unicode.org/copyright.html",
	"languages": {
		"aa": "Afar",
		"ab": "Abkhazian",
		"ace": "Achinese",
		"ach": "Acoli",
		"ada": "Adangme",
		"ady": "Adyghe",
		"ae": "Avestan",
		"aeb": "Tunisian Arabic",
		"af": "Afrikaans",
		"afh": "Afrihili",
		"agq": "Aghem",
		"ain": "Ainu",
		"ak": "Akan",
		"akk": "Akkadian",
		"akz": "Alabama",
		"ale": "Aleut",
		"aln": "Gheg Albanian",
		"alt": "Southern Altai",
		"am": "Amharic",
		"an": "Aragonese",
		"ang": "Old English",
		"anp": "Angika",
		"ar": "Arabic",
		"ar_001": "Modern Standard Arabic",
		"arc": "Aramaic",
		"arn": "Mapuche",
		"aro": "Araona",
		"arp": "Arapaho",
		"arq": "Algerian Arabic",
		"arw": "Arawak",
		"ary": "Moroccan Arabic",
		"arz": "Egyptian Arabic",
		"as": "Assamese",
		"asa": "Asu",
		"ase": "American Sign Language",
		"ast": "Asturian",
		"av": "Avaric",
		"avk": "Kotava",
		"awa": "Awadhi",
		"ay": "Aymara",
		"az": "Azerbaijani",
		"az_alt-short": "Azeri",
		"ba": "Bashkir",
		"bal": "Baluchi",
		"ban": "Balinese",
		"bar": "Bavarian",
		"bas": "Basaa",
		"bax": "Bamun",
		"bbc": "Batak Toba",
		"bbj": "Ghomala",
		"be": "Belarusian",
		"bej": "Beja",
		"bem": "Bemba",
		"bew": "Betawi",
		"bez": "Bena",
		"bfd": "Bafut",
		"bfq": "Badaga",
		"bg": "Bulgarian",
		"bgn": "Western Balochi",
		"bho": "Bhojpuri",
		"bi": "Bislama",
		"bik": "Bikol",
		"bin": "Bini",
		"bjn": "Banjar",
		"bkm": "Kom",
		"bla": "Siksika",
		"bm": "Bambara",
		"bn": "Bengali",
		"bo": "Tibetan",
		"bpy": "Bishnupriya",
		"bqi": "Bakhtiari",
		"br": "Breton",
		"bra": "Braj",
		"brh": "Brahui",
		"brx": "Bodo",
		"bs": "Bosnian",
		"bss": "Akoose",
		"bua": "Buriat",
		"bug": "Buginese",
		"bum": "Bulu",
		"byn": "Blin",
		"byv": "Medumba",
		"ca": "Catalan",
		"cad": "Caddo",
		"car": "Carib",
		"cay": "Cayuga",
		"cch": "Atsam",
		"ce": "Chechen",
		"ceb": "Cebuano",
		"cgg": "Chiga",
		"ch": "Chamorro",
		"chb": "Chibcha",
		"chg": "Chagatai",
		"chk": "Chuukese",
		"chm": "Mari",
		"chn": "Chinook Jargon",
		"cho": "Choctaw",
		"chp": "Chipewyan",
		"chr": "Cherokee",
		"chy": "Cheyenne",
		"ckb": "Central Kurdish",
		"co": "Corsican",
		"cop": "Coptic",
		"cps": "Capiznon",
		"cr": "Cree",
		"crh": "Crimean Turkish",
		"cs": "Czech",
		"csb": "Kashubian",
		"cu": "Church Slavic",
		"cv": "Chuvash",
		"cy": "Welsh",
		"da": "Danish",
		"dak": "Dakota",
		"dar": "Dargwa",
		"dav": "Taita",
		"de": "German",
		"de_AT": "Austrian German",
		"de_CH": "Swiss High German",
		"del": "Delaware",
		"den": "Slave",
		"dgr": "Dogrib",
		"din": "Dinka",
		"dje": "Zarma",
		"doi": "Dogri",
		"dsb": "Lower Sorbian",
		"dtp": "Central Dusun",
		"dua": "Duala",
		"dum": "Middle Dutch",
		"dv": "Divehi",
		"dyo": "Jola-Fonyi",
		"dyu": "Dyula",
		"dz": "Dzongkha",
		"dzg": "Dazaga",
		"ebu": "Embu",
		"ee": "Ewe",
		"efi": "Efik",
		"egl": "Emilian",
		"egy": "Ancient Egyptian",
		"eka": "Ekajuk",
		"el": "Greek",
		"elx": "Elamite",
		"en": "English",
		"en_AU": "Australian English",
		"en_CA": "Canadian English",
		"en_GB": "British English",
		"en_GB-alt-short": "UK English",
		"en_US": "American English",
		"en_US-alt-short": "US English",
		"enm": "Middle English",
		"eo": "Esperanto",
		"es": "Spanish",
		"es_419": "Latin American Spanish",
		"es_ES": "European Spanish",
		"es_MX": "Mexican Spanish",
		"esu": "Central Yupik",
		"et": "Estonian",
		"eu": "Basque",
		"ewo": "Ewondo",
		"ext": "Extremaduran",
		"fa": "Persian",
		"fa_AF": "Dari",
		"fan": "Fang",
		"fat": "Fanti",
		"ff": "Fulah",
		"fi": "Finnish",
		"fil": "Filipino",
		"fit": "Tornedalen Finnish",
		"fj": "Fijian",
		"fo": "Faroese",
		"fon": "Fon",
		"fr": "French",
		"fr_CA": "Canadian French",
		"fr_CH": "Swiss French",
		"frc": "Cajun French",
		"frm": "Middle French",
		"fro": "Old French",
		"frp": "Arpitan",
		"frr": "Northern Frisian",
		"frs": "Eastern Frisian",
		"fur": "Friulian",
		"fy": "Western Frisian",
		"ga": "Irish",
		"gaa": "Ga",
		"gag": "Gagauz",
		"gan": "Gan Chinese",
		"gay": "Gayo",
		"gba": "Gbaya",
		"gbz": "Zoroastrian Dari",
		"gd": "Scottish Gaelic",
		"gez": "Geez",
		"gil": "Gilbertese",
		"gl": "Galician",
		"glk": "Gilaki",
		"gmh": "Middle High German",
		"gn": "Guarani",
		"goh": "Old High German",
		"gom": "Goan Konkani",
		"gon": "Gondi",
		"gor": "Gorontalo",
		"got": "Gothic",
		"grb": "Grebo",
		"grc": "Ancient Greek",
		"gsw": "Swiss German",
		"gu": "Gujarati",
		"guc": "Wayuu",
		"gur": "Frafra",
		"guz": "Gusii",
		"gv": "Manx",
		"gwi": "Gwichʼin",
		"ha": "Hausa",
		"hai": "Haida",
		"hak": "Hakka Chinese",
		"haw": "Hawaiian",
		"he": "Hebrew",
		"hi": "Hindi",
		"hif": "Fiji Hindi",
		"hil": "Hiligaynon",
		"hit": "Hittite",
		"hmn": "Hmong",
		"ho": "Hiri Motu",
		"hr": "Croatian",
		"hsb": "Upper Sorbian",
		"hsn": "Xiang Chinese",
		"ht": "Haitian Creole",
		"hu": "Hungarian",
		"hup": "Hupa",
		"hy": "Armenian",
		"hz": "Herero",
		"ia": "Interlingua",
		"iba": "Iban",
		"ibb": "Ibibio",
		"id": "Indonesian",
		"ie": "Interlingue",
		"ig": "Igbo",
		"ii": "Sichuan Yi",
		"ik": "Inupiaq",
		"ilo": "Iloko",
		"inh": "Ingush",
		"io": "Ido",
		"is": "Icelandic",
		"it": "Italian",
		"iu": "Inuktitut",
		"izh": "Ingrian",
		"ja": "Japanese",
		"jam": "Jamaican Creole English",
		"jbo": "Lojban",
		"jgo": "Ngomba",
		"jmc": "Machame",
		"jpr": "Judeo-Persian",
		"jrb": "Judeo-Arabic",
		"jut": "Jutish",
		"jv": "Javanese",
		"ka": "Georgian",
		"kaa": "Kara-Kalpak",
		"kab": "Kabyle",
		"kac": "Kachin",
		"kaj": "Jju",
		"kam": "Kamba",
		"kaw": "Kawi",
		"kbd": "Kabardian",
		"kbl": "Kanembu",
		"kcg": "Tyap",
		"kde": "Makonde",
		"kea": "Kabuverdianu",
		"ken": "Kenyang",
		"kfo": "Koro",
		"kg": "Kongo",
		"kgp": "Kaingang",
		"kha": "Khasi",
		"kho": "Khotanese",
		"khq": "Koyra Chiini",
		"khw": "Khowar",
		"ki": "Kikuyu",
		"kiu": "Kirmanjki",
		"kj": "Kuanyama",
		"kk": "Kazakh",
		"kkj": "Kako",
		"kl": "Kalaallisut",
		"kln": "Kalenjin",
		"km": "Khmer",
		"kmb": "Kimbundu",
		"kn": "Kannada",
		"ko": "Korean",
		"koi": "Komi-Permyak",
		"kok": "Konkani",
		"kos": "Kosraean",
		"kpe": "Kpelle",
		"kr": "Kanuri",
		"krc": "Karachay-Balkar",
		"kri": "Krio",
		"krj": "Kinaray-a",
		"krl": "Karelian",
		"kru": "Kurukh",
		"ks": "Kashmiri",
		"ksb": "Shambala",
		"ksf": "Bafia",
		"ksh": "Colognian",
		"ku": "Kurdish",
		"kum": "Kumyk",
		"kut": "Kutenai",
		"kv": "Komi",
		"kw": "Cornish",
		"ky": "Kyrgyz",
		"ky_alt-variant": "Kirghiz",
		"la": "Latin",
		"lad": "Ladino",
		"lag": "Langi",
		"lah": "Lahnda",
		"lam": "Lamba",
		"lb": "Luxembourgish",
		"lez": "Lezghian",
		"lfn": "Lingua Franca Nova",
		"lg": "Ganda",
		"li": "Limburgish",
		"lij": "Ligurian",
		"liv": "Livonian",
		"lkt": "Lakota",
		"lmo": "Lombard",
		"ln": "Lingala",
		"lo": "Lao",
		"lol": "Mongo",
		"loz": "Lozi",
		"lrc": "Northern Luri",
		"lt": "Lithuanian",
		"ltg": "Latgalian",
		"lu": "Luba-Katanga",
		"lua": "Luba-Lulua",
		"lui": "Luiseno",
		"lun": "Lunda",
		"luo": "Luo",
		"lus": "Mizo",
		"luy": "Luyia",
		"lv": "Latvian",
		"lzh": "Literary Chinese",
		"lzz": "Laz",
		"mad": "Madurese",
		"maf": "Mafa",
		"mag": "Magahi",
		"mai": "Maithili",
		"mak": "Makasar",
		"man": "Mandingo",
		"mas": "Masai",
		"mde": "Maba",
		"mdf": "Moksha",
		"mdh": "mdh",
		"mdr": "Mandar",
		"men": "Mende",
		"mer": "Meru",
		"mfe": "Morisyen",
		"mg": "Malagasy",
		"mga": "Middle Irish",
		"mgh": "Makhuwa-Meetto",
		"mgo": "Metaʼ",
		"mh": "Marshallese",
		"mi": "Māori",
		"mic": "Micmac",
		"min": "Minangkabau",
		"mis": "mis",
		"mk": "Macedonian",
		"ml": "Malayalam",
		"mn": "Mongolian",
		"mnc": "Manchu",
		"mni": "Manipuri",
		"moh": "Mohawk",
		"mos": "Mossi",
		"mr": "Marathi",
		"mrj": "Western Mari",
		"ms": "Malay",
		"mt": "Maltese",
		"mua": "Mundang",
		"mul": "Multiple Languages",
		"mus": "Creek",
		"mwl": "Mirandese",
		"mwr": "Marwari",
		"mwv": "Mentawai",
		"my": "Burmese",
		"my_alt-variant": "Myanmar Language",
		"mye": "Myene",
		"myv": "Erzya",
		"mzn": "Mazanderani",
		"na": "Nauru",
		"nan": "Min Nan Chinese",
		"nap": "Neapolitan",
		"naq": "Nama",
		"nb": "Norwegian Bokmål",
		"nd": "North Ndebele",
		"nds": "Low German",
		"nds_NL": "Low Saxon",
		"ne": "Nepali",
		"new": "Newari",
		"ng": "Ndonga",
		"nia": "Nias",
		"niu": "Niuean",
		"njo": "Ao Naga",
		"nl": "Dutch",
		"nl_BE": "Flemish",
		"nmg": "Kwasio",
		"nn": "Norwegian Nynorsk",
		"nnh": "Ngiemboon",
		"no": "Norwegian",
		"nog": "Nogai",
		"non": "Old Norse",
		"nov": "Novial",
		"nqo": "N’Ko",
		"nr": "South Ndebele",
		"nso": "Northern Sotho",
		"nus": "Nuer",
		"nv": "Navajo",
		"nwc": "Classical Newari",
		"ny": "Nyanja",
		"nym": "Nyamwezi",
		"nyn": "Nyankole",
		"nyo": "Nyoro",
		"nzi": "Nzima",
		"oc": "Occitan",
		"oj": "Ojibwa",
		"om": "Oromo",
		"or": "Oriya",
		"os": "Ossetic",
		"osa": "Osage",
		"ota": "Ottoman Turkish",
		"pa": "Punjabi",
		"pag": "Pangasinan",
		"pal": "Pahlavi",
		"pam": "Pampanga",
		"pap": "Papiamento",
		"pau": "Palauan",
		"pcd": "Picard",
		"pdc": "Pennsylvania German",
		"pdt": "Plautdietsch",
		"peo": "Old Persian",
		"pfl": "Palatine German",
		"phn": "Phoenician",
		"pi": "Pali",
		"pl": "Polish",
		"pms": "Piedmontese",
		"pnt": "Pontic",
		"pon": "Pohnpeian",
		"prg": "Prussian",
		"pro": "Old Provençal",
		"ps": "Pashto",
		"ps_alt-variant": "Pushto",
		"pt": "Portuguese",
		"pt_BR": "Brazilian Portuguese",
		"pt_PT": "European Portuguese",
		"qu": "Quechua",
		"quc": "Kʼicheʼ",
		"qug": "Chimborazo Highland Quichua",
		"raj": "Rajasthani",
		"rap": "Rapanui",
		"rar": "Rarotongan",
		"rgn": "Romagnol",
		"rif": "Riffian",
		"rm": "Romansh",
		"rn": "Rundi",
		"ro": "Romanian",
		"ro_MD": "Moldavian",
		"rof": "Rombo",
		"rom": "Romany",
		"root": "Root",
		"rtm": "Rotuman",
		"ru": "Russian",
		"rue": "Rusyn",
		"rug": "Roviana",
		"rup": "Aromanian",
		"rw": "Kinyarwanda",
		"rwk": "Rwa",
		"sa": "Sanskrit",
		"sad": "Sandawe",
		"sah": "Sakha",
		"sam": "Samaritan Aramaic",
		"saq": "Samburu",
		"sas": "Sasak",
		"sat": "Santali",
		"saz": "Saurashtra",
		"sba": "Ngambay",
		"sbp": "Sangu",
		"sc": "Sardinian",
		"scn": "Sicilian",
		"sco": "Scots",
		"sd": "Sindhi",
		"sdc": "Sassarese Sardinian",
		"sdh": "Southern Kurdish",
		"se": "Northern Sami",
		"see": "Seneca",
		"seh": "Sena",
		"sei": "Seri",
		"sel": "Selkup",
		"ses": "Koyraboro Senni",
		"sg": "Sango",
		"sga": "Old Irish",
		"sgs": "Samogitian",
		"sh": "Serbo-Croatian",
		"shi": "Tachelhit",
		"shn": "Shan",
		"shu": "Chadian Arabic",
		"si": "Sinhala",
		"sid": "Sidamo",
		"sk": "Slovak",
		"sl": "Slovenian",
		"sli": "Lower Silesian",
		"sly": "Selayar",
		"sm": "Samoan",
		"sma": "Southern Sami",
		"smj": "Lule Sami",
		"smn": "Inari Sami",
		"sms": "Skolt Sami",
		"sn": "Shona",
		"snk": "Soninke",
		"so": "Somali",
		"sog": "Sogdien",
		"sq": "Albanian",
		"sr": "Serbian",
		"srn": "Sranan Tongo",
		"srr": "Serer",
		"ss": "Swati",
		"ssy": "Saho",
		"st": "Southern Sotho",
		"stq": "Saterland Frisian",
		"su": "Sundanese",
		"suk": "Sukuma",
		"sus": "Susu",
		"sux": "Sumerian",
		"sv": "Swedish",
		"sw": "Swahili",
		"sw_CD": "Congo Swahili",
		"swb": "Comorian",
		"syc": "Classical Syriac",
		"syr": "Syriac",
		"szl": "Silesian",
		"ta": "Tamil",
		"tcy": "Tulu",
		"te": "Telugu",
		"tem": "Timne",
		"teo": "Teso",
		"ter": "Tereno",
		"tet": "Tetum",
		"tg": "Tajik",
		"th": "Thai",
		"ti": "Tigrinya",
		"tig": "Tigre",
		"tiv": "Tiv",
		"tk": "Turkmen",
		"tkl": "Tokelau",
		"tkr": "Tsakhur",
		"tl": "Tagalog",
		"tlh": "Klingon",
		"tli": "Tlingit",
		"tly": "Talysh",
		"tmh": "Tamashek",
		"tn": "Tswana",
		"to": "Tongan",
		"tog": "Nyasa Tonga",
		"tpi": "Tok Pisin",
		"tr": "Turkish",
		"tru": "Turoyo",
		"trv": "Taroko",
		"ts": "Tsonga",
		"tsd": "Tsakonian",
		"tsi": "Tsimshian",
		"tt": "Tatar",
		"ttt": "Muslim Tat",
		"tum": "Tumbuka",
		"tvl": "Tuvalu",
		"tw": "Twi",
		"twq": "Tasawaq",
		"ty": "Tahitian",
		"tyv": "Tuvinian",
		"tzm": "Central Atlas Tamazight",
		"udm": "Udmurt",
		"ug": "Uyghur",
		"ug_alt-variant": "Uighur",
		"uga": "Ugaritic",
		"uk": "Ukrainian",
		"umb": "Umbundu",
		"und": "Unknown Language",
		"ur": "Urdu",
		"uz": "Uzbek",
		"vai": "Vai",
		"ve": "Venda",
		"vec": "Venetian",
		"vep": "Veps",
		"vi": "Vietnamese",
		"vls": "West Flemish",
		"vmf": "Main-Franconian",
		"vo": "Volapük",
		"vot": "Votic",
		"vro": "Võro",
		"vun": "Vunjo",
		"wa": "Walloon",
		"wae": "Walser",
		"wal": "Wolaytta",
		"war": "Waray",
		"was": "Washo",
		"wbp": "Warlpiri",
		"wo": "Wolof",
		"wuu": "Wu Chinese",
		"xal": "Kalmyk",
		"xh": "Xhosa",
		"xmf": "Mingrelian",
		"xog": "Soga",
		"yao": "Yao",
		"yap": "Yapese",
		"yav": "Yangben",
		"ybb": "Yemba",
		"yi": "Yiddish",
		"yo": "Yoruba",
		"yrl": "Nheengatu",
		"yue": "Cantonese",
		"za": "Zhuang",
		"zap": "Zapotec",
		"zbl": "Blissymbols",
		"zea": "Zeelandic",
		"zen": "Zenaga",
		"zgh": "Standard Moroccan Tamazight",
		"zh": "Chinese",
		"zh_Hans": "Simplified Chinese",
		"zh_Hant": "Traditional Chinese",
		"zu": "Zulu",
		"zun": "Zuni",
		"zxx": "No linguistic content",
		"zza": "Zaza"
	},
	"scripts": {
		"Adlm": "Adlm",
		"Afak": "Afaka",
		"Aghb": "Caucasian Albanian",
		"Ahom": "Ahom",
		"Arab": "Arabic",
		"Arab-alt-variant": "Perso-Arabic",
		"Armi": "Imperial Aramaic",
		"Armn": "Armenian",
		"Avst": "Avestan",
		"Bali": "Balinese",
		"Bamu": "Bamum",
		"Bass": "Bassa Vah",
		"Batk": "Batak",
		"Beng": "Bengali",
		"Bhks": "Bhks",
		"Blis": "Blissymbols",
		"Bopo": "Bopomofo",
		"Brah": "Brahmi",
		"Brai": "Braille",
		"Bugi": "Buginese",
		"Buhd": "Buhid",
		"Cakm": "Chakma",
		"Cans": "Unified Canadian Aboriginal Syllabics",
		"Cans-alt-short": "UCAS",
		"Cari": "Carian",
		"Cham": "Cham",
		"Cher": "Cherokee",
		"Cirt": "Cirth",
		"Copt": "Coptic",
		"Cprt": "Cypriot",
		"Cyrl": "Cyrillic",
		"Cyrs": "Old Church Slavonic Cyrillic",
		"Deva": "Devanagari",
		"Dsrt": "Deseret",
		"Dupl": "Duployan shorthand",
		"Egyd": "Egyptian demotic",
		"Egyh": "Egyptian hieratic",
		"Egyp": "Egyptian hieroglyphs",
		"Elba": "Elbasan",
		"Ethi": "Ethiopic",
		"Geok": "Georgian Khutsuri",
		"Geor": "Georgian",
		"Glag": "Glagolitic",
		"Goth": "Gothic",
		"Gran": "Grantha",
		"Grek": "Greek",
		"Gujr": "Gujarati",
		"Guru": "Gurmukhi",
		"Hanb": "Hanb",
		"Hang": "Hangul",
		"Hani": "Han",
		"Hano": "Hanunoo",
		"Hans": "Simplified",
		"Hans-alt-stand-alone": "Simplified Han",
		"Hant": "Traditional",
		"Hant-alt-stand-alone": "Traditional Han",
		"Hatr": "Hatran",
		"Hebr": "Hebrew",
		"Hira": "Hiragana",
		"Hluw": "Anatolian Hieroglyphs",
		"Hmng": "Pahawh Hmong",
		"Hrkt": "Japanese syllabaries",
		"Hung": "Old Hungarian",
		"Inds": "Indus",
		"Ital": "Old Italic",
		"Jamo": "Jamo",
		"Java": "Javanese",
		"Jpan": "Japanese",
		"Jurc": "Jurchen",
		"Kali": "Kayah Li",
		"Kana": "Katakana",
		"Khar": "Kharoshthi",
		"Khmr": "Khmer",
		"Khoj": "Khojki",
		"Knda": "Kannada",
		"Kore": "Korean",
		"Kpel": "Kpelle",
		"Kthi": "Kaithi",
		"Lana": "Lanna",
		"Laoo": "Lao",
		"Latf": "Fraktur Latin",
		"Latg": "Gaelic Latin",
		"Latn": "Latin",
		"Lepc": "Lepcha",
		"Limb": "Limbu",
		"Lina": "Linear A",
		"Linb": "Linear B",
		"Lisu": "Fraser",
		"Loma": "Loma",
		"Lyci": "Lycian",
		"Lydi": "Lydian",
		"Mahj": "Mahajani",
		"Mand": "Mandaean",
		"Mani": "Manichaean",
		"Marc": "Marc",
		"Maya": "Mayan hieroglyphs",
		"Mend": "Mende",
		"Merc": "Meroitic Cursive",
		"Mero": "Meroitic",
		"Mlym": "Malayalam",
		"Modi": "Modi",
		"Mong": "Mongolian",
		"Moon": "Moon",
		"Mroo": "Mro",
		"Mtei": "Meitei Mayek",
		"Mult": "Multani",
		"Mymr": "Myanmar",
		"Narb": "Old North Arabian",
		"Nbat": "Nabataean",
		"Newa": "Newa",
		"Nkgb": "Naxi Geba",
		"Nkoo": "N’Ko",
		"Nshu": "Nüshu",
		"Ogam": "Ogham",
		"Olck": "Ol Chiki",
		"Orkh": "Orkhon",
		"Orya": "Oriya",
		"Osge": "Osge",
		"Osma": "Osmanya",
		"Palm": "Palmyrene",
		"Pauc": "Pau Cin Hau",
		"Perm": "Old Permic",
		"Phag": "Phags-pa",
		"Phli": "Inscriptional Pahlavi",
		"Phlp": "Psalter Pahlavi",
		"Phlv": "Book Pahlavi",
		"Phnx": "Phoenician",
		"Plrd": "Pollard Phonetic",
		"Prti": "Inscriptional Parthian",
		"Qaaa": "Qaaa",
		"Qaab": "Qaab",
		"Qaac": "Qaac",
		"Qaad": "Qaad",
		"Qaae": "Qaae",
		"Qaaf": "Qaaf",
		"Qaag": "Qaag",
		"Qaah": "Qaah",
		"Qaaj": "Qaaj",
		"Qaak": "Qaak",
		"Qaal": "Qaal",
		"Qaam": "Qaam",
		"Qaan": "Qaan",
		"Qaao": "Qaao",
		"Qaap": "Qaap",
		"Qaaq": "Qaaq",
		"Qaar": "Qaar",
		"Qaas": "Qaas",
		"Qaat": "Qaat",
		"Qaau": "Qaau",
		"Qaav": "Qaav",
		"Qaaw": "Qaaw",
		"Qaax": "Qaax",
		"Qaay": "Qaay",
		"Qaaz": "Qaaz",
		"Qaba": "Qaba",
		"Qabb": "Qabb",
		"Qabc": "Qabc",
		"Qabd": "Qabd",
		"Qabe": "Qabe",
		"Qabf": "Qabf",
		"Qabg": "Qabg",
		"Qabh": "Qabh",
		"Qabi": "Qabi",
		"Qabj": "Qabj",
		"Qabk": "Qabk",
		"Qabl": "Qabl",
		"Qabm": "Qabm",
		"Qabn": "Qabn",
		"Qabo": "Qabo",
		"Qabp": "Qabp",
		"Qabq": "Qabq",
		"Qabr": "Qabr",
		"Qabs": "Qabs",
		"Qabt": "Qabt",
		"Qabu": "Qabu",
		"Qabv": "Qabv",
		"Qabw": "Qabw",
		"Qabx": "Qabx",
		"Rjng": "Rejang",
		"Roro": "Rongorongo",
		"Runr": "Runic",
		"Samr": "Samaritan",
		"Sara": "Sarati",
		"Sarb": "Old South Arabian",
		"Saur": "Saurashtra",
		"Sgnw": "SignWriting",
		"Shaw": "Shavian",
		"Shrd": "Sharada",
		"Sidd": "Siddham",
		"Sind": "Khudawadi",
		"Sinh": "Sinhala",
		"Sora": "Sora Sompeng",
		"Sund": "Sundanese",
		"Sylo": "Syloti Nagri",
		"Syrc": "Syriac",
		"Syre": "Estrangelo Syriac",
		"Syrj": "Western Syriac",
		"Syrn": "Eastern Syriac",
		"Tagb": "Tagbanwa",
		"Takr": "Takri",
		"Tale": "Tai Le",
		"Talu": "New Tai Lue",
		"Taml": "Tamil",
		"Tang": "Tangut",
		"Tavt": "Tai Viet",
		"Telu": "Telugu",
		"Teng": "Tengwar",
		"Tfng": "Tifinagh",
		"Tglg": "Tagalog",
		"Thaa": "Thaana",
		"Thai": "Thai",
		"Tibt": "Tibetan",
		"Tirh": "Tirhuta",
		"Ugar": "Ugaritic",
		"Vaii": "Vai",
		"Visp": "Visible Speech",
		"Wara": "Varang Kshiti",
		"Wole": "Woleai",
		"Xpeo": "Old Persian",
		"Xsux": "Sumero-Akkadian Cuneiform",
		"Xsux-alt-short": "S-A Cuneiform",
		"Yiii": "Yi",
		"Zinh": "Inherited",
		"Zmth": "Mathematical Notation",
		"Zsye": "Emoji",
		"Zsym": "Symbols",
		"Zxxx": "Unwritten",
		"Zyyy": "Common",
		"Zzzz": "Unknown Script"
	},
	"territories": {
		"142": "Asia",
		"143": "Central Asia",
		"145": "Western Asia",
		"150": "Europe",
		"151": "Eastern Europe",
		"154": "Northern Europe",
		"155": "Western Europe",
		"419": "Latin America",
		"001": "World",
		"002": "Africa",
		"003": "North America",
		"005": "South America",
		"009": "Oceania",
		"011": "Western Africa",
		"013": "Central America",
		"014": "Eastern Africa",
		"015": "Northern Africa",
		"017": "Middle Africa",
		"018": "Southern Africa",
		"019": "Americas",
		"021": "Northern America",
		"029": "Caribbean",
		"030": "Eastern Asia",
		"034": "Southern Asia",
		"035": "Southeast Asia",
		"039": "Southern Europe",
		"053": "Australasia",
		"054": "Melanesia",
		"057": "Micronesian Region",
		"061": "Polynesia",
		"AC": "Ascension Island",
		"AD": "Andorra",
		"AE": "United Arab Emirates",
		"AF": "Afghanistan",
		"AG": "Antigua & Barbuda",
		"AI": "Anguilla",
		"AL": "Albania",
		"AM": "Armenia",
		"AO": "Angola",
		"AQ": "Antarctica",
		"AR": "Argentina",
		"AS": "American Samoa",
		"AT": "Austria",
		"AU": "Australia",
		"AW": "Aruba",
		"AX": "Åland Islands",
		"AZ": "Azerbaijan",
		"BA": "Bosnia & Herzegovina",
		"BA-alt-short": "Bosnia",
		"BB": "Barbados",
		"BD": "Bangladesh",
		"BE": "Belgium",
		"BF": "Burkina Faso",
		"BG": "Bulgaria",
		"BH": "Bahrain",
		"BI": "Burundi",
		"BJ": "Benin",
		"BL": "St. Barthélemy",
		"BM": "Bermuda",
		"BN": "Brunei",
		"BO": "Bolivia",
		"BQ": "Caribbean Netherlands",
		"BR": "Brazil",
		"BS": "Bahamas",
		"BT": "Bhutan",
		"BV": "Bouvet Island",
		"BW": "Botswana",
		"BY": "Belarus",
		"BZ": "Belize",
		"CA": "Canada",
		"CC": "Cocos (Keeling) Islands",
		"CD": "Congo - Kinshasa",
		"CD-alt-variant": "Congo (DRC)",
		"CF": "Central African Republic",
		"CG": "Congo - Brazzaville",
		"CG-alt-variant": "Congo (Republic)",
		"CH": "Switzerland",
		"CI": "Côte d’Ivoire",
		"CI-alt-variant": "Ivory Coast",
		"CK": "Cook Islands",
		"CL": "Chile",
		"CM": "Cameroon",
		"CN": "China",
		"CO": "Colombia",
		"CP": "Clipperton Island",
		"CR": "Costa Rica",
		"CU": "Cuba",
		"CV": "Cape Verde",
		"CW": "Curaçao",
		"CX": "Christmas Island",
		"CY": "Cyprus",
		"CZ": "Czech Republic",
		"DE": "Germany",
		"DG": "Diego Garcia",
		"DJ": "Djibouti",
		"DK": "Denmark",
		"DM": "Dominica",
		"DO": "Dominican Republic",
		"DZ": "Algeria",
		"EA": "Ceuta & Melilla",
		"EC": "Ecuador",
		"EE": "Estonia",
		"EG": "Egypt",
		"EH": "Western Sahara",
		"ER": "Eritrea",
		"ES": "Spain",
		"ET": "Ethiopia",
		"EU": "European Union",
		"FI": "Finland",
		"FJ": "Fiji",
		"FK": "Falkland Islands",
		"FK-alt-variant": "Falkland Islands (Islas Malvinas)",
		"FM": "Micronesia",
		"FO": "Faroe Islands",
		"FR": "France",
		"GA": "Gabon",
		"GB": "United Kingdom",
		"GB-alt-short": "UK",
		"GD": "Grenada",
		"GE": "Georgia",
		"GF": "French Guiana",
		"GG": "Guernsey",
		"GH": "Ghana",
		"GI": "Gibraltar",
		"GL": "Greenland",
		"GM": "Gambia",
		"GN": "Guinea",
		"GP": "Guadeloupe",
		"GQ": "Equatorial Guinea",
		"GR": "Greece",
		"GS": "South Georgia & South Sandwich Islands",
		"GT": "Guatemala",
		"GU": "Guam",
		"GW": "Guinea-Bissau",
		"GY": "Guyana",
		"HK": "Hong Kong SAR China",
		"HK-alt-short": "Hong Kong",
		"HM": "Heard & McDonald Islands",
		"HN": "Honduras",
		"HR": "Croatia",
		"HT": "Haiti",
		"HU": "Hungary",
		"IC": "Canary Islands",
		"ID": "Indonesia",
		"IE": "Ireland",
		"IL": "Israel",
		"IM": "Isle of Man",
		"IN": "India",
		"IO": "British Indian Ocean Territory",
		"IQ": "Iraq",
		"IR": "Iran",
		"IS": "Iceland",
		"IT": "Italy",
		"JE": "Jersey",
		"JM": "Jamaica",
		"JO": "Jordan",
		"JP": "Japan",
		"KE": "Kenya",
		"KG": "Kyrgyzstan",
		"KH": "Cambodia",
		"KI": "Kiribati",
		"KM": "Comoros",
		"KN": "St. Kitts & Nevis",
		"KP": "North Korea",
		"KR": "South Korea",
		"KW": "Kuwait",
		"KY": "Cayman Islands",
		"KZ": "Kazakhstan",
		"LA": "Laos",
		"LB": "Lebanon",
		"LC": "St. Lucia",
		"LI": "Liechtenstein",
		"LK": "Sri Lanka",
		"LR": "Liberia",
		"LS": "Lesotho",
		"LT": "Lithuania",
		"LU": "Luxembourg",
		"LV": "Latvia",
		"LY": "Libya",
		"MA": "Morocco",
		"MC": "Monaco",
		"MD": "Moldova",
		"ME": "Montenegro",
		"MF": "St. Martin",
		"MG": "Madagascar",
		"MH": "Marshall Islands",
		"MK": "Macedonia",
		"MK-alt-variant": "Macedonia (FYROM)",
		"ML": "Mali",
		"MM": "Myanmar (Burma)",
		"MM-alt-short": "Myanmar",
		"MN": "Mongolia",
		"MO": "Macau SAR China",
		"MO-alt-short": "Macau",
		"MP": "Northern Mariana Islands",
		"MQ": "Martinique",
		"MR": "Mauritania",
		"MS": "Montserrat",
		"MT": "Malta",
		"MU": "Mauritius",
		"MV": "Maldives",
		"MW": "Malawi",
		"MX": "Mexico",
		"MY": "Malaysia",
		"MZ": "Mozambique",
		"NA": "Namibia",
		"NC": "New Caledonia",
		"NE": "Niger",
		"NF": "Norfolk Island",
		"NG": "Nigeria",
		"NI": "Nicaragua",
		"NL": "Netherlands",
		"NO": "Norway",
		"NP": "Nepal",
		"NR": "Nauru",
		"NU": "Niue",
		"NZ": "New Zealand",
		"OM": "Oman",
		"PA": "Panama",
		"PE": "Peru",
		"PF": "French Polynesia",
		"PG": "Papua New Guinea",
		"PH": "Philippines",
		"PK": "Pakistan",
		"PL": "Poland",
		"PM": "St. Pierre & Miquelon",
		"PN": "Pitcairn Islands",
		"PR": "Puerto Rico",
		"PS": "Palestinian Territories",
		"PS-alt-short": "Palestine",
		"PT": "Portugal",
		"PW": "Palau",
		"PY": "Paraguay",
		"QA": "Qatar",
		"QO": "Outlying Oceania",
		"RE": "Réunion",
		"RO": "Romania",
		"RS": "Serbia",
		"RU": "Russia",
		"RW": "Rwanda",
		"SA": "Saudi Arabia",
		"SB": "Solomon Islands",
		"SC": "Seychelles",
		"SD": "Sudan",
		"SE": "Sweden",
		"SG": "Singapore",
		"SH": "St. Helena",
		"SI": "Slovenia",
		"SJ": "Svalbard & Jan Mayen",
		"SK": "Slovakia",
		"SL": "Sierra Leone",
		"SM": "San Marino",
		"SN": "Senegal",
		"SO": "Somalia",
		"SR": "Suriname",
		"SS": "South Sudan",
		"ST": "São Tomé & Príncipe",
		"SV": "El Salvador",
		"SX": "Sint Maarten",
		"SY": "Syria",
		"SZ": "Swaziland",
		"TA": "Tristan da Cunha",
		"TC": "Turks & Caicos Islands",
		"TD": "Chad",
		"TF": "French Southern Territories",
		"TG": "Togo",
		"TH": "Thailand",
		"TJ": "Tajikistan",
		"TK": "Tokelau",
		"TL": "Timor-Leste",
		"TL-alt-variant": "East Timor",
		"TM": "Turkmenistan",
		"TN": "Tunisia",
		"TO": "Tonga",
		"TR": "Turkey",
		"TT": "Trinidad & Tobago",
		"TV": "Tuvalu",
		"TW": "Taiwan",
		"TZ": "Tanzania",
		"UA": "Ukraine",
		"UG": "Uganda",
		"UM": "U.S. Outlying Islands",
		"US": "United States",
		"US-alt-short": "US",
		"UY": "Uruguay",
		"UZ": "Uzbekistan",
		"VA": "Vatican City",
		"VC": "St. Vincent & Grenadines",
		"VE": "Venezuela",
		"VG": "British Virgin Islands",
		"VI": "U.S. Virgin Islands",
		"VN": "Vietnam",
		"VU": "Vanuatu",
		"WF": "Wallis & Futuna",
		"WS": "Samoa",
		"XK": "Kosovo",
		"YE": "Yemen",
		"YT": "Mayotte",
		"ZA": "South Africa",
		"ZM": "Zambia",
		"ZW": "Zimbabwe",
		"ZZ": "Unknown Region"
	},
	"orientation": "left-to-right",
	"ca-gregorian": {
		"dateFormats": {
			"full": "EEEE, d MMMM y",
			"long": "d MMMM y",
			"medium": "d/MM/y",
			"short": "d/MM/yy"
		},
		"timeFormats": {
			"full": "h:mm:ss a zzzz",
			"long": "h:mm:ss a z",
			"medium": "h:mm:ss a",
			"short": "h:mm a"
		},
		"dateTimeFormats": {
			"full": "{1} 'at' {0}",
			"long": "{1} 'at' {0}",
			"medium": "{1}, {0}",
			"short": "{1}, {0}",
			"availableFormats": {
				"d": "d",
				"E": "ccc",
				"Ed": "E d",
				"Ehm": "E h:mm a",
				"EHm": "E HH:mm",
				"Ehms": "E h:mm:ss a",
				"EHms": "E HH:mm:ss",
				"Gy": "y G",
				"GyMMM": "MMM y G",
				"GyMMMd": "d MMM y G",
				"GyMMMEd": "E, d MMM y G",
				"h": "h a",
				"H": "HH",
				"hm": "h:mm a",
				"Hm": "HH:mm",
				"hms": "h:mm:ss a",
				"Hms": "HH:mm:ss",
				"hmsv": "h:mm:ss a v",
				"Hmsv": "HH:mm:ss v",
				"hmv": "h:mm a v",
				"Hmv": "HH:mm v",
				"M": "L",
				"Md": "d/M",
				"MEd": "E, dd/MM",
				"MMdd": "dd/MM",
				"MMM": "LLL",
				"MMMd": "d MMM",
				"MMMEd": "E, d MMM",
				"MMMMd": "d MMMM",
				"ms": "mm:ss",
				"y": "y",
				"yM": "MM/y",
				"yMd": "d/MM/y",
				"yMEd": "E, dd/MM/y",
				"yMMM": "MMM y",
				"yMMMd": "d MMM y",
				"yMMMEd": "E, d MMM y",
				"yMMMM": "MMMM y",
				"yQQQ": "QQQ y",
				"yQQQQ": "QQQQ y"
			},
			"appendItems": {
				"Day": "{0} ({2}: {1})",
				"Day-Of-Week": "{0} {1}",
				"Era": "{0} {1}",
				"Hour": "{0} ({2}: {1})",
				"Minute": "{0} ({2}: {1})",
				"Month": "{0} ({2}: {1})",
				"Quarter": "{0} ({2}: {1})",
				"Second": "{0} ({2}: {1})",
				"Timezone": "{0} {1}",
				"Week": "{0} ({2}: {1})",
				"Year": "{0} {1}"
			},
			"intervalFormats": {
				"intervalFormatFallback": "{0} – {1}",
				"d": {
					"d": "d – d"
				},
				"h": {
					"a": "h a – h a",
					"h": "h – h a"
				},
				"H": {
					"H": "HH – HH"
				},
				"hm": {
					"a": "h:mm a – h:mm a",
					"h": "h:mm – h:mm a",
					"m": "h:mm – h:mm a"
				},
				"Hm": {
					"H": "HH:mm – HH:mm",
					"m": "HH:mm – HH:mm"
				},
				"hmv": {
					"a": "h:mm a – h:mm a v",
					"h": "h:mm – h:mm a v",
					"m": "h:mm – h:mm a v"
				},
				"Hmv": {
					"H": "HH:mm – HH:mm v",
					"m": "HH:mm – HH:mm v"
				},
				"hv": {
					"a": "h a – h a v",
					"h": "h – h a v"
				},
				"Hv": {
					"H": "HH – HH v"
				},
				"M": {
					"M": "M – M"
				},
				"Md": {
					"d": "d/MM – d/MM",
					"M": "d/MM – d/MM"
				},
				"MEd": {
					"d": "E, d/MM – E, d/MM",
					"M": "E, d/MM – E, d/MM"
				},
				"MMM": {
					"M": "MMM – MMM"
				},
				"MMMd": {
					"d": "d – d MMM",
					"M": "d MMM – d MMM"
				},
				"MMMEd": {
					"d": "E, d – E, d MMM",
					"M": "E, d MMM – E, d MMM"
				},
				"y": {
					"y": "y – y"
				},
				"yM": {
					"M": "MM/y – MM/y",
					"y": "MM/y – MM/y"
				},
				"yMd": {
					"d": "d/MM/y – d/MM/y",
					"M": "d/MM/y – d/MM/y",
					"y": "d/MM/y – d/MM/y"
				},
				"yMEd": {
					"d": "E, d/MM/y – E, d/MM/y",
					"M": "E, d/MM/y – E, d/MM/y",
					"y": "E, d/MM/y – E, d/MM/y"
				},
				"yMMM": {
					"M": "MMM – MMM y",
					"y": "MMM y – MMM y"
				},
				"yMMMd": {
					"d": "d – d MMM y",
					"M": "d MMM – d MMM y",
					"y": "d MMM y – d MMM y"
				},
				"yMMMEd": {
					"d": "E, d – E, d MMM y",
					"M": "E, d MMM – E, d MMM y",
					"y": "E, d MMM y – E, d MMM y"
				},
				"yMMMM": {
					"M": "MMMM – MMMM y",
					"y": "MMMM y – MMMM y"
				}
			}
		},
		"months": {
			"format": {
				"abbreviated": [
					"Jan",
					"Feb",
					"Mar",
					"Apr",
					"May",
					"Jun",
					"Jul",
					"Aug",
					"Sep",
					"Oct",
					"Nov",
					"Dec"
				],
				"narrow": [
					"J",
					"F",
					"M",
					"A",
					"M",
					"J",
					"J",
					"A",
					"S",
					"O",
					"N",
					"D"
				],
				"wide": [
					"January",
					"February",
					"March",
					"April",
					"May",
					"June",
					"July",
					"August",
					"September",
					"October",
					"November",
					"December"
				]
			},
			"stand-alone": {
				"abbreviated": [
					"Jan",
					"Feb",
					"Mar",
					"Apr",
					"May",
					"Jun",
					"Jul",
					"Aug",
					"Sep",
					"Oct",
					"Nov",
					"Dec"
				],
				"narrow": [
					"J",
					"F",
					"M",
					"A",
					"M",
					"J",
					"J",
					"A",
					"S",
					"O",
					"N",
					"D"
				],
				"wide": [
					"January",
					"February",
					"March",
					"April",
					"May",
					"June",
					"July",
					"August",
					"September",
					"October",
					"November",
					"December"
				]
			}
		},
		"days": {
			"format": {
				"abbreviated": [
					"Sun",
					"Mon",
					"Tue",
					"Wed",
					"Thu",
					"Fri",
					"Sat"
				],
				"narrow": [
					"S",
					"M",
					"T",
					"W",
					"T",
					"F",
					"S"
				],
				"short": [
					"Su",
					"Mo",
					"Tu",
					"We",
					"Th",
					"Fr",
					"Sa"
				],
				"wide": [
					"Sunday",
					"Monday",
					"Tuesday",
					"Wednesday",
					"Thursday",
					"Friday",
					"Saturday"
				]
			},
			"stand-alone": {
				"abbreviated": [
					"Sun",
					"Mon",
					"Tue",
					"Wed",
					"Thu",
					"Fri",
					"Sat"
				],
				"narrow": [
					"S",
					"M",
					"T",
					"W",
					"T",
					"F",
					"S"
				],
				"short": [
					"Su",
					"Mo",
					"Tu",
					"We",
					"Th",
					"Fr",
					"Sa"
				],
				"wide": [
					"Sunday",
					"Monday",
					"Tuesday",
					"Wednesday",
					"Thursday",
					"Friday",
					"Saturday"
				]
			}
		},
		"quarters": {
			"format": {
				"abbreviated": [
					"Q1",
					"Q2",
					"Q3",
					"Q4"
				],
				"narrow": [
					"1",
					"2",
					"3",
					"4"
				],
				"wide": [
					"1st quarter",
					"2nd quarter",
					"3rd quarter",
					"4th quarter"
				]
			},
			"stand-alone": {
				"abbreviated": [
					"Q1",
					"Q2",
					"Q3",
					"Q4"
				],
				"narrow": [
					"1",
					"2",
					"3",
					"4"
				],
				"wide": [
					"1st quarter",
					"2nd quarter",
					"3rd quarter",
					"4th quarter"
				]
			}
		},
		"dayPeriods": {
			"format": {
				"abbreviated": [
					"AM",
					"PM"
				],
				"narrow": [
					"a",
					"p"
				],
				"wide": [
					"AM",
					"PM"
				]
			},
			"stand-alone": {
				"abbreviated": [
					"AM",
					"PM"
				],
				"narrow": [
					"AM",
					"PM"
				],
				"wide": [
					"AM",
					"PM"
				]
			}
		},
		"era-wide": {
			"0": "Before Christ",
			"1": "Anno Domini"
		},
		"era-abbreviated": {
			"0": "BC",
			"1": "AD"
		},
		"era-narrow": {
			"0": "B",
			"1": "A"
		}
	},
	"ca-islamic": {
		"dateFormats": {
			"full": "EEEE, d MMMM y G",
			"long": "d MMMM y G",
			"medium": "d/MM/y G",
			"short": "d/MM/y GGGGG"
		},
		"timeFormats": {
			"full": "h:mm:ss a zzzz",
			"long": "h:mm:ss a z",
			"medium": "h:mm:ss a",
			"short": "h:mm a"
		},
		"dateTimeFormats": {
			"full": "{1} 'at' {0}",
			"long": "{1} 'at' {0}",
			"medium": "{1}, {0}",
			"short": "{1}, {0}",
			"availableFormats": {
				"d": "d",
				"E": "ccc",
				"Ed": "E d",
				"Ehm": "E h:mm a",
				"EHm": "E HH:mm",
				"Ehms": "E h:mm:ss a",
				"EHms": "E HH:mm:ss",
				"Gy": "y G",
				"GyMMM": "MMM y G",
				"GyMMMd": "d MMM y G",
				"GyMMMEd": "E, d MMM y G",
				"h": "h a",
				"H": "HH",
				"hm": "h:mm a",
				"Hm": "HH:mm",
				"hms": "h:mm:ss a",
				"Hms": "HH:mm:ss",
				"M": "LL",
				"Md": "d/M",
				"MEd": "E, dd/MM",
				"MMM": "LLL",
				"MMMd": "d MMM",
				"MMMEd": "E, d MMM",
				"MMMMd": "d MMMM",
				"ms": "mm:ss",
				"y": "y G",
				"yyyy": "y G",
				"yyyyM": "MM/y GGGGG",
				"yyyyMd": "d/MM/y G",
				"yyyyMEd": "E, dd/MM/y GGGGG",
				"yyyyMMM": "MMM y G",
				"yyyyMMMd": "d MMM y G",
				"yyyyMMMEd": "E, d MMM y G",
				"yyyyMMMM": "MMMM y G",
				"yyyyQQQ": "QQQ y G",
				"yyyyQQQQ": "QQQQ y G"
			},
			"appendItems": {
				"Day": "{0} ({2}: {1})",
				"Day-Of-Week": "{0} {1}",
				"Era": "{0} {1}",
				"Hour": "{0} ({2}: {1})",
				"Minute": "{0} ({2}: {1})",
				"Month": "{0} ({2}: {1})",
				"Quarter": "{0} ({2}: {1})",
				"Second": "{0} ({2}: {1})",
				"Timezone": "{0} {1}",
				"Week": "{0} ({2}: {1})",
				"Year": "{0} {1}"
			},
			"intervalFormats": {
				"intervalFormatFallback": "{0} – {1}",
				"d": {
					"d": "d – d"
				},
				"h": {
					"a": "h a – h a",
					"h": "h – h a"
				},
				"H": {
					"H": "HH – HH"
				},
				"hm": {
					"a": "h:mm a – h:mm a",
					"h": "h:mm – h:mm a",
					"m": "h:mm – h:mm a"
				},
				"Hm": {
					"H": "HH:mm – HH:mm",
					"m": "HH:mm – HH:mm"
				},
				"hmv": {
					"a": "h:mm a – h:mm a v",
					"h": "h:mm – h:mm a v",
					"m": "h:mm – h:mm a v"
				},
				"Hmv": {
					"H": "HH:mm – HH:mm v",
					"m": "HH:mm – HH:mm v"
				},
				"hv": {
					"a": "h a – h a v",
					"h": "h – h a v"
				},
				"Hv": {
					"H": "HH – HH v"
				},
				"M": {
					"M": "M – M"
				},
				"Md": {
					"d": "d/MM – d/MM",
					"M": "d/MM – d/MM"
				},
				"MEd": {
					"d": "E, d/MM – E, d/MM",
					"M": "E, d/MM – E, d/MM"
				},
				"MMM": {
					"M": "MMM – MMM"
				},
				"MMMd": {
					"d": "d – d MMM",
					"M": "d MMM – d MMM"
				},
				"MMMEd": {
					"d": "E, d – E, d MMM",
					"M": "E, d MMM – E, d MMM"
				},
				"y": {
					"y": "y – y G"
				},
				"yM": {
					"M": "MM/y – MM/y G",
					"y": "MM/y – MM/y G"
				},
				"yMd": {
					"d": "d/MM/y – d/MM/y G",
					"M": "d/MM/y – d/MM/y G",
					"y": "d/MM/y – d/MM/y G"
				},
				"yMEd": {
					"d": "E, d/MM/y – E, d/MM/y G",
					"M": "E, d/MM/y – E, d/MM/y G",
					"y": "E, d/MM/y – E, d/MM/y G"
				},
				"yMMM": {
					"M": "MMM – MMM y G",
					"y": "MMM y – MMM y G"
				},
				"yMMMd": {
					"d": "d – d MMM y G",
					"M": "d MMM – d MMM y G",
					"y": "d MMM y – d MMM y G"
				},
				"yMMMEd": {
					"d": "E, d – E, d MMM y G",
					"M": "E, d MMM – E, d MMM y G",
					"y": "E, d MMM y – E, d MMM y G"
				},
				"yMMMM": {
					"M": "MMMM – MMMM y G",
					"y": "MMMM y – MMMM y G"
				}
			}
		},
		"months": {
			"format": {
				"abbreviated": [
					"Muh.",
					"Saf.",
					"Rab. I",
					"Rab. II",
					"Jum. I",
					"Jum. II",
					"Raj.",
					"Sha.",
					"Ram.",
					"Shaw.",
					"Dhuʻl-Q.",
					"Dhuʻl-H."
				],
				"narrow": [
					"1",
					"2",
					"3",
					"4",
					"5",
					"6",
					"7",
					"8",
					"9",
					"10",
					"11",
					"12"
				],
				"wide": [
					"Muharram",
					"Safar",
					"Rabiʻ I",
					"Rabiʻ II",
					"Jumada I",
					"Jumada II",
					"Rajab",
					"Shaʻban",
					"Ramadan",
					"Shawwal",
					"Dhuʻl-Qiʻdah",
					"Dhuʻl-Hijjah"
				]
			},
			"stand-alone": {
				"abbreviated": [
					"Muh.",
					"Saf.",
					"Rab. I",
					"Rab. II",
					"Jum. I",
					"Jum. II",
					"Raj.",
					"Sha.",
					"Ram.",
					"Shaw.",
					"Dhuʻl-Q.",
					"Dhuʻl-H."
				],
				"narrow": [
					"1",
					"2",
					"3",
					"4",
					"5",
					"6",
					"7",
					"8",
					"9",
					"10",
					"11",
					"12"
				],
				"wide": [
					"Muharram",
					"Safar",
					"Rabiʻ I",
					"Rabiʻ II",
					"Jumada I",
					"Jumada II",
					"Rajab",
					"Shaʻban",
					"Ramadan",
					"Shawwal",
					"Dhuʻl-Qiʻdah",
					"Dhuʻl-Hijjah"
				]
			}
		},
		"days": {
			"format": {
				"abbreviated": [
					"Sun",
					"Mon",
					"Tue",
					"Wed",
					"Thu",
					"Fri",
					"Sat"
				],
				"narrow": [
					"S",
					"M",
					"T",
					"W",
					"T",
					"F",
					"S"
				],
				"short": [
					"Su",
					"Mo",
					"Tu",
					"We",
					"Th",
					"Fr",
					"Sa"
				],
				"wide": [
					"Sunday",
					"Monday",
					"Tuesday",
					"Wednesday",
					"Thursday",
					"Friday",
					"Saturday"
				]
			},
			"stand-alone": {
				"abbreviated": [
					"Sun",
					"Mon",
					"Tue",
					"Wed",
					"Thu",
					"Fri",
					"Sat"
				],
				"narrow": [
					"S",
					"M",
					"T",
					"W",
					"T",
					"F",
					"S"
				],
				"short": [
					"Su",
					"Mo",
					"Tu",
					"We",
					"Th",
					"Fr",
					"Sa"
				],
				"wide": [
					"Sunday",
					"Monday",
					"Tuesday",
					"Wednesday",
					"Thursday",
					"Friday",
					"Saturday"
				]
			}
		},
		"quarters": {
			"format": {
				"abbreviated": [
					"Q1",
					"Q2",
					"Q3",
					"Q4"
				],
				"narrow": [
					"1",
					"2",
					"3",
					"4"
				],
				"wide": [
					"1st quarter",
					"2nd quarter",
					"3rd quarter",
					"4th quarter"
				]
			},
			"stand-alone": {
				"abbreviated": [
					"Q1",
					"Q2",
					"Q3",
					"Q4"
				],
				"narrow": [
					"1",
					"2",
					"3",
					"4"
				],
				"wide": [
					"1st quarter",
					"2nd quarter",
					"3rd quarter",
					"4th quarter"
				]
			}
		},
		"dayPeriods": {
			"format": {
				"abbreviated": [
					"AM",
					"PM"
				],
				"narrow": [
					"a",
					"p"
				],
				"wide": [
					"AM",
					"PM"
				]
			},
			"stand-alone": {
				"abbreviated": [
					"AM",
					"PM"
				],
				"narrow": [
					"AM",
					"PM"
				],
				"wide": [
					"AM",
					"PM"
				]
			}
		},
		"era-wide": {
			"0": "AH"
		},
		"era-abbreviated": {
			"0": "AH"
		},
		"era-narrow": {
			"0": "AH"
		}
	},
	"ca-japanese": {
		"dateFormats": {
			"full": "EEEE, MMMM d, y G",
			"long": "MMMM d, y G",
			"medium": "MMM d, y G",
			"short": "M/d/y GGGGG"
		},
		"timeFormats": {
			"full": "h:mm:ss a zzzz",
			"long": "h:mm:ss a z",
			"medium": "h:mm:ss a",
			"short": "h:mm a"
		},
		"dateTimeFormats": {
			"full": "{1} 'at' {0}",
			"long": "{1} 'at' {0}",
			"medium": "{1}, {0}",
			"short": "{1}, {0}",
			"availableFormats": {
				"d": "d",
				"E": "ccc",
				"Ed": "E d",
				"Ehm": "E h:mm a",
				"EHm": "E HH:mm",
				"Ehms": "E h:mm:ss a",
				"EHms": "E HH:mm:ss",
				"Gy": "y G",
				"GyMMM": "MMM y G",
				"GyMMMd": "d MMM y G",
				"GyMMMEd": "E, d MMM y G",
				"h": "h a",
				"H": "HH",
				"hm": "h:mm a",
				"Hm": "HH:mm",
				"hms": "h:mm:ss a",
				"Hms": "HH:mm:ss",
				"M": "LL",
				"Md": "d/M",
				"MEd": "E, dd/MM",
				"MMM": "LLL",
				"MMMd": "d MMM",
				"MMMEd": "E, d MMM",
				"MMMMd": "d MMMM",
				"ms": "mm:ss",
				"y": "y G",
				"yyyy": "y G",
				"yyyyM": "MM/y GGGGG",
				"yyyyMd": "d/MM/y G",
				"yyyyMEd": "E, dd/MM/y GGGGG",
				"yyyyMMM": "MMM y G",
				"yyyyMMMd": "d MMM y G",
				"yyyyMMMEd": "E, d MMM y G",
				"yyyyMMMM": "MMMM y G",
				"yyyyQQQ": "QQQ y G",
				"yyyyQQQQ": "QQQQ y G"
			},
			"appendItems": {
				"Day": "{0} ({2}: {1})",
				"Day-Of-Week": "{0} {1}",
				"Era": "{0} {1}",
				"Hour": "{0} ({2}: {1})",
				"Minute": "{0} ({2}: {1})",
				"Month": "{0} ({2}: {1})",
				"Quarter": "{0} ({2}: {1})",
				"Second": "{0} ({2}: {1})",
				"Timezone": "{0} {1}",
				"Week": "{0} ({2}: {1})",
				"Year": "{0} {1}"
			},
			"intervalFormats": {
				"intervalFormatFallback": "{0} – {1}",
				"d": {
					"d": "d – d"
				},
				"h": {
					"a": "h a – h a",
					"h": "h – h a"
				},
				"H": {
					"H": "HH – HH"
				},
				"hm": {
					"a": "h:mm a – h:mm a",
					"h": "h:mm – h:mm a",
					"m": "h:mm – h:mm a"
				},
				"Hm": {
					"H": "HH:mm – HH:mm",
					"m": "HH:mm – HH:mm"
				},
				"hmv": {
					"a": "h:mm a – h:mm a v",
					"h": "h:mm – h:mm a v",
					"m": "h:mm – h:mm a v"
				},
				"Hmv": {
					"H": "HH:mm – HH:mm v",
					"m": "HH:mm – HH:mm v"
				},
				"hv": {
					"a": "h a – h a v",
					"h": "h – h a v"
				},
				"Hv": {
					"H": "HH – HH v"
				},
				"M": {
					"M": "M – M"
				},
				"Md": {
					"d": "d/MM – d/MM",
					"M": "d/MM – d/MM"
				},
				"MEd": {
					"d": "E, d/MM – E, d/MM",
					"M": "E, d/MM – E, d/MM"
				},
				"MMM": {
					"M": "MMM – MMM"
				},
				"MMMd": {
					"d": "d – d MMM",
					"M": "d MMM – d MMM"
				},
				"MMMEd": {
					"d": "E, d – E, d MMM",
					"M": "E, d MMM – E, d MMM"
				},
				"y": {
					"y": "y – y G"
				},
				"yM": {
					"M": "MM/y – MM/y G",
					"y": "MM/y – MM/y G"
				},
				"yMd": {
					"d": "d/MM/y – d/MM/y G",
					"M": "d/MM/y – d/MM/y G",
					"y": "d/MM/y – d/MM/y G"
				},
				"yMEd": {
					"d": "E, d/MM/y – E, d/MM/y G",
					"M": "E, d/MM/y – E, d/MM/y G",
					"y": "E, d/MM/y – E, d/MM/y G"
				},
				"yMMM": {
					"M": "MMM – MMM y G",
					"y": "MMM y – MMM y G"
				},
				"yMMMd": {
					"d": "d – d MMM y G",
					"M": "d MMM – d MMM y G",
					"y": "d MMM y – d MMM y G"
				},
				"yMMMEd": {
					"d": "E, d – E, d MMM y G",
					"M": "E, d MMM – E, d MMM y G",
					"y": "E, d MMM y – E, d MMM y G"
				},
				"yMMMM": {
					"M": "MMMM – MMMM y G",
					"y": "MMMM y – MMMM y G"
				}
			}
		},
		"months": {
			"format": {
				"abbreviated": [
					"Jan",
					"Feb",
					"Mar",
					"Apr",
					"May",
					"Jun",
					"Jul",
					"Aug",
					"Sep",
					"Oct",
					"Nov",
					"Dec"
				],
				"narrow": [
					"J",
					"F",
					"M",
					"A",
					"M",
					"J",
					"J",
					"A",
					"S",
					"O",
					"N",
					"D"
				],
				"wide": [
					"January",
					"February",
					"March",
					"April",
					"May",
					"June",
					"July",
					"August",
					"September",
					"October",
					"November",
					"December"
				]
			},
			"stand-alone": {
				"abbreviated": [
					"Jan",
					"Feb",
					"Mar",
					"Apr",
					"May",
					"Jun",
					"Jul",
					"Aug",
					"Sep",
					"Oct",
					"Nov",
					"Dec"
				],
				"narrow": [
					"J",
					"F",
					"M",
					"A",
					"M",
					"J",
					"J",
					"A",
					"S",
					"O",
					"N",
					"D"
				],
				"wide": [
					"January",
					"February",
					"March",
					"April",
					"May",
					"June",
					"July",
					"August",
					"September",
					"October",
					"November",
					"December"
				]
			}
		},
		"days": {
			"format": {
				"abbreviated": [
					"Sun",
					"Mon",
					"Tue",
					"Wed",
					"Thu",
					"Fri",
					"Sat"
				],
				"narrow": [
					"S",
					"M",
					"T",
					"W",
					"T",
					"F",
					"S"
				],
				"short": [
					"Su",
					"Mo",
					"Tu",
					"We",
					"Th",
					"Fr",
					"Sa"
				],
				"wide": [
					"Sunday",
					"Monday",
					"Tuesday",
					"Wednesday",
					"Thursday",
					"Friday",
					"Saturday"
				]
			},
			"stand-alone": {
				"abbreviated": [
					"Sun",
					"Mon",
					"Tue",
					"Wed",
					"Thu",
					"Fri",
					"Sat"
				],
				"narrow": [
					"S",
					"M",
					"T",
					"W",
					"T",
					"F",
					"S"
				],
				"short": [
					"Su",
					"Mo",
					"Tu",
					"We",
					"Th",
					"Fr",
					"Sa"
				],
				"wide": [
					"Sunday",
					"Monday",
					"Tuesday",
					"Wednesday",
					"Thursday",
					"Friday",
					"Saturday"
				]
			}
		},
		"quarters": {
			"format": {
				"abbreviated": [
					"Q1",
					"Q2",
					"Q3",
					"Q4"
				],
				"narrow": [
					"1",
					"2",
					"3",
					"4"
				],
				"wide": [
					"1st quarter",
					"2nd quarter",
					"3rd quarter",
					"4th quarter"
				]
			},
			"stand-alone": {
				"abbreviated": [
					"Q1",
					"Q2",
					"Q3",
					"Q4"
				],
				"narrow": [
					"1",
					"2",
					"3",
					"4"
				],
				"wide": [
					"1st quarter",
					"2nd quarter",
					"3rd quarter",
					"4th quarter"
				]
			}
		},
		"dayPeriods": {
			"format": {
				"abbreviated": [
					"AM",
					"PM"
				],
				"narrow": [
					"a",
					"p"
				],
				"wide": [
					"AM",
					"PM"
				]
			},
			"stand-alone": {
				"abbreviated": [
					"AM",
					"PM"
				],
				"narrow": [
					"AM",
					"PM"
				],
				"wide": [
					"AM",
					"PM"
				]
			}
		},
		"era-wide": {
			"232": "Meiji",
			"233": "Taishō",
			"234": "Shōwa",
			"235": "Heisei"
		},
		"era-abbreviated": {
			"232": "Meiji",
			"233": "Taishō",
			"234": "Shōwa",
			"235": "Heisei"
		},
		"era-narrow": {
			"232": "M",
			"233": "T",
			"234": "S",
			"235": "H"
		}
	},
	"ca-persian": {
		"dateFormats": {
			"full": "EEEE, d MMMM y G",
			"long": "d MMMM y G",
			"medium": "d/MM/y G",
			"short": "d/MM/y GGGGG"
		},
		"timeFormats": {
			"full": "h:mm:ss a zzzz",
			"long": "h:mm:ss a z",
			"medium": "h:mm:ss a",
			"short": "h:mm a"
		},
		"dateTimeFormats": {
			"full": "{1} 'at' {0}",
			"long": "{1} 'at' {0}",
			"medium": "{1}, {0}",
			"short": "{1}, {0}",
			"availableFormats": {
				"d": "d",
				"E": "ccc",
				"Ed": "E d",
				"Ehm": "E h:mm a",
				"EHm": "E HH:mm",
				"Ehms": "E h:mm:ss a",
				"EHms": "E HH:mm:ss",
				"Gy": "y G",
				"GyMMM": "MMM y G",
				"GyMMMd": "d MMM y G",
				"GyMMMEd": "E, d MMM y G",
				"h": "h a",
				"H": "HH",
				"hm": "h:mm a",
				"Hm": "HH:mm",
				"hms": "h:mm:ss a",
				"Hms": "HH:mm:ss",
				"M": "LL",
				"Md": "d/M",
				"MEd": "E, dd/MM",
				"MMM": "LLL",
				"MMMd": "d MMM",
				"MMMEd": "E, d MMM",
				"MMMMd": "d MMMM",
				"ms": "mm:ss",
				"y": "y G",
				"yyyy": "y G",
				"yyyyM": "MM/y GGGGG",
				"yyyyMd": "d/MM/y G",
				"yyyyMEd": "E, dd/MM/y GGGGG",
				"yyyyMMM": "MMM y G",
				"yyyyMMMd": "d MMM y G",
				"yyyyMMMEd": "E, d MMM y G",
				"yyyyMMMM": "MMMM y G",
				"yyyyQQQ": "QQQ y G",
				"yyyyQQQQ": "QQQQ y G"
			},
			"appendItems": {
				"Day": "{0} ({2}: {1})",
				"Day-Of-Week": "{0} {1}",
				"Era": "{0} {1}",
				"Hour": "{0} ({2}: {1})",
				"Minute": "{0} ({2}: {1})",
				"Month": "{0} ({2}: {1})",
				"Quarter": "{0} ({2}: {1})",
				"Second": "{0} ({2}: {1})",
				"Timezone": "{0} {1}",
				"Week": "{0} ({2}: {1})",
				"Year": "{0} {1}"
			},
			"intervalFormats": {
				"intervalFormatFallback": "{0} – {1}",
				"d": {
					"d": "d – d"
				},
				"h": {
					"a": "h a – h a",
					"h": "h – h a"
				},
				"H": {
					"H": "HH – HH"
				},
				"hm": {
					"a": "h:mm a – h:mm a",
					"h": "h:mm – h:mm a",
					"m": "h:mm – h:mm a"
				},
				"Hm": {
					"H": "HH:mm – HH:mm",
					"m": "HH:mm – HH:mm"
				},
				"hmv": {
					"a": "h:mm a – h:mm a v",
					"h": "h:mm – h:mm a v",
					"m": "h:mm – h:mm a v"
				},
				"Hmv": {
					"H": "HH:mm – HH:mm v",
					"m": "HH:mm – HH:mm v"
				},
				"hv": {
					"a": "h a – h a v",
					"h": "h – h a v"
				},
				"Hv": {
					"H": "HH – HH v"
				},
				"M": {
					"M": "M – M"
				},
				"Md": {
					"d": "d/MM – d/MM",
					"M": "d/MM – d/MM"
				},
				"MEd": {
					"d": "E, d/MM – E, d/MM",
					"M": "E, d/MM – E, d/MM"
				},
				"MMM": {
					"M": "MMM – MMM"
				},
				"MMMd": {
					"d": "d – d MMM",
					"M": "d MMM – d MMM"
				},
				"MMMEd": {
					"d": "E, d – E, d MMM",
					"M": "E, d MMM – E, d MMM"
				},
				"y": {
					"y": "y – y G"
				},
				"yM": {
					"M": "MM/y – MM/y G",
					"y": "MM/y – MM/y G"
				},
				"yMd": {
					"d": "d/MM/y – d/MM/y G",
					"M": "d/MM/y – d/MM/y G",
					"y": "d/MM/y – d/MM/y G"
				},
				"yMEd": {
					"d": "E, d/MM/y – E, d/MM/y G",
					"M": "E, d/MM/y – E, d/MM/y G",
					"y": "E, d/MM/y – E, d/MM/y G"
				},
				"yMMM": {
					"M": "MMM – MMM y G",
					"y": "MMM y – MMM y G"
				},
				"yMMMd": {
					"d": "d – d MMM y G",
					"M": "d MMM – d MMM y G",
					"y": "d MMM y – d MMM y G"
				},
				"yMMMEd": {
					"d": "E, d – E, d MMM y G",
					"M": "E, d MMM – E, d MMM y G",
					"y": "E, d MMM y – E, d MMM y G"
				},
				"yMMMM": {
					"M": "MMMM – MMMM y G",
					"y": "MMMM y – MMMM y G"
				}
			}
		},
		"months": {
			"format": {
				"abbreviated": [
					"Farvardin",
					"Ordibehesht",
					"Khordad",
					"Tir",
					"Mordad",
					"Shahrivar",
					"Mehr",
					"Aban",
					"Azar",
					"Dey",
					"Bahman",
					"Esfand"
				],
				"narrow": [
					"1",
					"2",
					"3",
					"4",
					"5",
					"6",
					"7",
					"8",
					"9",
					"10",
					"11",
					"12"
				],
				"wide": [
					"Farvardin",
					"Ordibehesht",
					"Khordad",
					"Tir",
					"Mordad",
					"Shahrivar",
					"Mehr",
					"Aban",
					"Azar",
					"Dey",
					"Bahman",
					"Esfand"
				]
			},
			"stand-alone": {
				"abbreviated": [
					"Farvardin",
					"Ordibehesht",
					"Khordad",
					"Tir",
					"Mordad",
					"Shahrivar",
					"Mehr",
					"Aban",
					"Azar",
					"Dey",
					"Bahman",
					"Esfand"
				],
				"narrow": [
					"1",
					"2",
					"3",
					"4",
					"5",
					"6",
					"7",
					"8",
					"9",
					"10",
					"11",
					"12"
				],
				"wide": [
					"Farvardin",
					"Ordibehesht",
					"Khordad",
					"Tir",
					"Mordad",
					"Shahrivar",
					"Mehr",
					"Aban",
					"Azar",
					"Dey",
					"Bahman",
					"Esfand"
				]
			}
		},
		"days": {
			"format": {
				"abbreviated": [
					"Sun",
					"Mon",
					"Tue",
					"Wed",
					"Thu",
					"Fri",
					"Sat"
				],
				"narrow": [
					"S",
					"M",
					"T",
					"W",
					"T",
					"F",
					"S"
				],
				"short": [
					"Su",
					"Mo",
					"Tu",
					"We",
					"Th",
					"Fr",
					"Sa"
				],
				"wide": [
					"Sunday",
					"Monday",
					"Tuesday",
					"Wednesday",
					"Thursday",
					"Friday",
					"Saturday"
				]
			},
			"stand-alone": {
				"abbreviated": [
					"Sun",
					"Mon",
					"Tue",
					"Wed",
					"Thu",
					"Fri",
					"Sat"
				],
				"narrow": [
					"S",
					"M",
					"T",
					"W",
					"T",
					"F",
					"S"
				],
				"short": [
					"Su",
					"Mo",
					"Tu",
					"We",
					"Th",
					"Fr",
					"Sa"
				],
				"wide": [
					"Sunday",
					"Monday",
					"Tuesday",
					"Wednesday",
					"Thursday",
					"Friday",
					"Saturday"
				]
			}
		},
		"quarters": {
			"format": {
				"abbreviated": [
					"Q1",
					"Q2",
					"Q3",
					"Q4"
				],
				"narrow": [
					"1",
					"2",
					"3",
					"4"
				],
				"wide": [
					"1st quarter",
					"2nd quarter",
					"3rd quarter",
					"4th quarter"
				]
			},
			"stand-alone": {
				"abbreviated": [
					"Q1",
					"Q2",
					"Q3",
					"Q4"
				],
				"narrow": [
					"1",
					"2",
					"3",
					"4"
				],
				"wide": [
					"1st quarter",
					"2nd quarter",
					"3rd quarter",
					"4th quarter"
				]
			}
		},
		"dayPeriods": {
			"format": {
				"abbreviated": [
					"AM",
					"PM"
				],
				"narrow": [
					"a",
					"p"
				],
				"wide": [
					"AM",
					"PM"
				]
			},
			"stand-alone": {
				"abbreviated": [
					"AM",
					"PM"
				],
				"narrow": [
					"AM",
					"PM"
				],
				"wide": [
					"AM",
					"PM"
				]
			}
		},
		"era-wide": {
			"0": "AP"
		},
		"era-abbreviated": {
			"0": "AP"
		},
		"era-narrow": {
			"0": "AP"
		}
	},
	"dateFields": {
		"era": {
			"displayName": "era"
		},
		"year-wide": {
			"displayName": "year",
			"relative-type--1": "last year",
			"relative-type-0": "this year",
			"relative-type-1": "next year",
			"relativeTime-type-future": {
				"relativeTimePattern-count-one": "in {0} year",
				"relativeTimePattern-count-other": "in {0} years"
			},
			"relativeTime-type-past": {
				"relativeTimePattern-count-one": "{0} year ago",
				"relativeTimePattern-count-other": "{0} years ago"
			}
		},
		"year-short": {
			"displayName": "yr.",
			"relative-type--1": "last yr.",
			"relative-type-0": "this yr.",
			"relative-type-1": "next yr.",
			"relativeTime-type-future": {
				"relativeTimePattern-count-one": "in {0} yr.",
				"relativeTimePattern-count-other": "in {0} yr."
			},
			"relativeTime-type-past": {
				"relativeTimePattern-count-one": "{0} yr. ago",
				"relativeTimePattern-count-other": "{0} yr. ago"
			}
		},
		"year-narrow": {
			"displayName": "yr.",
			"relative-type--1": "last yr.",
			"relative-type-0": "this yr.",
			"relative-type-1": "next yr.",
			"relativeTime-type-future": {
				"relativeTimePattern-count-one": "in {0} yr.",
				"relativeTimePattern-count-other": "in {0} yr."
			},
			"relativeTime-type-past": {
				"relativeTimePattern-count-one": "{0} yr. ago",
				"relativeTimePattern-count-other": "{0} yr. ago"
			}
		},
		"quarter-wide": {
			"displayName": "quarter",
			"relative-type--1": "last quarter",
			"relative-type-0": "this quarter",
			"relative-type-1": "next quarter",
			"relativeTime-type-future": {
				"relativeTimePattern-count-one": "in {0} quarter",
				"relativeTimePattern-count-other": "in {0} quarters"
			},
			"relativeTime-type-past": {
				"relativeTimePattern-count-one": "{0} quarter ago",
				"relativeTimePattern-count-other": "{0} quarters ago"
			}
		},
		"quarter-short": {
			"displayName": "qtr.",
			"relative-type--1": "last qtr.",
			"relative-type-0": "this qtr.",
			"relative-type-1": "next qtr.",
			"relativeTime-type-future": {
				"relativeTimePattern-count-one": "in {0} qtr.",
				"relativeTimePattern-count-other": "in {0} qtrs."
			},
			"relativeTime-type-past": {
				"relativeTimePattern-count-one": "{0} qtr. ago",
				"relativeTimePattern-count-other": "{0} qtrs. ago"
			}
		},
		"quarter-narrow": {
			"displayName": "qtr.",
			"relative-type--1": "last qtr.",
			"relative-type-0": "this qtr.",
			"relative-type-1": "next qtr.",
			"relativeTime-type-future": {
				"relativeTimePattern-count-one": "in {0} qtrs.",
				"relativeTimePattern-count-other": "in {0} qtrs."
			},
			"relativeTime-type-past": {
				"relativeTimePattern-count-one": "{0} qtrs. ago",
				"relativeTimePattern-count-other": "{0} qtrs. ago"
			}
		},
		"month-wide": {
			"displayName": "month",
			"relative-type--1": "last month",
			"relative-type-0": "this month",
			"relative-type-1": "next month",
			"relativeTime-type-future": {
				"relativeTimePattern-count-one": "in {0} month",
				"relativeTimePattern-count-other": "in {0} months"
			},
			"relativeTime-type-past": {
				"relativeTimePattern-count-one": "{0} month ago",
				"relativeTimePattern-count-other": "{0} months ago"
			}
		},
		"month-short": {
			"displayName": "mo.",
			"relative-type--1": "last mo.",
			"relative-type-0": "this mo.",
			"relative-type-1": "next mo.",
			"relativeTime-type-future": {
				"relativeTimePattern-count-one": "in {0} mo.",
				"relativeTimePattern-count-other": "in {0} mo."
			},
			"relativeTime-type-past": {
				"relativeTimePattern-count-one": "{0} mo. ago",
				"relativeTimePattern-count-other": "{0} mo. ago"
			}
		},
		"month-narrow": {
			"displayName": "mo.",
			"relative-type--1": "last mo.",
			"relative-type-0": "this mo.",
			"relative-type-1": "next mo.",
			"relativeTime-type-future": {
				"relativeTimePattern-count-one": "in {0} mo.",
				"relativeTimePattern-count-other": "in {0} mo."
			},
			"relativeTime-type-past": {
				"relativeTimePattern-count-one": "{0} mo. ago",
				"relativeTimePattern-count-other": "{0} mo. ago"
			}
		},
		"week-wide": {
			"displayName": "week",
			"relative-type--1": "last week",
			"relative-type-0": "this week",
			"relative-type-1": "next week",
			"relativeTime-type-future": {
				"relativeTimePattern-count-one": "in {0} week",
				"relativeTimePattern-count-other": "in {0} weeks"
			},
			"relativeTime-type-past": {
				"relativeTimePattern-count-one": "{0} week ago",
				"relativeTimePattern-count-other": "{0} weeks ago"
			}
		},
		"week-short": {
			"displayName": "wk.",
			"relative-type--1": "last wk.",
			"relative-type-0": "this wk.",
			"relative-type-1": "next wk.",
			"relativeTime-type-future": {
				"relativeTimePattern-count-one": "in {0} wk.",
				"relativeTimePattern-count-other": "in {0} wk."
			},
			"relativeTime-type-past": {
				"relativeTimePattern-count-one": "{0} wk. ago",
				"relativeTimePattern-count-other": "{0} wk. ago"
			}
		},
		"week-narrow": {
			"displayName": "wk.",
			"relative-type--1": "last wk.",
			"relative-type-0": "this wk.",
			"relative-type-1": "next wk.",
			"relativeTime-type-future": {
				"relativeTimePattern-count-one": "in {0} wk.",
				"relativeTimePattern-count-other": "in {0} wk."
			},
			"relativeTime-type-past": {
				"relativeTimePattern-count-one": "{0} wk. ago",
				"relativeTimePattern-count-other": "{0} wk. ago"
			}
		},
		"day-wide": {
			"displayName": "day",
			"relative-type--1": "yesterday",
			"relative-type-0": "today",
			"relative-type-1": "tomorrow",
			"relativeTime-type-future": {
				"relativeTimePattern-count-one": "in {0} day",
				"relativeTimePattern-count-other": "in {0} days"
			},
			"relativeTime-type-past": {
				"relativeTimePattern-count-one": "{0} day ago",
				"relativeTimePattern-count-other": "{0} days ago"
			}
		},
		"day-short": {
			"displayName": "day",
			"relative-type--1": "yesterday",
			"relative-type-0": "today",
			"relative-type-1": "tomorrow",
			"relativeTime-type-future": {
				"relativeTimePattern-count-one": "in {0} day",
				"relativeTimePattern-count-other": "in {0} days"
			},
			"relativeTime-type-past": {
				"relativeTimePattern-count-one": "{0} day ago",
				"relativeTimePattern-count-other": "{0} days ago"
			}
		},
		"day-narrow": {
			"displayName": "day",
			"relative-type--1": "yesterday",
			"relative-type-0": "today",
			"relative-type-1": "tomorrow",
			"relativeTime-type-future": {
				"relativeTimePattern-count-one": "in {0} days",
				"relativeTimePattern-count-other": "in {0} days"
			},
			"relativeTime-type-past": {
				"relativeTimePattern-count-one": "{0} days ago",
				"relativeTimePattern-count-other": "{0} days ago"
			}
		},
		"weekday": {
			"displayName": "day of the week"
		},
		"hour-wide": {
			"displayName": "hour",
			"relativeTime-type-future": {
				"relativeTimePattern-count-one": "in {0} hour",
				"relativeTimePattern-count-other": "in {0} hours"
			},
			"relativeTime-type-past": {
				"relativeTimePattern-count-one": "{0} hour ago",
				"relativeTimePattern-count-other": "{0} hours ago"
			}
		},
		"hour-short": {
			"displayName": "hr.",
			"relativeTime-type-future": {
				"relativeTimePattern-count-one": "in {0} hr.",
				"relativeTimePattern-count-other": "in {0} hr."
			},
			"relativeTime-type-past": {
				"relativeTimePattern-count-one": "{0} hr. ago",
				"relativeTimePattern-count-other": "{0} hr. ago"
			}
		},
		"hour-narrow": {
			"displayName": "hr.",
			"relativeTime-type-future": {
				"relativeTimePattern-count-one": "in {0} hr.",
				"relativeTimePattern-count-other": "in {0} hr."
			},
			"relativeTime-type-past": {
				"relativeTimePattern-count-one": "{0} hr. ago",
				"relativeTimePattern-count-other": "{0} hr. ago"
			}
		},
		"minute-wide": {
			"displayName": "minute",
			"relativeTime-type-future": {
				"relativeTimePattern-count-one": "in {0} minute",
				"relativeTimePattern-count-other": "in {0} minutes"
			},
			"relativeTime-type-past": {
				"relativeTimePattern-count-one": "{0} minute ago",
				"relativeTimePattern-count-other": "{0} minutes ago"
			}
		},
		"minute-short": {
			"displayName": "min.",
			"relativeTime-type-future": {
				"relativeTimePattern-count-one": "in {0} min.",
				"relativeTimePattern-count-other": "in {0} min."
			},
			"relativeTime-type-past": {
				"relativeTimePattern-count-one": "{0} min. ago",
				"relativeTimePattern-count-other": "{0} min. ago"
			}
		},
		"minute-narrow": {
			"displayName": "min.",
			"relativeTime-type-future": {
				"relativeTimePattern-count-one": "in {0} min.",
				"relativeTimePattern-count-other": "in {0} min."
			},
			"relativeTime-type-past": {
				"relativeTimePattern-count-one": "{0} min. ago",
				"relativeTimePattern-count-other": "{0} min. ago"
			}
		},
		"second-wide": {
			"displayName": "second",
			"relative-type-0": "now",
			"relativeTime-type-future": {
				"relativeTimePattern-count-one": "in {0} second",
				"relativeTimePattern-count-other": "in {0} seconds"
			},
			"relativeTime-type-past": {
				"relativeTimePattern-count-one": "{0} second ago",
				"relativeTimePattern-count-other": "{0} seconds ago"
			}
		},
		"second-short": {
			"displayName": "sec.",
			"relative-type-0": "now",
			"relativeTime-type-future": {
				"relativeTimePattern-count-one": "in {0} sec.",
				"relativeTimePattern-count-other": "in {0} sec."
			},
			"relativeTime-type-past": {
				"relativeTimePattern-count-one": "{0} sec. ago",
				"relativeTimePattern-count-other": "{0} sec. ago"
			}
		},
		"second-narrow": {
			"displayName": "sec.",
			"relative-type-0": "now",
			"relativeTime-type-future": {
				"relativeTimePattern-count-one": "in {0} sec.",
				"relativeTimePattern-count-other": "in {0} sec."
			},
			"relativeTime-type-past": {
				"relativeTimePattern-count-one": "{0} sec. ago",
				"relativeTimePattern-count-other": "{0} sec. ago"
			}
		},
		"zone": {
			"displayName": "time zone"
		}
	},
	"decimalFormat": {
		"standard": "#,##0.###"
	},
	"decimalFormat-long": {
		"1000-one": "0 thousand",
		"1000-other": "0 thousand",
		"10000-one": "00 thousand",
		"10000-other": "00 thousand",
		"100000-one": "000 thousand",
		"100000-other": "000 thousand",
		"1000000-one": "0 million",
		"1000000-other": "0 million",
		"10000000-one": "00 million",
		"10000000-other": "00 million",
		"100000000-one": "000 million",
		"100000000-other": "000 million",
		"1000000000-one": "0 billion",
		"1000000000-other": "0 billion",
		"10000000000-one": "00 billion",
		"10000000000-other": "00 billion",
		"100000000000-one": "000 billion",
		"100000000000-other": "000 billion",
		"1000000000000-one": "0 trillion",
		"1000000000000-other": "0 trillion",
		"10000000000000-one": "00 trillion",
		"10000000000000-other": "00 trillion",
		"100000000000000-one": "000 trillion",
		"100000000000000-other": "000 trillion"
	},
	"decimalFormat-short": {
		"1000-one": "0K",
		"1000-other": "0K",
		"10000-one": "00K",
		"10000-other": "00K",
		"100000-one": "000K",
		"100000-other": "000K",
		"1000000-one": "0M",
		"1000000-other": "0M",
		"10000000-one": "00M",
		"10000000-other": "00M",
		"100000000-one": "000M",
		"100000000-other": "000M",
		"1000000000-one": "0B",
		"1000000000-other": "0B",
		"10000000000-one": "00B",
		"10000000000-other": "00B",
		"100000000000-one": "000B",
		"100000000000-other": "000B",
		"1000000000000-one": "0T",
		"1000000000000-other": "0T",
		"10000000000000-one": "00T",
		"10000000000000-other": "00T",
		"100000000000000-one": "000T",
		"100000000000000-other": "000T"
	},
	"scientificFormat": {
		"standard": "#E0"
	},
	"percentFormat": {
		"standard": "#,##0%"
	},
	"currencyFormat": {
		"standard": "¤#,##0.00",
		"accounting": "¤#,##0.00;(¤#,##0.00)",
		"currencySpacing": {
			"beforeCurrency": {
				"currencyMatch": "[:^S:]",
				"surroundingMatch": "[:digit:]",
				"insertBetween": " "
			},
			"afterCurrency": {
				"currencyMatch": "[:^S:]",
				"surroundingMatch": "[:digit:]",
				"insertBetween": " "
			}
		}
	},
	"symbols-latn-decimal": ".",
	"symbols-latn-group": ",",
	"symbols-latn-list": ";",
	"symbols-latn-percentSign": "%",
	"symbols-latn-plusSign": "+",
	"symbols-latn-minusSign": "-",
	"symbols-latn-exponential": "E",
	"symbols-latn-superscriptingExponent": "×",
	"symbols-latn-perMille": "‰",
	"symbols-latn-infinity": "∞",
	"symbols-latn-nan": "NaN",
	"symbols-latn-timeSeparator": ":",
	"currencySymbols": {
		"AUD": "A$",
		"BRL": "R$",
		"CAD": "CA$",
		"CNY": "CN¥",
		"EUR": "€",
		"GBP": "£",
		"HKD": "HK$",
		"ILS": "₪",
		"INR": "₹",
		"JPY": "JP¥",
		"KRW": "₩",
		"MXN": "MX$",
		"NZD": "$",
		"TWD": "NT$",
		"USD": "US$",
		"VND": "₫",
		"XAF": "FCFA",
		"XCD": "EC$",
		"XOF": "CFA",
		"XPF": "CFPF"
	},
	"currencyDigits": {
		"ADP": 0,
		"AFN": 0,
		"ALL": 0,
		"AMD": 0,
		"BHD": 3,
		"BIF": 0,
		"BYR": 0,
		"CAD": 2,
		"CHF": 2,
		"CLF": 4,
		"CLP": 0,
		"COP": 0,
		"CRC": 0,
		"CZK": 0,
		"DEFAULT": 2,
		"DJF": 0,
		"ESP": 0,
		"GNF": 0,
		"GYD": 0,
		"HUF": 0,
		"IDR": 0,
		"IQD": 0,
		"IRR": 0,
		"ISK": 0,
		"ITL": 0,
		"JOD": 3,
		"JPY": 0,
		"KMF": 0,
		"KPW": 0,
		"KRW": 0,
		"KWD": 3,
		"LAK": 0,
		"LBP": 0,
		"LUF": 0,
		"LYD": 3,
		"MGA": 0,
		"MGF": 0,
		"MMK": 0,
		"MNT": 0,
		"MRO": 0,
		"MUR": 0,
		"OMR": 3,
		"PKR": 0,
		"PYG": 0,
		"RSD": 0,
		"RWF": 0,
		"SLL": 0,
		"SOS": 0,
		"STD": 0,
		"SYP": 0,
		"TMM": 0,
		"TND": 3,
		"TRL": 0,
		"TWD": 0,
		"TZS": 0,
		"UGX": 0,
		"UYI": 0,
		"UZS": 0,
		"VND": 0,
		"VUV": 0,
		"XAF": 0,
		"XOF": 0,
		"XPF": 0,
		"YER": 0,
		"ZMK": 0,
		"ZWD": 0
	},
	"weekData-minDays": 1,
	"weekData-firstDay": 0,
	"weekData-weekendStart": 6,
	"weekData-weekendEnd": 0,
	"timeData": {
		"_allowed": "h hb H hB",
		"_preferred": "h"
	},
	"eras-gregorian": {
		"0": {
			"_end": "0-12-31"
		},
		"1": {
			"_start": "1-01-01"
		}
	},
	"eras-islamic": {
		"0": {
			"_start": "622-7-15"
		}
	},
	"eras-persian": {
		"0": {
			"_start": "622-01-01"
		}
	},
	"eras-japanese": {
		"232": {
			"_start": "1868-9-8"
		},
		"233": {
			"_start": "1912-7-30"
		},
		"234": {
			"_start": "1926-12-25"
		},
		"235": {
			"_start": "1989-1-8"
		}
	}
}