{
  "_version": "1.1.0",
  "resources": [
    {
      "name": ".library"
    },
    {
      "name": ".theming"
    },
    {
      "name": "AssociativeSplitter-dbg.js",
      "module": "sap/ui/layout/AssociativeSplitter.js",
      "isDebug": true,
      "required": [
        "sap/ui/layout/Splitter.js",
        "sap/ui/layout/SplitterRenderer.js"
      ]
    },
    {
      "name": "AssociativeSplitter.js",
      "module": "sap/ui/layout/AssociativeSplitter.js",
      "required": [
        "sap/ui/layout/Splitter.js",
        "sap/ui/layout/SplitterRenderer.js"
      ]
    },
    {
      "name": "BackgroundDesign.type",
      "designtime": true
    },
    {
      "name": "BlockBackgroundType.type",
      "designtime": true
    },
    {
      "name": "BlockLayout-dbg.js",
      "module": "sap/ui/layout/BlockLayout.js",
      "isDebug": true,
      "required": [
        "sap/ui/core/Control.js",
        "sap/ui/layout/library.js"
      ]
    },
    {
      "name": "BlockLayout.control",
      "designtime": true
    },
    {
      "name": "BlockLayout.js",
      "module": "sap/ui/layout/BlockLayout.js",
      "required": [
        "sap/ui/core/Control.js",
        "sap/ui/layout/library.js"
      ]
    },
    {
      "name": "BlockLayoutCell-dbg.js",
      "module": "sap/ui/layout/BlockLayoutCell.js",
      "isDebug": true,
      "required": [
        "sap/ui/core/Control.js",
        "sap/ui/layout/library.js"
      ]
    },
    {
      "name": "BlockLayoutCell.control",
      "designtime": true
    },
    {
      "name": "BlockLayoutCell.js",
      "module": "sap/ui/layout/BlockLayoutCell.js",
      "required": [
        "sap/ui/core/Control.js",
        "sap/ui/layout/library.js"
      ]
    },
    {
      "name": "BlockLayoutCellRenderer-dbg.js",
      "module": "sap/ui/layout/BlockLayoutCellRenderer.js",
      "isDebug": true,
      "required": [
        "jquery.sap.global.js",
        "sap/ui/layout/library.js"
      ]
    },
    {
      "name": "BlockLayoutCellRenderer.js",
      "module": "sap/ui/layout/BlockLayoutCellRenderer.js",
      "required": [
        "jquery.sap.global.js",
        "sap/ui/layout/library.js"
      ]
    },
    {
      "name": "BlockLayoutRenderer-dbg.js",
      "module": "sap/ui/layout/BlockLayoutRenderer.js",
      "isDebug": true,
      "required": [
        "sap/ui/layout/library.js"
      ]
    },
    {
      "name": "BlockLayoutRenderer.js",
      "module": "sap/ui/layout/BlockLayoutRenderer.js",
      "required": [
        "sap/ui/layout/library.js"
      ]
    },
    {
      "name": "BlockLayoutRow-dbg.js",
      "module": "sap/ui/layout/BlockLayoutRow.js",
      "isDebug": true,
      "required": [
        "jquery.sap.global.js",
        "sap/ui/core/Control.js",
        "sap/ui/layout/library.js"
      ]
    },
    {
      "name": "BlockLayoutRow.control",
      "designtime": true
    },
    {
      "name": "BlockLayoutRow.js",
      "module": "sap/ui/layout/BlockLayoutRow.js",
      "required": [
        "jquery.sap.global.js",
        "sap/ui/core/Control.js",
        "sap/ui/layout/library.js"
      ]
    },
    {
      "name": "BlockLayoutRowRenderer-dbg.js",
      "module": "sap/ui/layout/BlockLayoutRowRenderer.js",
      "isDebug": true,
      "required": [
        "jquery.sap.global.js",
        "sap/ui/layout/library.js"
      ]
    },
    {
      "name": "BlockLayoutRowRenderer.js",
      "module": "sap/ui/layout/BlockLayoutRowRenderer.js",
      "required": [
        "jquery.sap.global.js",
        "sap/ui/layout/library.js"
      ]
    },
    {
      "name": "BlockRowColorSets.type",
      "designtime": true
    },
    {
      "name": "DynamicSideContent-dbg.js",
      "module": "sap/ui/layout/DynamicSideContent.js",
      "isDebug": true,
      "required": [
        "jquery.sap.global.js",
        "sap/ui/core/Control.js",
        "sap/ui/core/ResizeHandler.js"
      ],
      "condRequired": [
        "sap/ui/core/delegate/ScrollEnablement.js"
      ]
    },
    {
      "name": "DynamicSideContent.js",
      "module": "sap/ui/layout/DynamicSideContent.js",
      "required": [
        "jquery.sap.global.js",
        "sap/ui/core/Control.js",
        "sap/ui/core/ResizeHandler.js"
      ],
      "condRequired": [
        "sap/ui/core/delegate/ScrollEnablement.js"
      ]
    },
    {
      "name": "DynamicSideContentRenderer-dbg.js",
      "module": "sap/ui/layout/DynamicSideContentRenderer.js",
      "isDebug": true
    },
    {
      "name": "DynamicSideContentRenderer.js",
      "module": "sap/ui/layout/DynamicSideContentRenderer.js"
    },
    {
      "name": "FixFlex-dbg.js",
      "module": "sap/ui/layout/FixFlex.js",
      "isDebug": true,
      "required": [
        "jquery.sap.global.js",
        "sap/ui/core/Control.js",
        "sap/ui/core/EnabledPropagator.js",
        "sap/ui/core/ResizeHandler.js",
        "sap/ui/layout/library.js",
        "sap/ui/core/delegate/ScrollEnablement.js"
      ]
    },
    {
      "name": "FixFlex.control",
      "designtime": true
    },
    {
      "name": "FixFlex.js",
      "module": "sap/ui/layout/FixFlex.js",
      "required": [
        "jquery.sap.global.js",
        "sap/ui/core/Control.js",
        "sap/ui/core/EnabledPropagator.js",
        "sap/ui/core/ResizeHandler.js",
        "sap/ui/layout/library.js",
        "sap/ui/core/delegate/ScrollEnablement.js"
      ]
    },
    {
      "name": "FixFlexRenderer-dbg.js",
      "module": "sap/ui/layout/FixFlexRenderer.js",
      "isDebug": true,
      "required": [
        "jquery.sap.global.js"
      ]
    },
    {
      "name": "FixFlexRenderer.js",
      "module": "sap/ui/layout/FixFlexRenderer.js",
      "required": [
        "jquery.sap.global.js"
      ]
    },
    {
      "name": "Grid-dbg.js",
      "module": "sap/ui/layout/Grid.js",
      "isDebug": true,
      "required": [
        "jquery.sap.global.js",
        "sap/ui/core/Control.js",
        "sap/ui/layout/library.js"
      ]
    },
    {
      "name": "Grid.control",
      "designtime": true
    },
    {
      "name": "Grid.js",
      "module": "sap/ui/layout/Grid.js",
      "required": [
        "jquery.sap.global.js",
        "sap/ui/core/Control.js",
        "sap/ui/layout/library.js"
      ]
    },
    {
      "name": "GridData-dbg.js",
      "module": "sap/ui/layout/GridData.js",
      "isDebug": true,
      "required": [
        "jquery.sap.global.js",
        "sap/ui/core/LayoutData.js",
        "sap/ui/layout/library.js"
      ]
    },
    {
      "name": "GridData.control",
      "designtime": true
    },
    {
      "name": "GridData.js",
      "module": "sap/ui/layout/GridData.js",
      "required": [
        "jquery.sap.global.js",
        "sap/ui/core/LayoutData.js",
        "sap/ui/layout/library.js"
      ]
    },
    {
      "name": "GridIndent.type",
      "designtime": true
    },
    {
      "name": "GridPosition.type",
      "designtime": true
    },
    {
      "name": "GridRenderer-dbg.js",
      "module": "sap/ui/layout/GridRenderer.js",
      "isDebug": true,
      "required": [
        "jquery.sap.global.js"
      ]
    },
    {
      "name": "GridRenderer.js",
      "module": "sap/ui/layout/GridRenderer.js",
      "required": [
        "jquery.sap.global.js"
      ]
    },
    {
      "name": "GridSpan.type",
      "designtime": true
    },
    {
      "name": "HorizontalLayout-dbg.js",
      "module": "sap/ui/layout/HorizontalLayout.js",
      "isDebug": true,
      "required": [
        "jquery.sap.global.js",
        "sap/ui/core/Control.js",
        "sap/ui/layout/library.js"
      ]
    },
    {
      "name": "HorizontalLayout.control",
      "designtime": true
    },
    {
      "name": "HorizontalLayout.designtime-dbg.js",
      "module": "sap/ui/layout/HorizontalLayout.designtime.js",
      "isDebug": true
    },
    {
      "name": "HorizontalLayout.designtime.js",
      "module": "sap/ui/layout/HorizontalLayout.designtime.js",
      "designtime": true
    },
    {
      "name": "HorizontalLayout.js",
      "module": "sap/ui/layout/HorizontalLayout.js",
      "required": [
        "jquery.sap.global.js",
        "sap/ui/core/Control.js",
        "sap/ui/layout/library.js"
      ]
    },
    {
      "name": "HorizontalLayoutRenderer-dbg.js",
      "module": "sap/ui/layout/HorizontalLayoutRenderer.js",
      "isDebug": true,
      "required": [
        "jquery.sap.global.js"
      ]
    },
    {
      "name": "HorizontalLayoutRenderer.js",
      "module": "sap/ui/layout/HorizontalLayoutRenderer.js",
      "required": [
        "jquery.sap.global.js"
      ]
    },
    {
      "name": "PaneContainer-dbg.js",
      "module": "sap/ui/layout/PaneContainer.js",
      "isDebug": true,
      "required": [
        "jquery.sap.global.js",
        "sap/ui/layout/library.js",
        "sap/ui/core/Element.js",
        "sap/ui/layout/Splitter.js",
        "sap/ui/layout/AssociativeSplitter.js"
      ]
    },
    {
      "name": "PaneContainer.js",
      "module": "sap/ui/layout/PaneContainer.js",
      "required": [
        "jquery.sap.global.js",
        "sap/ui/layout/library.js",
        "sap/ui/core/Element.js",
        "sap/ui/layout/Splitter.js",
        "sap/ui/layout/AssociativeSplitter.js"
      ]
    },
    {
      "name": "ResponsiveFlowLayout-dbg.js",
      "module": "sap/ui/layout/ResponsiveFlowLayout.js",
      "isDebug": true,
      "required": [
        "jquery.sap.global.js",
        "sap/ui/core/Control.js",
        "sap/ui/core/IntervalTrigger.js",
        "sap/ui/core/theming/Parameters.js",
        "sap/ui/layout/ResponsiveFlowLayoutData.js",
        "sap/ui/layout/library.js"
      ]
    },
    {
      "name": "ResponsiveFlowLayout.control",
      "designtime": true
    },
    {
      "name": "ResponsiveFlowLayout.js",
      "module": "sap/ui/layout/ResponsiveFlowLayout.js",
      "required": [
        "jquery.sap.global.js",
        "sap/ui/core/Control.js",
        "sap/ui/core/IntervalTrigger.js",
        "sap/ui/core/theming/Parameters.js",
        "sap/ui/layout/ResponsiveFlowLayoutData.js",
        "sap/ui/layout/library.js"
      ]
    },
    {
      "name": "ResponsiveFlowLayoutData-dbg.js",
      "module": "sap/ui/layout/ResponsiveFlowLayoutData.js",
      "isDebug": true,
      "required": [
        "jquery.sap.global.js",
        "sap/ui/core/LayoutData.js",
        "sap/ui/layout/library.js"
      ]
    },
    {
      "name": "ResponsiveFlowLayoutData.control",
      "designtime": true
    },
    {
      "name": "ResponsiveFlowLayoutData.js",
      "module": "sap/ui/layout/ResponsiveFlowLayoutData.js",
      "required": [
        "jquery.sap.global.js",
        "sap/ui/core/LayoutData.js",
        "sap/ui/layout/library.js"
      ]
    },
    {
      "name": "ResponsiveFlowLayoutRenderer-dbg.js",
      "module": "sap/ui/layout/ResponsiveFlowLayoutRenderer.js",
      "isDebug": true,
      "required": [
        "jquery.sap.global.js"
      ]
    },
    {
      "name": "ResponsiveFlowLayoutRenderer.js",
      "module": "sap/ui/layout/ResponsiveFlowLayoutRenderer.js",
      "required": [
        "jquery.sap.global.js"
      ]
    },
    {
      "name": "ResponsiveSplitter-dbg.js",
      "module": "sap/ui/layout/ResponsiveSplitter.js",
      "isDebug": true,
      "required": [
        "jquery.sap.global.js",
        "sap/ui/layout/library.js",
        "sap/ui/core/Control.js",
        "sap/ui/layout/ResponsiveSplitterUtilities.js",
        "sap/ui/layout/ResponsiveSplitterPage.js",
        "sap/ui/layout/PaneContainer.js",
        "sap/ui/layout/SplitPane.js",
        "sap/ui/core/delegate/ItemNavigation.js"
      ]
    },
    {
      "name": "ResponsiveSplitter.js",
      "module": "sap/ui/layout/ResponsiveSplitter.js",
      "required": [
        "jquery.sap.global.js",
        "sap/ui/layout/library.js",
        "sap/ui/core/Control.js",
        "sap/ui/layout/ResponsiveSplitterUtilities.js",
        "sap/ui/layout/ResponsiveSplitterPage.js",
        "sap/ui/layout/PaneContainer.js",
        "sap/ui/layout/SplitPane.js",
        "sap/ui/core/delegate/ItemNavigation.js"
      ]
    },
    {
      "name": "ResponsiveSplitterPage-dbg.js",
      "module": "sap/ui/layout/ResponsiveSplitterPage.js",
      "isDebug": true,
      "required": [
        "jquery.sap.global.js",
        "sap/ui/layout/library.js",
        "sap/ui/core/Control.js"
      ]
    },
    {
      "name": "ResponsiveSplitterPage.js",
      "module": "sap/ui/layout/ResponsiveSplitterPage.js",
      "required": [
        "jquery.sap.global.js",
        "sap/ui/layout/library.js",
        "sap/ui/core/Control.js"
      ]
    },
    {
      "name": "ResponsiveSplitterRenderer-dbg.js",
      "module": "sap/ui/layout/ResponsiveSplitterRenderer.js",
      "isDebug": true,
      "required": [
        "sap/ui/core/IconPool.js"
      ]
    },
    {
      "name": "ResponsiveSplitterRenderer.js",
      "module": "sap/ui/layout/ResponsiveSplitterRenderer.js",
      "required": [
        "sap/ui/core/IconPool.js"
      ]
    },
    {
      "name": "ResponsiveSplitterUtilities-dbg.js",
      "module": "sap/ui/layout/ResponsiveSplitterUtilities.js",
      "isDebug": true,
      "required": [
        "jquery.sap.global.js",
        "sap/ui/core/Control.js"
      ]
    },
    {
      "name": "ResponsiveSplitterUtilities.js",
      "module": "sap/ui/layout/ResponsiveSplitterUtilities.js",
      "required": [
        "jquery.sap.global.js",
        "sap/ui/core/Control.js"
      ]
    },
    {
      "name": "SideContentFallDown.type",
      "designtime": true
    },
    {
      "name": "SideContentPosition.type",
      "designtime": true
    },
    {
      "name": "SideContentVisibility.type",
      "designtime": true
    },
    {
      "name": "SplitPane-dbg.js",
      "module": "sap/ui/layout/SplitPane.js",
      "isDebug": true,
      "required": [
        "jquery.sap.global.js",
        "sap/ui/layout/library.js",
        "sap/ui/core/Element.js"
      ]
    },
    {
      "name": "SplitPane.js",
      "module": "sap/ui/layout/SplitPane.js",
      "required": [
        "jquery.sap.global.js",
        "sap/ui/layout/library.js",
        "sap/ui/core/Element.js"
      ]
    },
    {
      "name": "Splitter-dbg.js",
      "module": "sap/ui/layout/Splitter.js",
      "isDebug": true,
      "required": [
        "jquery.sap.global.js",
        "sap/ui/core/Control.js",
        "sap/ui/layout/library.js"
      ]
    },
    {
      "name": "Splitter.control",
      "designtime": true
    },
    {
      "name": "Splitter.js",
      "module": "sap/ui/layout/Splitter.js",
      "required": [
        "jquery.sap.global.js",
        "sap/ui/core/Control.js",
        "sap/ui/layout/library.js"
      ]
    },
    {
      "name": "SplitterLayoutData-dbg.js",
      "module": "sap/ui/layout/SplitterLayoutData.js",
      "isDebug": true,
      "required": [
        "jquery.sap.global.js",
        "sap/ui/core/LayoutData.js",
        "sap/ui/layout/library.js"
      ]
    },
    {
      "name": "SplitterLayoutData.control",
      "designtime": true
    },
    {
      "name": "SplitterLayoutData.js",
      "module": "sap/ui/layout/SplitterLayoutData.js",
      "required": [
        "jquery.sap.global.js",
        "sap/ui/core/LayoutData.js",
        "sap/ui/layout/library.js"
      ]
    },
    {
      "name": "SplitterRenderer-dbg.js",
      "module": "sap/ui/layout/SplitterRenderer.js",
      "isDebug": true,
      "required": [
        "jquery.sap.global.js"
      ]
    },
    {
      "name": "SplitterRenderer.js",
      "module": "sap/ui/layout/SplitterRenderer.js",
      "required": [
        "jquery.sap.global.js"
      ]
    },
    {
      "name": "VerticalLayout-dbg.js",
      "module": "sap/ui/layout/VerticalLayout.js",
      "isDebug": true,
      "required": [
        "jquery.sap.global.js",
        "sap/ui/core/Control.js",
        "sap/ui/core/EnabledPropagator.js",
        "sap/ui/layout/library.js"
      ]
    },
    {
      "name": "VerticalLayout.control",
      "designtime": true
    },
    {
      "name": "VerticalLayout.designtime-dbg.js",
      "module": "sap/ui/layout/VerticalLayout.designtime.js",
      "isDebug": true
    },
    {
      "name": "VerticalLayout.designtime.js",
      "module": "sap/ui/layout/VerticalLayout.designtime.js",
      "designtime": true
    },
    {
      "name": "VerticalLayout.js",
      "module": "sap/ui/layout/VerticalLayout.js",
      "required": [
        "jquery.sap.global.js",
        "sap/ui/core/Control.js",
        "sap/ui/core/EnabledPropagator.js",
        "sap/ui/layout/library.js"
      ]
    },
    {
      "name": "VerticalLayoutRenderer-dbg.js",
      "module": "sap/ui/layout/VerticalLayoutRenderer.js",
      "isDebug": true,
      "required": [
        "jquery.sap.global.js"
      ]
    },
    {
      "name": "VerticalLayoutRenderer.js",
      "module": "sap/ui/layout/VerticalLayoutRenderer.js",
      "required": [
        "jquery.sap.global.js"
      ]
    },
    {
      "name": "changeHandler/AddSimpleFormGroup-dbg.js",
      "module": "sap/ui/layout/changeHandler/AddSimpleFormGroup.js",
      "isDebug": true,
      "required": [
        "sap/ui/fl/Utils.js",
        "jquery.sap.global.js",
        "sap/ui/fl/changeHandler/Base.js",
        "sap/ui/fl/changeHandler/JsControlTreeModifier.js"
      ]
    },
    {
      "name": "changeHandler/AddSimpleFormGroup.js",
      "module": "sap/ui/layout/changeHandler/AddSimpleFormGroup.js",
      "required": [
        "sap/ui/fl/Utils.js",
        "jquery.sap.global.js",
        "sap/ui/fl/changeHandler/Base.js",
        "sap/ui/fl/changeHandler/JsControlTreeModifier.js"
      ]
    },
    {
      "name": "changeHandler/HideSimpleForm-dbg.js",
      "module": "sap/ui/layout/changeHandler/HideSimpleForm.js",
      "isDebug": true,
      "required": [
        "jquery.sap.global.js",
        "sap/ui/fl/changeHandler/JsControlTreeModifier.js"
      ]
    },
    {
      "name": "changeHandler/HideSimpleForm.js",
      "module": "sap/ui/layout/changeHandler/HideSimpleForm.js",
      "required": [
        "jquery.sap.global.js",
        "sap/ui/fl/changeHandler/JsControlTreeModifier.js"
      ]
    },
    {
      "name": "changeHandler/MoveSimpleForm-dbg.js",
      "module": "sap/ui/layout/changeHandler/MoveSimpleForm.js",
      "isDebug": true,
      "required": [
        "jquery.sap.global.js",
        "sap/ui/fl/changeHandler/JsControlTreeModifier.js",
        "sap/ui/fl/Utils.js"
      ]
    },
    {
      "name": "changeHandler/MoveSimpleForm.js",
      "module": "sap/ui/layout/changeHandler/MoveSimpleForm.js",
      "required": [
        "jquery.sap.global.js",
        "sap/ui/fl/changeHandler/JsControlTreeModifier.js",
        "sap/ui/fl/Utils.js"
      ]
    },
    {
      "name": "changeHandler/RenameSimpleForm-dbg.js",
      "module": "sap/ui/layout/changeHandler/RenameSimpleForm.js",
      "isDebug": true,
      "required": [
        "jquery.sap.global.js",
        "sap/ui/fl/changeHandler/Base.js",
        "sap/ui/fl/changeHandler/JsControlTreeModifier.js",
        "sap/ui/fl/Utils.js"
      ]
    },
    {
      "name": "changeHandler/RenameSimpleForm.js",
      "module": "sap/ui/layout/changeHandler/RenameSimpleForm.js",
      "required": [
        "jquery.sap.global.js",
        "sap/ui/fl/changeHandler/Base.js",
        "sap/ui/fl/changeHandler/JsControlTreeModifier.js",
        "sap/ui/fl/Utils.js"
      ]
    },
    {
      "name": "changeHandler/UnhideSimpleForm-dbg.js",
      "module": "sap/ui/layout/changeHandler/UnhideSimpleForm.js",
      "isDebug": true,
      "required": [
        "jquery.sap.global.js",
        "sap/ui/fl/changeHandler/JsControlTreeModifier.js"
      ]
    },
    {
      "name": "changeHandler/UnhideSimpleForm.js",
      "module": "sap/ui/layout/changeHandler/UnhideSimpleForm.js",
      "required": [
        "jquery.sap.global.js",
        "sap/ui/fl/changeHandler/JsControlTreeModifier.js"
      ]
    },
    {
      "name": "form/Form-dbg.js",
      "module": "sap/ui/layout/form/Form.js",
      "isDebug": true,
      "required": [
        "jquery.sap.global.js",
        "sap/ui/core/Control.js",
        "sap/ui/layout/library.js"
      ]
    },
    {
      "name": "form/Form.control",
      "designtime": true
    },
    {
      "name": "form/Form.designtime-dbg.js",
      "module": "sap/ui/layout/form/Form.designtime.js",
      "isDebug": true
    },
    {
      "name": "form/Form.designtime.js",
      "module": "sap/ui/layout/form/Form.designtime.js",
      "designtime": true
    },
    {
      "name": "form/Form.js",
      "module": "sap/ui/layout/form/Form.js",
      "required": [
        "jquery.sap.global.js",
        "sap/ui/core/Control.js",
        "sap/ui/layout/library.js"
      ]
    },
    {
      "name": "form/FormContainer-dbg.js",
      "module": "sap/ui/layout/form/FormContainer.js",
      "isDebug": true,
      "required": [
        "jquery.sap.global.js",
        "sap/ui/core/Element.js",
        "sap/ui/core/EnabledPropagator.js",
        "sap/ui/core/theming/Parameters.js",
        "sap/ui/layout/library.js"
      ]
    },
    {
      "name": "form/FormContainer.control",
      "designtime": true
    },
    {
      "name": "form/FormContainer.designtime-dbg.js",
      "module": "sap/ui/layout/form/FormContainer.designtime.js",
      "isDebug": true
    },
    {
      "name": "form/FormContainer.designtime.js",
      "module": "sap/ui/layout/form/FormContainer.designtime.js",
      "designtime": true
    },
    {
      "name": "form/FormContainer.js",
      "module": "sap/ui/layout/form/FormContainer.js",
      "required": [
        "jquery.sap.global.js",
        "sap/ui/core/Element.js",
        "sap/ui/core/EnabledPropagator.js",
        "sap/ui/core/theming/Parameters.js",
        "sap/ui/layout/library.js"
      ]
    },
    {
      "name": "form/FormElement-dbg.js",
      "module": "sap/ui/layout/form/FormElement.js",
      "isDebug": true,
      "required": [
        "jquery.sap.global.js",
        "sap/ui/core/Element.js",
        "sap/ui/core/EnabledPropagator.js",
        "sap/ui/layout/library.js"
      ]
    },
    {
      "name": "form/FormElement.control",
      "designtime": true
    },
    {
      "name": "form/FormElement.js",
      "module": "sap/ui/layout/form/FormElement.js",
      "required": [
        "jquery.sap.global.js",
        "sap/ui/core/Element.js",
        "sap/ui/core/EnabledPropagator.js",
        "sap/ui/layout/library.js"
      ]
    },
    {
      "name": "form/FormLayout-dbg.js",
      "module": "sap/ui/layout/form/FormLayout.js",
      "isDebug": true,
      "required": [
        "jquery.sap.global.js",
        "sap/ui/core/Control.js",
        "sap/ui/layout/form/Form.js",
        "sap/ui/layout/library.js"
      ]
    },
    {
      "name": "form/FormLayout.control",
      "designtime": true
    },
    {
      "name": "form/FormLayout.js",
      "module": "sap/ui/layout/form/FormLayout.js",
      "required": [
        "jquery.sap.global.js",
        "sap/ui/core/Control.js",
        "sap/ui/layout/form/Form.js",
        "sap/ui/layout/library.js"
      ]
    },
    {
      "name": "form/FormLayoutRenderer-dbg.js",
      "module": "sap/ui/layout/form/FormLayoutRenderer.js",
      "isDebug": true,
      "required": [
        "jquery.sap.global.js"
      ]
    },
    {
      "name": "form/FormLayoutRenderer.js",
      "module": "sap/ui/layout/form/FormLayoutRenderer.js",
      "required": [
        "jquery.sap.global.js"
      ]
    },
    {
      "name": "form/FormRenderer-dbg.js",
      "module": "sap/ui/layout/form/FormRenderer.js",
      "isDebug": true,
      "required": [
        "jquery.sap.global.js"
      ]
    },
    {
      "name": "form/FormRenderer.js",
      "module": "sap/ui/layout/form/FormRenderer.js",
      "required": [
        "jquery.sap.global.js"
      ]
    },
    {
      "name": "form/GridContainerData-dbg.js",
      "module": "sap/ui/layout/form/GridContainerData.js",
      "isDebug": true,
      "required": [
        "jquery.sap.global.js",
        "sap/ui/core/LayoutData.js",
        "sap/ui/layout/library.js"
      ]
    },
    {
      "name": "form/GridContainerData.control",
      "designtime": true
    },
    {
      "name": "form/GridContainerData.js",
      "module": "sap/ui/layout/form/GridContainerData.js",
      "required": [
        "jquery.sap.global.js",
        "sap/ui/core/LayoutData.js",
        "sap/ui/layout/library.js"
      ]
    },
    {
      "name": "form/GridElementCells.type",
      "designtime": true
    },
    {
      "name": "form/GridElementData-dbg.js",
      "module": "sap/ui/layout/form/GridElementData.js",
      "isDebug": true,
      "required": [
        "jquery.sap.global.js",
        "sap/ui/core/LayoutData.js",
        "sap/ui/layout/library.js"
      ]
    },
    {
      "name": "form/GridElementData.control",
      "designtime": true
    },
    {
      "name": "form/GridElementData.js",
      "module": "sap/ui/layout/form/GridElementData.js",
      "required": [
        "jquery.sap.global.js",
        "sap/ui/core/LayoutData.js",
        "sap/ui/layout/library.js"
      ]
    },
    {
      "name": "form/GridLayout-dbg.js",
      "module": "sap/ui/layout/form/GridLayout.js",
      "isDebug": true,
      "required": [
        "jquery.sap.global.js",
        "sap/ui/layout/form/FormLayout.js",
        "sap/ui/layout/form/GridContainerData.js",
        "sap/ui/layout/form/GridElementData.js",
        "sap/ui/layout/library.js"
      ]
    },
    {
      "name": "form/GridLayout.control",
      "designtime": true
    },
    {
      "name": "form/GridLayout.js",
      "module": "sap/ui/layout/form/GridLayout.js",
      "required": [
        "jquery.sap.global.js",
        "sap/ui/layout/form/FormLayout.js",
        "sap/ui/layout/form/GridContainerData.js",
        "sap/ui/layout/form/GridElementData.js",
        "sap/ui/layout/library.js"
      ]
    },
    {
      "name": "form/GridLayoutRenderer-dbg.js",
      "module": "sap/ui/layout/form/GridLayoutRenderer.js",
      "isDebug": true,
      "required": [
        "jquery.sap.global.js",
        "sap/ui/core/Renderer.js",
        "sap/ui/layout/form/FormLayoutRenderer.js"
      ]
    },
    {
      "name": "form/GridLayoutRenderer.js",
      "module": "sap/ui/layout/form/GridLayoutRenderer.js",
      "required": [
        "jquery.sap.global.js",
        "sap/ui/core/Renderer.js",
        "sap/ui/layout/form/FormLayoutRenderer.js"
      ]
    },
    {
      "name": "form/ResponsiveGridLayout-dbg.js",
      "module": "sap/ui/layout/form/ResponsiveGridLayout.js",
      "isDebug": true,
      "required": [
        "jquery.sap.global.js",
        "sap/ui/layout/Grid.js",
        "sap/ui/layout/GridData.js",
        "sap/ui/layout/form/FormLayout.js",
        "sap/ui/layout/library.js"
      ]
    },
    {
      "name": "form/ResponsiveGridLayout.control",
      "designtime": true
    },
    {
      "name": "form/ResponsiveGridLayout.js",
      "module": "sap/ui/layout/form/ResponsiveGridLayout.js",
      "required": [
        "jquery.sap.global.js",
        "sap/ui/layout/Grid.js",
        "sap/ui/layout/GridData.js",
        "sap/ui/layout/form/FormLayout.js",
        "sap/ui/layout/library.js"
      ]
    },
    {
      "name": "form/ResponsiveGridLayoutRenderer-dbg.js",
      "module": "sap/ui/layout/form/ResponsiveGridLayoutRenderer.js",
      "isDebug": true,
      "required": [
        "jquery.sap.global.js",
        "sap/ui/core/Renderer.js",
        "sap/ui/layout/form/FormLayoutRenderer.js"
      ]
    },
    {
      "name": "form/ResponsiveGridLayoutRenderer.js",
      "module": "sap/ui/layout/form/ResponsiveGridLayoutRenderer.js",
      "required": [
        "jquery.sap.global.js",
        "sap/ui/core/Renderer.js",
        "sap/ui/layout/form/FormLayoutRenderer.js"
      ]
    },
    {
      "name": "form/ResponsiveLayout-dbg.js",
      "module": "sap/ui/layout/form/ResponsiveLayout.js",
      "isDebug": true,
      "required": [
        "jquery.sap.global.js",
        "sap/ui/layout/ResponsiveFlowLayout.js",
        "sap/ui/layout/ResponsiveFlowLayoutData.js",
        "sap/ui/layout/form/FormLayout.js",
        "sap/ui/layout/library.js"
      ]
    },
    {
      "name": "form/ResponsiveLayout.control",
      "designtime": true
    },
    {
      "name": "form/ResponsiveLayout.js",
      "module": "sap/ui/layout/form/ResponsiveLayout.js",
      "required": [
        "jquery.sap.global.js",
        "sap/ui/layout/ResponsiveFlowLayout.js",
        "sap/ui/layout/ResponsiveFlowLayoutData.js",
        "sap/ui/layout/form/FormLayout.js",
        "sap/ui/layout/library.js"
      ]
    },
    {
      "name": "form/ResponsiveLayoutRenderer-dbg.js",
      "module": "sap/ui/layout/form/ResponsiveLayoutRenderer.js",
      "isDebug": true,
      "required": [
        "jquery.sap.global.js",
        "sap/ui/core/Renderer.js",
        "sap/ui/layout/form/FormLayoutRenderer.js"
      ]
    },
    {
      "name": "form/ResponsiveLayoutRenderer.js",
      "module": "sap/ui/layout/form/ResponsiveLayoutRenderer.js",
      "required": [
        "jquery.sap.global.js",
        "sap/ui/core/Renderer.js",
        "sap/ui/layout/form/FormLayoutRenderer.js"
      ]
    },
    {
      "name": "form/SimpleForm-dbg.js",
      "module": "sap/ui/layout/form/SimpleForm.js",
      "isDebug": true,
      "required": [
        "jquery.sap.global.js",
        "sap/ui/core/Control.js",
        "sap/ui/layout/ResponsiveFlowLayoutData.js",
        "sap/ui/layout/form/Form.js",
        "sap/ui/layout/form/FormContainer.js",
        "sap/ui/layout/form/FormElement.js",
        "sap/ui/layout/form/FormLayout.js",
        "sap/ui/layout/library.js"
      ],
      "condRequired": [
        "sap/ui/layout/form/ResponsiveLayout.js",
        "sap/ui/layout/form/GridLayout.js",
        "sap/ui/layout/form/GridContainerData.js",
        "sap/ui/layout/form/GridElementData.js",
        "sap/ui/layout/form/ResponsiveGridLayout.js",
        "sap/ui/layout/GridData.js"
      ]
    },
    {
      "name": "form/SimpleForm.control",
      "designtime": true
    },
    {
      "name": "form/SimpleForm.designtime-dbg.js",
      "module": "sap/ui/layout/form/SimpleForm.designtime.js",
      "isDebug": true
    },
    {
      "name": "form/SimpleForm.designtime.js",
      "module": "sap/ui/layout/form/SimpleForm.designtime.js",
      "designtime": true
    },
    {
      "name": "form/SimpleForm.js",
      "module": "sap/ui/layout/form/SimpleForm.js",
      "required": [
        "jquery.sap.global.js",
        "sap/ui/core/Control.js",
        "sap/ui/layout/ResponsiveFlowLayoutData.js",
        "sap/ui/layout/form/Form.js",
        "sap/ui/layout/form/FormContainer.js",
        "sap/ui/layout/form/FormElement.js",
        "sap/ui/layout/form/FormLayout.js",
        "sap/ui/layout/library.js"
      ],
      "condRequired": [
        "sap/ui/layout/form/ResponsiveLayout.js",
        "sap/ui/layout/form/GridLayout.js",
        "sap/ui/layout/form/GridContainerData.js",
        "sap/ui/layout/form/GridElementData.js",
        "sap/ui/layout/form/ResponsiveGridLayout.js",
        "sap/ui/layout/GridData.js"
      ]
    },
    {
      "name": "form/SimpleFormLayout.type",
      "designtime": true
    },
    {
      "name": "form/SimpleFormRenderer-dbg.js",
      "module": "sap/ui/layout/form/SimpleFormRenderer.js",
      "isDebug": true,
      "required": [
        "jquery.sap.global.js"
      ]
    },
    {
      "name": "form/SimpleFormRenderer.js",
      "module": "sap/ui/layout/form/SimpleFormRenderer.js",
      "required": [
        "jquery.sap.global.js"
      ]
    },
    {
      "name": "library-all-dbg.js",
      "isDebug": true,
      "merged": true
    },
    {
      "name": "library-all.js",
      "merged": true
    },
    {
      "name": "library-dbg.js",
      "module": "sap/ui/layout/library.js",
      "isDebug": true,
      "required": [
        "jquery.sap.global.js",
        "sap/ui/base/DataType.js",
        "sap/ui/core/library.js"
      ]
    },
    {
      "name": "library-preload.js",
      "merged": true
    },
    {
      "name": "library-preload.js.map"
    },
    {
      "name": "library-preload.json",
      "merged": true
    },
    {
      "name": "library.dependencies.json"
    },
    {
      "name": "library.dependencies.xml"
    },
    {
      "name": "library.js",
      "module": "sap/ui/layout/library.js",
      "required": [
        "jquery.sap.global.js",
        "sap/ui/base/DataType.js",
        "sap/ui/core/library.js"
      ]
    },
    {
      "name": "library.templates.xml"
    },
    {
      "name": "manifest.json",
      "module": "sap/ui/layout/manifest.json"
    },
    {
      "name": "messagebundle.properties",
      "module": "sap/ui/layout/messagebundle.properties",
      "locale": "",
      "raw": "messagebundle.properties"
    },
    {
      "name": "messagebundle_ar.properties",
      "module": "sap/ui/layout/messagebundle_ar.properties",
      "locale": "ar",
      "raw": "messagebundle.properties"
    },
    {
      "name": "messagebundle_bg.properties",
      "module": "sap/ui/layout/messagebundle_bg.properties",
      "locale": "bg",
      "raw": "messagebundle.properties"
    },
    {
      "name": "messagebundle_ca.properties",
      "module": "sap/ui/layout/messagebundle_ca.properties",
      "locale": "ca",
      "raw": "messagebundle.properties"
    },
    {
      "name": "messagebundle_cs.properties",
      "module": "sap/ui/layout/messagebundle_cs.properties",
      "locale": "cs",
      "raw": "messagebundle.properties"
    },
    {
      "name": "messagebundle_da.properties",
      "module": "sap/ui/layout/messagebundle_da.properties",
      "locale": "da",
      "raw": "messagebundle.properties"
    },
    {
      "name": "messagebundle_de.properties",
      "module": "sap/ui/layout/messagebundle_de.properties",
      "locale": "de",
      "raw": "messagebundle.properties"
    },
    {
      "name": "messagebundle_el.properties",
      "module": "sap/ui/layout/messagebundle_el.properties",
      "locale": "el",
      "raw": "messagebundle.properties"
    },
    {
      "name": "messagebundle_en.properties",
      "module": "sap/ui/layout/messagebundle_en.properties",
      "locale": "en",
      "raw": "messagebundle.properties"
    },
    {
      "name": "messagebundle_en_US_sappsd.properties",
      "module": "sap/ui/layout/messagebundle_en_US_sappsd.properties",
      "locale": "en_US_sappsd",
      "raw": "messagebundle.properties"
    },
    {
      "name": "messagebundle_en_US_saptrc.properties",
      "module": "sap/ui/layout/messagebundle_en_US_saptrc.properties",
      "locale": "en_US_saptrc",
      "raw": "messagebundle.properties"
    },
    {
      "name": "messagebundle_es.properties",
      "module": "sap/ui/layout/messagebundle_es.properties",
      "locale": "es",
      "raw": "messagebundle.properties"
    },
    {
      "name": "messagebundle_et.properties",
      "module": "sap/ui/layout/messagebundle_et.properties",
      "locale": "et",
      "raw": "messagebundle.properties"
    },
    {
      "name": "messagebundle_fi.properties",
      "module": "sap/ui/layout/messagebundle_fi.properties",
      "locale": "fi",
      "raw": "messagebundle.properties"
    },
    {
      "name": "messagebundle_fr.properties",
      "module": "sap/ui/layout/messagebundle_fr.properties",
      "locale": "fr",
      "raw": "messagebundle.properties"
    },
    {
      "name": "messagebundle_hi.properties",
      "module": "sap/ui/layout/messagebundle_hi.properties",
      "locale": "hi",
      "raw": "messagebundle.properties"
    },
    {
      "name": "messagebundle_hr.properties",
      "module": "sap/ui/layout/messagebundle_hr.properties",
      "locale": "hr",
      "raw": "messagebundle.properties"
    },
    {
      "name": "messagebundle_hu.properties",
      "module": "sap/ui/layout/messagebundle_hu.properties",
      "locale": "hu",
      "raw": "messagebundle.properties"
    },
    {
      "name": "messagebundle_it.properties",
      "module": "sap/ui/layout/messagebundle_it.properties",
      "locale": "it",
      "raw": "messagebundle.properties"
    },
    {
      "name": "messagebundle_iw.properties",
      "module": "sap/ui/layout/messagebundle_iw.properties",
      "locale": "iw",
      "raw": "messagebundle.properties"
    },
    {
      "name": "messagebundle_ja.properties",
      "module": "sap/ui/layout/messagebundle_ja.properties",
      "locale": "ja",
      "raw": "messagebundle.properties"
    },
    {
      "name": "messagebundle_kk.properties",
      "module": "sap/ui/layout/messagebundle_kk.properties",
      "locale": "kk",
      "raw": "messagebundle.properties"
    },
    {
      "name": "messagebundle_ko.properties",
      "module": "sap/ui/layout/messagebundle_ko.properties",
      "locale": "ko",
      "raw": "messagebundle.properties"
    },
    {
      "name": "messagebundle_lt.properties",
      "module": "sap/ui/layout/messagebundle_lt.properties",
      "locale": "lt",
      "raw": "messagebundle.properties"
    },
    {
      "name": "messagebundle_lv.properties",
      "module": "sap/ui/layout/messagebundle_lv.properties",
      "locale": "lv",
      "raw": "messagebundle.properties"
    },
    {
      "name": "messagebundle_ms.properties",
      "module": "sap/ui/layout/messagebundle_ms.properties",
      "locale": "ms",
      "raw": "messagebundle.properties"
    },
    {
      "name": "messagebundle_nl.properties",
      "module": "sap/ui/layout/messagebundle_nl.properties",
      "locale": "nl",
      "raw": "messagebundle.properties"
    },
    {
      "name": "messagebundle_no.properties",
      "module": "sap/ui/layout/messagebundle_no.properties",
      "locale": "no",
      "raw": "messagebundle.properties"
    },
    {
      "name": "messagebundle_pl.properties",
      "module": "sap/ui/layout/messagebundle_pl.properties",
      "locale": "pl",
      "raw": "messagebundle.properties"
    },
    {
      "name": "messagebundle_pt.properties",
      "module": "sap/ui/layout/messagebundle_pt.properties",
      "locale": "pt",
      "raw": "messagebundle.properties"
    },
    {
      "name": "messagebundle_ro.properties",
      "module": "sap/ui/layout/messagebundle_ro.properties",
      "locale": "ro",
      "raw": "messagebundle.properties"
    },
    {
      "name": "messagebundle_ru.properties",
      "module": "sap/ui/layout/messagebundle_ru.properties",
      "locale": "ru",
      "raw": "messagebundle.properties"
    },
    {
      "name": "messagebundle_sh.properties",
      "module": "sap/ui/layout/messagebundle_sh.properties",
      "locale": "sh",
      "raw": "messagebundle.properties"
    },
    {
      "name": "messagebundle_sk.properties",
      "module": "sap/ui/layout/messagebundle_sk.properties",
      "locale": "sk",
      "raw": "messagebundle.properties"
    },
    {
      "name": "messagebundle_sl.properties",
      "module": "sap/ui/layout/messagebundle_sl.properties",
      "locale": "sl",
      "raw": "messagebundle.properties"
    },
    {
      "name": "messagebundle_sv.properties",
      "module": "sap/ui/layout/messagebundle_sv.properties",
      "locale": "sv",
      "raw": "messagebundle.properties"
    },
    {
      "name": "messagebundle_th.properties",
      "module": "sap/ui/layout/messagebundle_th.properties",
      "locale": "th",
      "raw": "messagebundle.properties"
    },
    {
      "name": "messagebundle_tr.properties",
      "module": "sap/ui/layout/messagebundle_tr.properties",
      "locale": "tr",
      "raw": "messagebundle.properties"
    },
    {
      "name": "messagebundle_uk.properties",
      "module": "sap/ui/layout/messagebundle_uk.properties",
      "locale": "uk",
      "raw": "messagebundle.properties"
    },
    {
      "name": "messagebundle_vi.properties",
      "module": "sap/ui/layout/messagebundle_vi.properties",
      "locale": "vi",
      "raw": "messagebundle.properties"
    },
    {
      "name": "messagebundle_zh_CN.properties",
      "module": "sap/ui/layout/messagebundle_zh_CN.properties",
      "locale": "zh_CN",
      "raw": "messagebundle.properties"
    },
    {
      "name": "messagebundle_zh_TW.properties",
      "module": "sap/ui/layout/messagebundle_zh_TW.properties",
      "locale": "zh_TW",
      "raw": "messagebundle.properties"
    },
    {
      "name": "resources.json"
    },
    {
      "name": "themes/base/.theming",
      "theme": "base"
    },
    {
      "name": "themes/base/BlockLayout.less",
      "designtime": true,
      "theme": "base"
    },
    {
      "name": "themes/base/BlockLayoutCell.less",
      "designtime": true,
      "theme": "base"
    },
    {
      "name": "themes/base/BlockLayoutRow.less",
      "designtime": true,
      "theme": "base"
    },
    {
      "name": "themes/base/DynamicSideContent.less",
      "designtime": true,
      "theme": "base"
    },
    {
      "name": "themes/base/FixFlex.less",
      "designtime": true,
      "theme": "base"
    },
    {
      "name": "themes/base/Form.less",
      "designtime": true,
      "theme": "base"
    },
    {
      "name": "themes/base/FormLayout.less",
      "designtime": true,
      "theme": "base"
    },
    {
      "name": "themes/base/Grid.less",
      "designtime": true,
      "theme": "base"
    },
    {
      "name": "themes/base/GridLayout.less",
      "designtime": true,
      "theme": "base"
    },
    {
      "name": "themes/base/HorizontalLayout.less",
      "designtime": true,
      "theme": "base"
    },
    {
      "name": "themes/base/ResponsiveFlowLayout.less",
      "designtime": true,
      "theme": "base"
    },
    {
      "name": "themes/base/ResponsiveGridLayout.less",
      "designtime": true,
      "theme": "base"
    },
    {
      "name": "themes/base/ResponsiveLayout.less",
      "designtime": true,
      "theme": "base"
    },
    {
      "name": "themes/base/ResponsiveSplitter.less",
      "designtime": true,
      "theme": "base"
    },
    {
      "name": "themes/base/SimpleForm.less",
      "designtime": true,
      "theme": "base"
    },
    {
      "name": "themes/base/Splitter.less",
      "designtime": true,
      "theme": "base"
    },
    {
      "name": "themes/base/VerticalLayout.less",
      "designtime": true,
      "theme": "base"
    },
    {
      "name": "themes/base/img/create.txt",
      "theme": "base"
    },
    {
      "name": "themes/base/library-RTL-dbg.css",
      "isDebug": true,
      "theme": "base"
    },
    {
      "name": "themes/base/library-RTL.css",
      "theme": "base"
    },
    {
      "name": "themes/base/library-dbg.css",
      "isDebug": true,
      "theme": "base"
    },
    {
      "name": "themes/base/library-parameters.json",
      "theme": "base"
    },
    {
      "name": "themes/base/library.css",
      "theme": "base"
    },
    {
      "name": "themes/base/library.less",
      "designtime": true,
      "theme": "base"
    },
    {
      "name": "themes/base/library.source.less",
      "designtime": true,
      "theme": "base"
    },
    {
      "name": "themes/sap_hcb/.theming",
      "theme": "sap_hcb"
    },
    {
      "name": "themes/sap_hcb/Form.less",
      "designtime": true,
      "theme": "sap_hcb"
    },
    {
      "name": "themes/sap_hcb/FormLayout.less",
      "designtime": true,
      "theme": "sap_hcb"
    },
    {
      "name": "themes/sap_hcb/GridLayout.less",
      "designtime": true,
      "theme": "sap_hcb"
    },
    {
      "name": "themes/sap_hcb/ResponsiveFlowLayout.less",
      "designtime": true,
      "theme": "sap_hcb"
    },
    {
      "name": "themes/sap_hcb/ResponsiveGridLayout.less",
      "designtime": true,
      "theme": "sap_hcb"
    },
    {
      "name": "themes/sap_hcb/ResponsiveLayout.less",
      "designtime": true,
      "theme": "sap_hcb"
    },
    {
      "name": "themes/sap_hcb/ResponsiveSplitter.less",
      "designtime": true,
      "theme": "sap_hcb"
    },
    {
      "name": "themes/sap_hcb/SimpleForm.less",
      "designtime": true,
      "theme": "sap_hcb"
    },
    {
      "name": "themes/sap_hcb/Splitter.less",
      "designtime": true,
      "theme": "sap_hcb"
    },
    {
      "name": "themes/sap_hcb/library-RTL-dbg.css",
      "isDebug": true,
      "theme": "sap_hcb"
    },
    {
      "name": "themes/sap_hcb/library-RTL.css",
      "theme": "sap_hcb"
    },
    {
      "name": "themes/sap_hcb/library-dbg.css",
      "isDebug": true,
      "theme": "sap_hcb"
    },
    {
      "name": "themes/sap_hcb/library-parameters.json",
      "theme": "sap_hcb"
    },
    {
      "name": "themes/sap_hcb/library.css",
      "theme": "sap_hcb"
    },
    {
      "name": "themes/sap_hcb/library.less",
      "designtime": true,
      "theme": "sap_hcb"
    },
    {
      "name": "themes/sap_hcb/library.source.less",
      "designtime": true,
      "theme": "sap_hcb"
    }
  ]
}