{
	"__license": "This file has been derived from Unicode Common Locale Data Repository (CLDR) files (http://cldr.unicode.org). See the copyright and permission notice in the Unicode-Data-Files-LICENSE.txt available at the same location as this file or visit http://www.unicode.org/copyright.html",
	"languages": {
		"aa": "الأفارية",
		"ab": "الأبخازية",
		"ace": "الأتشينيزية",
		"ach": "الأكولية",
		"ada": "الأدانجمية",
		"ady": "الأديغة",
		"ae": "الأفستية",
		"aeb": "aeb",
		"af": "الأفريقانية",
		"afh": "الأفريهيلية",
		"agq": "الأغم",
		"ain": "الآينوية",
		"ak": "الأكانية",
		"akk": "الأكادية",
		"akz": "akz",
		"ale": "الأليوتية",
		"aln": "aln",
		"alt": "الألطائية الجنوبية",
		"am": "الأمهرية",
		"an": "الأراغونية",
		"ang": "الإنجليزية القديمة",
		"anp": "الأنجيكا",
		"ar": "العربية",
		"ar_001": "العربية الرسمية الحديثة",
		"arc": "الآرامية",
		"arn": "الأروكانية",
		"aro": "aro",
		"arp": "الأراباهو",
		"arq": "arq",
		"arw": "الأراواكية",
		"ary": "ary",
		"arz": "arz",
		"as": "الأسامية",
		"asa": "الآسو",
		"ase": "ase",
		"ast": "الأسترية",
		"av": "الأوارية",
		"avk": "avk",
		"awa": "الأوادية",
		"ay": "الأيمارا",
		"az": "الأذربيجانية",
		"az_alt-short": "الأذرية",
		"ba": "الباشكيرية",
		"bal": "البلوشية",
		"ban": "اللغة البالية",
		"bar": "bar",
		"bas": "الباسا",
		"bax": "بامن",
		"bbc": "bbc",
		"bbj": "لغة الغومالا",
		"be": "البيلاروسية",
		"bej": "البيجا",
		"bem": "البيمبا",
		"bew": "bew",
		"bez": "بينا",
		"bfd": "لغة البافوت",
		"bfq": "bfq",
		"bg": "البلغارية",
		"bgn": "البلوشية الغربية",
		"bho": "البهوجبورية",
		"bi": "البيسلامية",
		"bik": "البيكولية",
		"bin": "البينية",
		"bjn": "bjn",
		"bkm": "لغة الكوم",
		"bla": "السيكسيكية",
		"bm": "البامبارا",
		"bn": "البنغالية",
		"bo": "التبتية",
		"bpy": "bpy",
		"bqi": "bqi",
		"br": "البريتونية",
		"bra": "البراجية",
		"brh": "brh",
		"brx": "البودو",
		"bs": "البوسنية",
		"bss": "أكوس",
		"bua": "البرياتية",
		"bug": "البجينيزية",
		"bum": "لغة البولو",
		"byn": "البلينية",
		"byv": "لغة الميدومبا",
		"ca": "الكتالانية",
		"cad": "الكادو",
		"car": "الكاريبية",
		"cay": "الكايوجية",
		"cch": "الأتسام",
		"ce": "الشيشانية",
		"ceb": "السيبونية",
		"cgg": "تشيغا",
		"ch": "التشامورو",
		"chb": "التشيبشا",
		"chg": "التشاجاتاي",
		"chk": "التشكيزية",
		"chm": "الماري",
		"chn": "الشينوك جارجون",
		"cho": "الشوكتو",
		"chp": "الشيباوايان",
		"chr": "الشيروكي",
		"chy": "الشايان",
		"ckb": "السورانية الكردية",
		"co": "الكورسيكية",
		"cop": "القبطية",
		"cps": "cps",
		"cr": "الكرى",
		"crh": "لغة تتار القرم",
		"cs": "التشيكية",
		"csb": "الكاشبايان",
		"cu": "سلافية كنسية",
		"cv": "التشوفاشي",
		"cy": "الولزية",
		"da": "الدانماركية",
		"dak": "الداكوتا",
		"dar": "الدارجوا",
		"dav": "تيتا",
		"de": "الألمانية",
		"de_AT": "الألمانية النمساوية",
		"de_CH": "الألمانية العليا السويسرية",
		"del": "الديلوير",
		"den": "السلافية",
		"dgr": "الدوجريب",
		"din": "الدنكا",
		"dje": "الزارمية",
		"doi": "الدوجرية",
		"dsb": "الصربية السفلى",
		"dtp": "dtp",
		"dua": "الديولا",
		"dum": "الهولندية الوسطى",
		"dv": "المالديفية",
		"dyo": "جولا فونيا",
		"dyu": "الدايلا",
		"dz": "الزونخاية",
		"dzg": "القرعانية",
		"ebu": "إمبو",
		"ee": "الإيوي",
		"efi": "الإفيك",
		"egl": "egl",
		"egy": "المصرية القديمة",
		"eka": "الإكاجك",
		"el": "اليونانية",
		"elx": "الإمايت",
		"en": "الإنجليزية",
		"en_AU": "الإنجليزية الأسترالية",
		"en_CA": "الإنجليزية الكندية",
		"en_GB": "الإنجليزية البريطانية",
		"en_GB-alt-short": "الإنجليزية المملكة المتحدة",
		"en_US": "الإنجليزية الأمريكية",
		"en_US-alt-short": "الإنجليزية الولايات المتحدة",
		"enm": "الإنجليزية الوسطى",
		"eo": "الإسبرانتو",
		"es": "الإسبانية",
		"es_419": "الإسبانية أمريكا اللاتينية",
		"es_ES": "الإسبانية الأوروبية",
		"es_MX": "الإسبانية المكسيكية",
		"esu": "esu",
		"et": "الإستونية",
		"eu": "لغة الباسك",
		"ewo": "الإيوندو",
		"ext": "ext",
		"fa": "الفارسية",
		"fan": "الفانج",
		"fat": "الفانتي",
		"ff": "الفلة",
		"fi": "الفنلندية",
		"fil": "الفلبينية",
		"fit": "fit",
		"fj": "الفيجية",
		"fo": "الفارويز",
		"fon": "الفون",
		"fr": "الفرنسية",
		"fr_CA": "الفرنسية الكندية",
		"fr_CH": "الفرنسية السويسرية",
		"frc": "frc",
		"frm": "الفرنسية الوسطى",
		"fro": "الفرنسية القديمة",
		"frp": "frp",
		"frr": "الفريزينية الشمالية",
		"frs": "الفريزينية الشرقية",
		"fur": "الفريلايان",
		"fy": "الفريزيان",
		"ga": "الأيرلندية",
		"gaa": "الجا",
		"gag": "الغاغوز",
		"gan": "gan",
		"gay": "الجايو",
		"gba": "الجبيا",
		"gbz": "gbz",
		"gd": "الغيلية الأسكتلندية",
		"gez": "الجعزية",
		"gil": "لغة أهل جبل طارق",
		"gl": "الجاليكية",
		"glk": "glk",
		"gmh": "الألمانية العليا الوسطى",
		"gn": "الجواراني",
		"goh": "الألمانية العليا القديمة",
		"gom": "gom",
		"gon": "الجندي",
		"gor": "الجورونتالو",
		"got": "القوطية",
		"grb": "الجريبو",
		"grc": "اليونانية القديمة",
		"gsw": "الألمانية السويسرية",
		"gu": "الغوجاراتية",
		"guc": "guc",
		"gur": "gur",
		"guz": "الغيزية",
		"gv": "المنكية",
		"gwi": "غوتشن",
		"ha": "الهوسا",
		"hai": "الهيدا",
		"hak": "hak",
		"haw": "لغة أهل الهاواي",
		"he": "العبرية",
		"hi": "الهندية",
		"hif": "hif",
		"hil": "الهيليجينون",
		"hit": "الحثية",
		"hmn": "الهمونجية",
		"ho": "الهيري موتو",
		"hr": "الكرواتية",
		"hsb": "الصربية العليا",
		"hsn": "hsn",
		"ht": "الهايتية",
		"hu": "الهنغارية",
		"hup": "الهبا",
		"hy": "الأرمينية",
		"hz": "الهيريرو",
		"ia": "اللّغة الوسيطة",
		"iba": "الإيبان",
		"ibb": "الإيبيبيوية",
		"id": "الإندونيسية",
		"ie": "الإنترلينج",
		"ig": "الإيجبو",
		"ii": "السيتشيون يي",
		"ik": "الإينبياك",
		"ilo": "الإيلوكو",
		"inh": "الإنجوشية",
		"io": "الإيدو",
		"is": "الأيسلاندية",
		"it": "الإيطالية",
		"iu": "الإينكتيتت",
		"izh": "izh",
		"ja": "اليابانية",
		"jam": "jam",
		"jbo": "اللوجبان",
		"jgo": "نغومبا",
		"jmc": "الماتشامية",
		"jpr": "الفارسية اليهودية",
		"jrb": "العربية اليهودية",
		"jut": "jut",
		"jv": "الجاوية",
		"ka": "الجورجية",
		"kaa": "الكارا-كالباك",
		"kab": "القبيلية",
		"kac": "الكاتشين",
		"kaj": "الجو",
		"kam": "الكامبا",
		"kaw": "الكوي",
		"kbd": "الكاباردايان",
		"kbl": "كانمبو",
		"kcg": "التايابية",
		"kde": "ماكونده",
		"kea": "كابوفيرديانو",
		"ken": "ken",
		"kfo": "الكورو",
		"kg": "الكونغو",
		"kgp": "kgp",
		"kha": "الكازية",
		"kho": "الخوتانيز",
		"khq": "كويرا تشيني",
		"khw": "khw",
		"ki": "الكيكيو",
		"kiu": "kiu",
		"kj": "الكيونياما",
		"kk": "الكازاخستانية",
		"kkj": "kkj",
		"kl": "الكالاليست",
		"kln": "كالينجين",
		"km": "الخميرية",
		"kmb": "الكيمبندو",
		"kn": "الكانادا",
		"ko": "الكورية",
		"koi": "كومي-بيرماياك",
		"kok": "الكونكانية",
		"kos": "الكوسراين",
		"kpe": "الكبيل",
		"kr": "الكانيوري",
		"krc": "الكاراتشاي-بالكار",
		"kri": "kri",
		"krj": "krj",
		"krl": "الكاريلية",
		"kru": "الكوروخ",
		"ks": "الكشميرية",
		"ksb": "شامبالا",
		"ksf": "لغة البافيا",
		"ksh": "لغة الكولونيان",
		"ku": "الكردية",
		"kum": "القموقية",
		"kut": "الكتيناي",
		"kv": "الكومي",
		"kw": "الكورنية",
		"ky": "القرغيزية",
		"la": "اللاتينية",
		"lad": "اللادينو",
		"lag": "لانجي",
		"lah": "اللاهندا",
		"lam": "اللامبا",
		"lb": "اللوكسمبرجية",
		"lez": "الليزجية",
		"lfn": "lfn",
		"lg": "الجاندا",
		"li": "الليمبرجيشية",
		"lij": "lij",
		"liv": "liv",
		"lkt": "لاكوتا",
		"lmo": "lmo",
		"ln": "اللينجالا",
		"lo": "اللاوية",
		"lol": "منغولى",
		"loz": "اللوزي",
		"lrc": "اللرية الشمالية",
		"lt": "اللتوانية",
		"ltg": "ltg",
		"lu": "اللبا-كاتانجا",
		"lua": "اللبا-لؤلؤ",
		"lui": "اللوسينو",
		"lun": "اللوندا",
		"luo": "اللو",
		"lus": "الميزو",
		"luy": "لغة اللويا",
		"lv": "اللاتفية",
		"lzh": "lzh",
		"lzz": "lzz",
		"mad": "المادريز",
		"maf": "maf",
		"mag": "الماجا",
		"mai": "المايثيلي",
		"mak": "الماكاسار",
		"man": "الماندينغ",
		"mas": "الماساي",
		"mde": "مابا",
		"mdf": "الموكشا",
		"mdh": "mdh",
		"mdr": "الماندار",
		"men": "الميند",
		"mer": "الميرو",
		"mfe": "المورسيانية",
		"mg": "المالاجاشية",
		"mga": "الأيرلندية الوسطى",
		"mgh": "ماخاوا-ميتو",
		"mgo": "ميتا",
		"mh": "المارشالية",
		"mi": "الماورية",
		"mic": "الميكماكيونية",
		"min": "المينانجكاباو",
		"mis": "mis",
		"mk": "المقدونية",
		"ml": "الماليالام",
		"mn": "المنغولية",
		"mnc": "المانشو",
		"mni": "المانيبورية",
		"moh": "الموهوك",
		"mos": "الموسي",
		"mr": "الماراثي",
		"mrj": "mrj",
		"ms": "لغة الملايو",
		"mt": "المالطية",
		"mua": "مندنج",
		"mul": "لغات متعددة",
		"mus": "الكريك",
		"mwl": "الميرانديز",
		"mwr": "الماروارية",
		"mwv": "mwv",
		"my": "البورمية",
		"mye": "mye",
		"myv": "الأرزية",
		"mzn": "المازندرانية",
		"na": "النورو",
		"nan": "nan",
		"nap": "اللغة النابولية",
		"naq": "لغة الناما",
		"nb": "البوكمالية النرويجية",
		"nd": "النديبيل الشمالي",
		"nds": "الألمانية السفلى",
		"nds_NL": "السكسونية السفلى",
		"ne": "النيبالية",
		"new": "النوارية",
		"ng": "الندونجا",
		"nia": "النياس",
		"niu": "النيوي",
		"njo": "njo",
		"nl": "الهولندية",
		"nl_BE": "الفلمنكية",
		"nmg": "كواسيو",
		"nn": "النينورسك النرويجي",
		"nnh": "لغة النجيمبون",
		"no": "النرويجية",
		"nog": "النوجاي",
		"non": "النورس القديم",
		"nov": "nov",
		"nqo": "أنكو",
		"nr": "النديبيل الجنوبي",
		"nso": "السوتو الشمالية",
		"nus": "النوير",
		"nv": "النافاجو",
		"nwc": "النوارية التقليدية",
		"ny": "النيانجا",
		"nym": "النيامويزي",
		"nyn": "النيانكول",
		"nyo": "النيورو",
		"nzi": "النزيما",
		"oc": "الأوكيتانية",
		"oj": "الأوجيبوا",
		"om": "الأورومو",
		"or": "الأورييا",
		"os": "الأوسيتيك",
		"osa": "الأوساج",
		"ota": "التركية العثمانية",
		"pa": "البنجابية",
		"pag": "البانجاسينان",
		"pal": "البهلوية",
		"pam": "البامبانجا",
		"pap": "البابيامينتو",
		"pau": "البالوان",
		"pcd": "pcd",
		"pdc": "pdc",
		"pdt": "pdt",
		"peo": "الفارسية القديمة",
		"pfl": "pfl",
		"phn": "الفينيقية",
		"pi": "البالية",
		"pl": "البولندية",
		"pms": "pms",
		"pnt": "pnt",
		"pon": "البوهنبيايان",
		"prg": "prg",
		"pro": "البروفانسية القديمة",
		"ps": "البشتونية",
		"ps_alt-variant": "بشتو",
		"pt": "البرتغالية",
		"pt_BR": "البرتغالية البرازيلية",
		"pt_PT": "البرتغالية الأوروبية",
		"qu": "الكويتشوا",
		"quc": "كيشي",
		"qug": "qug",
		"raj": "الراجاسثانية",
		"rap": "الراباني",
		"rar": "الراروتونجاني",
		"rgn": "rgn",
		"rif": "rif",
		"rm": "الرومانشية",
		"rn": "الرندي",
		"ro": "الرومانية",
		"ro_MD": "المولدوفية",
		"rof": "الرومبو",
		"rom": "غجري",
		"root": "الجذر",
		"rtm": "rtm",
		"ru": "الروسية",
		"rue": "rue",
		"rug": "rug",
		"rup": "الأرومانيان",
		"rw": "الكينيارواندا",
		"rwk": "الروا",
		"sa": "السنسكريتية",
		"sad": "السانداوي",
		"sah": "الساخية",
		"sam": "الآرامية السامرية",
		"saq": "سامبورو",
		"sas": "الساساك",
		"sat": "السانتالي",
		"saz": "saz",
		"sba": "نامبي",
		"sbp": "سانغو",
		"sc": "السردينية",
		"scn": "الصقلية",
		"sco": "الأسكتلندية",
		"sd": "السندية",
		"sdc": "sdc",
		"sdh": "الكردية الجنوبية",
		"se": "السامي الشمالي",
		"see": "السنيكا",
		"seh": "سينا",
		"sei": "sei",
		"sel": "السيلكب",
		"ses": "كويرابورو سيني",
		"sg": "السانجو",
		"sga": "الأيرلندية القديمة",
		"sgs": "sgs",
		"sh": "صربية-كرواتية",
		"shi": "تشلحيت",
		"shn": "الشانية",
		"shu": "العربية التشادية",
		"si": "السنهالية",
		"sid": "السيدامو",
		"sk": "السلوفاكية",
		"sl": "السلوفانية",
		"sli": "sli",
		"sly": "sly",
		"sm": "الساموائية",
		"sma": "السامي الجنوبي",
		"smj": "اللول سامي",
		"smn": "الإيناري سامي",
		"sms": "السكولت سامي",
		"sn": "الشونا",
		"snk": "السونينك",
		"so": "الصومالية",
		"sog": "السوجدين",
		"sq": "الألبانية",
		"sr": "الصربية",
		"srn": "السرانان تونجو",
		"srr": "السرر",
		"ss": "السواتي",
		"ssy": "لغة الساهو",
		"st": "السوتو الجنوبية",
		"stq": "stq",
		"su": "السوندانية",
		"suk": "السوكوما",
		"sus": "السوسو",
		"sux": "السومارية",
		"sv": "السويدية",
		"sw": "السواحلية",
		"sw_CD": "الكونغو السواحلية",
		"swb": "القمرية",
		"syc": "سريانية تقليدية",
		"syr": "السريانية",
		"szl": "szl",
		"ta": "التاميلية",
		"tcy": "tcy",
		"te": "التيلجو",
		"tem": "التيمن",
		"teo": "تيسو",
		"ter": "التيرينو",
		"tet": "التيتم",
		"tg": "الطاجيكية",
		"th": "التايلاندية",
		"ti": "التغرينية",
		"tig": "التغرية",
		"tiv": "التيف",
		"tk": "التركمانية",
		"tkl": "التوكيلاو",
		"tkr": "tkr",
		"tl": "التاغالوغية",
		"tlh": "الكلينجون",
		"tli": "التلينغيتية",
		"tly": "tly",
		"tmh": "التاماشيك",
		"tn": "التسوانية",
		"to": "التونغية",
		"tog": "تونجا - نياسا",
		"tpi": "التوك بيسين",
		"tr": "التركية",
		"tru": "tru",
		"trv": "لغة التاروكو",
		"ts": "السونجا",
		"tsd": "tsd",
		"tsi": "التسيمشيان",
		"tt": "التتارية",
		"ttt": "ttt",
		"tum": "التامبوكا",
		"tvl": "التوفالو",
		"tw": "التوي",
		"twq": "تاساواق",
		"ty": "التاهيتية",
		"tyv": "التوفية",
		"tzm": "الأمازيغية وسط الأطلس",
		"udm": "الأدمرت",
		"ug": "الأغورية",
		"ug_alt-variant": "الأيغورية",
		"uga": "اليجاريتيك",
		"uk": "الأوكرانية",
		"umb": "الأمبندو",
		"und": "لغة غير معروفة",
		"ur": "الأردية",
		"uz": "الأوزبكية",
		"vai": "الفاي",
		"ve": "الفيندا",
		"vec": "vec",
		"vep": "vep",
		"vi": "الفيتنامية",
		"vls": "vls",
		"vmf": "vmf",
		"vo": "لغة الفولابوك",
		"vot": "الفوتيك",
		"vro": "vro",
		"vun": "الفونجو",
		"wa": "الولونية",
		"wae": "الوالسر",
		"wal": "الولاياتا",
		"war": "الواراي",
		"was": "الواشو",
		"wbp": "وارلبيري",
		"wo": "الولوف",
		"wuu": "wuu",
		"xal": "الكالميك",
		"xh": "الخوسا",
		"xmf": "xmf",
		"xog": "السوغا",
		"yao": "الياو",
		"yap": "اليابيز",
		"yav": "يانجبن",
		"ybb": "يمبا",
		"yi": "اليديشية",
		"yo": "اليوروبية",
		"yrl": "yrl",
		"yue": "الكَنْتُونية",
		"za": "الزهيونج",
		"zap": "الزابوتيك",
		"zbl": "رموز المعايير الأساسية",
		"zea": "zea",
		"zen": "الزيناجا",
		"zgh": "التمازيغية المغربية القياسية",
		"zh": "الصينية",
		"zh_Hans": "الصينية المبسطة",
		"zh_Hant": "الصينية التقليدية",
		"zu": "الزولو",
		"zun": "الزونية",
		"zxx": "بدون محتوى لغوي",
		"zza": "زازا"
	},
	"scripts": {
		"Adlm": "Adlm",
		"Aghb": "Aghb",
		"Ahom": "Ahom",
		"Arab": "العربية",
		"Arab-alt-variant": "العربية الفارسية",
		"Armi": "Armi",
		"Armn": "الأرمينية",
		"Avst": "Avst",
		"Bali": "البالية",
		"Bamu": "Bamu",
		"Bass": "Bass",
		"Batk": "الباتاك",
		"Beng": "البنغالية",
		"Bhks": "Bhks",
		"Blis": "رموز بليس",
		"Bopo": "البوبوموفو",
		"Brah": "الهندوسية",
		"Brai": "البرايل",
		"Bugi": "البجينيز",
		"Buhd": "البهيدية",
		"Cakm": "Cakm",
		"Cans": "مقاطع كندية أصلية موحدة",
		"Cari": "الكارية",
		"Cham": "التشامية",
		"Cher": "الشيروكي",
		"Cirt": "السيرث",
		"Copt": "القبطية",
		"Cprt": "القبرصية",
		"Cyrl": "السيريلية",
		"Cyrs": "السيريلية السلافية الكنسية القديمة",
		"Deva": "الديفاناجاري",
		"Dsrt": "الديسيريت",
		"Dupl": "Dupl",
		"Egyd": "الديموطيقية",
		"Egyh": "الهيراطيقية",
		"Egyp": "الهيروغليفية",
		"Elba": "Elba",
		"Ethi": "الأثيوبية",
		"Geok": "الأبجدية الجورجية - أسومتافرلي و نسخري",
		"Geor": "الجورجية",
		"Glag": "الجلاجوليتيك",
		"Goth": "القوطية",
		"Gran": "Gran",
		"Grek": "اليونانية",
		"Gujr": "التاغجراتية",
		"Guru": "الجرمخي",
		"Hanb": "Hanb",
		"Hang": "الهانغول",
		"Hani": "الهان",
		"Hano": "الهانونو",
		"Hans": "المبسطة",
		"Hans-alt-stand-alone": "الهان المبسطة",
		"Hant": "التقليدية",
		"Hant-alt-stand-alone": "الهان التقليدية",
		"Hatr": "Hatr",
		"Hebr": "العبرية",
		"Hira": "الهيراجانا",
		"Hluw": "Hluw",
		"Hmng": "الباهوه همونج",
		"Hrkt": "الكتكانا أو الهيراجانا",
		"Hung": "المجرية القديمة",
		"Inds": "اندس - هارابان",
		"Ital": "الإيطالية القديمة",
		"Jamo": "Jamo",
		"Java": "الجاوية",
		"Jpan": "اليابانية",
		"Kali": "الكياه لى",
		"Kana": "الكتكانا",
		"Khar": "الخاروشتى",
		"Khmr": "الخميرية",
		"Khoj": "Khoj",
		"Knda": "الكانادا",
		"Kore": "الكورية",
		"Kthi": "Kthi",
		"Lana": "الانا",
		"Laoo": "اللاو",
		"Latf": "اللاتينية - متغير فراكتر",
		"Latg": "اللاتينية - متغير غيلى",
		"Latn": "اللاتينية",
		"Lepc": "الليبتشا - رونج",
		"Limb": "الليمبو",
		"Lina": "الخطية أ",
		"Linb": "الخطية ب",
		"Lisu": "Lisu",
		"Lyci": "الليسية",
		"Lydi": "الليدية",
		"Mahj": "Mahj",
		"Mand": "المانداينية",
		"Mani": "Mani",
		"Marc": "Marc",
		"Maya": "المايا الهيروغليفية",
		"Mend": "Mend",
		"Merc": "Merc",
		"Mero": "الميرويتيك",
		"Mlym": "الماليالام",
		"Modi": "Modi",
		"Mong": "المغولية",
		"Moon": "مون",
		"Mroo": "Mroo",
		"Mtei": "Mtei",
		"Mult": "Mult",
		"Mymr": "الميانمار",
		"Narb": "العربية الشمالية القديمة",
		"Nbat": "Nbat",
		"Newa": "Newa",
		"Nkoo": "أنكو",
		"Ogam": "الأوجهام",
		"Olck": "Olck",
		"Orkh": "الأورخون",
		"Orya": "الأوريا",
		"Osge": "Osge",
		"Osma": "الأوسمانيا",
		"Palm": "Palm",
		"Pauc": "Pauc",
		"Perm": "البيرميكية القديمة",
		"Phag": "الفاجسبا",
		"Phli": "Phli",
		"Phlp": "Phlp",
		"Phnx": "الفينيقية",
		"Plrd": "الصوتيات الجماء",
		"Prti": "Prti",
		"Qaaa": "Qaaa",
		"Qaab": "Qaab",
		"Qaac": "Qaac",
		"Qaad": "Qaad",
		"Qaae": "Qaae",
		"Qaaf": "Qaaf",
		"Qaag": "Qaag",
		"Qaah": "Qaah",
		"Qaaj": "Qaaj",
		"Qaak": "Qaak",
		"Qaal": "Qaal",
		"Qaam": "Qaam",
		"Qaan": "Qaan",
		"Qaao": "Qaao",
		"Qaap": "Qaap",
		"Qaaq": "Qaaq",
		"Qaar": "Qaar",
		"Qaas": "Qaas",
		"Qaat": "Qaat",
		"Qaau": "Qaau",
		"Qaav": "Qaav",
		"Qaaw": "Qaaw",
		"Qaax": "Qaax",
		"Qaay": "Qaay",
		"Qaaz": "Qaaz",
		"Qaba": "Qaba",
		"Qabb": "Qabb",
		"Qabc": "Qabc",
		"Qabd": "Qabd",
		"Qabe": "Qabe",
		"Qabf": "Qabf",
		"Qabg": "Qabg",
		"Qabh": "Qabh",
		"Qabi": "Qabi",
		"Qabj": "Qabj",
		"Qabk": "Qabk",
		"Qabl": "Qabl",
		"Qabm": "Qabm",
		"Qabn": "Qabn",
		"Qabo": "Qabo",
		"Qabp": "Qabp",
		"Qabq": "Qabq",
		"Qabr": "Qabr",
		"Qabs": "Qabs",
		"Qabt": "Qabt",
		"Qabu": "Qabu",
		"Qabv": "Qabv",
		"Qabw": "Qabw",
		"Qabx": "Qabx",
		"Rjng": "Rjng",
		"Roro": "رنجورنجو",
		"Runr": "الروني",
		"Samr": "Samr",
		"Sara": "الساراتي",
		"Sarb": "العربية الجنوبية القديمة",
		"Saur": "Saur",
		"Sgnw": "Sgnw",
		"Shaw": "الشواني",
		"Shrd": "Shrd",
		"Sidd": "Sidd",
		"Sind": "Sind",
		"Sinh": "السينهالا",
		"Sora": "Sora",
		"Sund": "السوندانية",
		"Sylo": "السيلوتي ناغري",
		"Syrc": "السريانية",
		"Syre": "السريانية الأسترنجيلية",
		"Syrj": "السريانية الغربية",
		"Syrn": "السريانية الشرقية",
		"Tagb": "التاجبانوا",
		"Takr": "Takr",
		"Tale": "التاي لي",
		"Talu": "التاى لى الجديد",
		"Taml": "التاميلية",
		"Tang": "Tang",
		"Tavt": "Tavt",
		"Telu": "التيلجو",
		"Teng": "التينجوار",
		"Tfng": "التيفيناغ",
		"Tglg": "التغالوغية",
		"Thaa": "الثعنة",
		"Thai": "التايلاندية",
		"Tibt": "التبتية",
		"Tirh": "Tirh",
		"Ugar": "الأجاريتيكية",
		"Vaii": "الفاي",
		"Visp": "الكلام المرئي",
		"Wara": "Wara",
		"Xpeo": "الفارسية القديمة",
		"Xsux": "الكتابة المسمارية الأكدية السومرية",
		"Yiii": "اليي",
		"Zinh": "الموروث",
		"Zmth": "Zmth",
		"Zsye": "Zsye",
		"Zsym": "رموز",
		"Zxxx": "غير مكتوب",
		"Zyyy": "عام",
		"Zzzz": "نظام كتابة غير معروف"
	},
	"territories": {
		"142": "آسيا",
		"143": "وسط آسيا",
		"145": "غرب آسيا",
		"150": "أوروبا",
		"151": "شرق أوروبا",
		"154": "شمال أوروبا",
		"155": "غرب أوروبا",
		"419": "أمريكا اللاتينية",
		"001": "العالم",
		"002": "أفريقيا",
		"003": "أمريكا الشمالية",
		"005": "أمريكا الجنوبية",
		"009": "أوقيانوسيا",
		"011": "غرب أفريقيا",
		"013": "أمريكا الوسطى",
		"014": "شرق أفريقيا",
		"015": "شمال أفريقيا",
		"017": "وسط أفريقيا",
		"018": "أفريقيا الجنوبية",
		"019": "الأمريكتان",
		"021": "شمال أمريكا",
		"029": "الكاريبي",
		"030": "شرق آسيا",
		"034": "جنوب آسيا",
		"035": "جنوب شرق آسيا",
		"039": "جنوب أوروبا",
		"053": "أسترالاسيا",
		"054": "ميلانيزيا",
		"057": "الجزر الميكرونيزية",
		"061": "بولينيزيا",
		"AC": "جزيرة أسينشيون",
		"AD": "أندورا",
		"AE": "الإمارات العربية المتحدة",
		"AF": "أفغانستان",
		"AG": "أنتيغوا وبربودا",
		"AI": "أنغويلا",
		"AL": "ألبانيا",
		"AM": "أرمينيا",
		"AO": "أنغولا",
		"AQ": "أنتاركتيكا",
		"AR": "الأرجنتين",
		"AS": "ساموا الأمريكية",
		"AT": "النمسا",
		"AU": "أستراليا",
		"AW": "أروبا",
		"AX": "جزر آلاند",
		"AZ": "أذربيجان",
		"BA": "البوسنة والهرسك",
		"BB": "بربادوس",
		"BD": "بنجلاديش",
		"BE": "بلجيكا",
		"BF": "بوركينا فاسو",
		"BG": "بلغاريا",
		"BH": "البحرين",
		"BI": "بوروندي",
		"BJ": "بنين",
		"BL": "سان بارتليمي",
		"BM": "برمودا",
		"BN": "بروناي",
		"BO": "بوليفيا",
		"BQ": "هولندا الكاريبية",
		"BR": "البرازيل",
		"BS": "البهاما",
		"BT": "بوتان",
		"BV": "جزيرة بوفيه",
		"BW": "بتسوانا",
		"BY": "بيلاروس",
		"BZ": "بليز",
		"CA": "كندا",
		"CC": "جزر كوكوس (كيلينغ)",
		"CD": "الكونغو - كينشاسا",
		"CD-alt-variant": "جمهورية الكونغو الديمقراطية",
		"CF": "جمهورية أفريقيا الوسطى",
		"CG": "الكونغو - برازافيل",
		"CG-alt-variant": "جمهورية الكونغو",
		"CH": "سويسرا",
		"CI": "ساحل العاج",
		"CI-alt-variant": "CI",
		"CK": "جزر كوك",
		"CL": "تشيلي",
		"CM": "الكاميرون",
		"CN": "الصين",
		"CO": "كولومبيا",
		"CP": "جزيرة كليبيرتون",
		"CR": "كوستاريكا",
		"CU": "كوبا",
		"CV": "الرأس الأخضر",
		"CW": "كوراساو",
		"CX": "جزيرة الكريسماس",
		"CY": "قبرص",
		"CZ": "جمهورية التشيك",
		"DE": "ألمانيا",
		"DG": "دييغو غارسيا",
		"DJ": "جيبوتي",
		"DK": "الدانمرك",
		"DM": "دومينيكا",
		"DO": "جمهورية الدومينيك",
		"DZ": "الجزائر",
		"EA": "سيوتا وميليلا",
		"EC": "الإكوادور",
		"EE": "إستونيا",
		"EG": "مصر",
		"EH": "الصحراء الغربية",
		"ER": "إريتريا",
		"ES": "إسبانيا",
		"ET": "إثيوبيا",
		"EU": "الاتحاد الأوروبي",
		"FI": "فنلندا",
		"FJ": "فيجي",
		"FK": "جزر فوكلاند",
		"FK-alt-variant": "جزر فوكلاند - جزر مالفيناس",
		"FM": "ميكرونيزيا",
		"FO": "جزر فارو",
		"FR": "فرنسا",
		"GA": "الجابون",
		"GB": "المملكة المتحدة",
		"GB-alt-short": "المملكة المتحدة",
		"GD": "غرينادا",
		"GE": "جورجيا",
		"GF": "غويانا الفرنسية",
		"GG": "غيرنزي",
		"GH": "غانا",
		"GI": "جبل طارق",
		"GL": "غرينلاند",
		"GM": "غامبيا",
		"GN": "غينيا",
		"GP": "غوادلوب",
		"GQ": "غينيا الإستوائية",
		"GR": "اليونان",
		"GS": "جورجيا الجنوبية وجزر ساندويتش الجنوبية",
		"GT": "غواتيمالا",
		"GU": "غوام",
		"GW": "غينيا بيساو",
		"GY": "غيانا",
		"HK": "هونغ كونغ الصينية",
		"HK-alt-short": "هونغ كونغ",
		"HM": "جزيرة هيرد وجزر ماكدونالد",
		"HN": "هندوراس",
		"HR": "كرواتيا",
		"HT": "هايتي",
		"HU": "هنغاريا",
		"IC": "جزر الكناري",
		"ID": "إندونيسيا",
		"IE": "أيرلندا",
		"IL": "إسرائيل",
		"IM": "جزيرة مان",
		"IN": "الهند",
		"IO": "الإقليم البريطاني في المحيط الهندي",
		"IQ": "العراق",
		"IR": "إيران",
		"IS": "أيسلندا",
		"IT": "إيطاليا",
		"JE": "جيرسي",
		"JM": "جامايكا",
		"JO": "الأردن",
		"JP": "اليابان",
		"KE": "كينيا",
		"KG": "قرغيزستان",
		"KH": "كمبوديا",
		"KI": "كيريباتي",
		"KM": "جزر القمر",
		"KN": "سانت كيتس ونيفيس",
		"KP": "كوريا الشمالية",
		"KR": "كوريا الجنوبية",
		"KW": "الكويت",
		"KY": "جزر الكايمن",
		"KZ": "كازاخستان",
		"LA": "لاوس",
		"LB": "لبنان",
		"LC": "سانت لوسيا",
		"LI": "ليختنشتاين",
		"LK": "سريلانكا",
		"LR": "ليبيريا",
		"LS": "ليسوتو",
		"LT": "ليتوانيا",
		"LU": "لوكسمبورغ",
		"LV": "لاتفيا",
		"LY": "ليبيا",
		"MA": "المغرب",
		"MC": "موناكو",
		"MD": "مولدافيا",
		"ME": "الجبل الأسود",
		"MF": "سانت مارتن",
		"MG": "مدغشقر",
		"MH": "جزر المارشال",
		"MK": "مقدونيا",
		"MK-alt-variant": "مقدونيا- جمهورية مقدونيا اليوغسلافية السابقة",
		"ML": "مالي",
		"MM": "ميانمار -بورما",
		"MN": "منغوليا",
		"MO": "مكاو الصينية (منطقة إدارية خاصة)",
		"MO-alt-short": "مكاو",
		"MP": "جزر ماريانا الشمالية",
		"MQ": "مارتينيك",
		"MR": "موريتانيا",
		"MS": "مونتسرات",
		"MT": "مالطا",
		"MU": "موريشيوس",
		"MV": "جزر المالديف",
		"MW": "ملاوي",
		"MX": "المكسيك",
		"MY": "ماليزيا",
		"MZ": "موزمبيق",
		"NA": "ناميبيا",
		"NC": "كاليدونيا الجديدة",
		"NE": "النيجر",
		"NF": "جزيرة نورفوك",
		"NG": "نيجيريا",
		"NI": "نيكاراغوا",
		"NL": "هولندا",
		"NO": "النرويج",
		"NP": "نيبال",
		"NR": "ناورو",
		"NU": "نيوي",
		"NZ": "نيوزيلندا",
		"OM": "عُمان",
		"PA": "بنما",
		"PE": "بيرو",
		"PF": "بولينيزيا الفرنسية",
		"PG": "بابوا غينيا الجديدة",
		"PH": "الفلبين",
		"PK": "باكستان",
		"PL": "بولندا",
		"PM": "سانت بيير وميكولون",
		"PN": "جزر بيتكيرن",
		"PR": "بورتوريكو",
		"PS": "الأراضي الفلسطينية",
		"PS-alt-short": "فلسطين",
		"PT": "البرتغال",
		"PW": "بالاو",
		"PY": "باراغواي",
		"QA": "قطر",
		"QO": "أوقيانوسيا النائية",
		"RE": "روينيون",
		"RO": "رومانيا",
		"RS": "صربيا",
		"RU": "روسيا",
		"RW": "رواندا",
		"SA": "المملكة العربية السعودية",
		"SB": "جزر سليمان",
		"SC": "سيشل",
		"SD": "السودان",
		"SE": "السويد",
		"SG": "سنغافورة",
		"SH": "سانت هيلنا",
		"SI": "سلوفينيا",
		"SJ": "سفالبارد وجان مايان",
		"SK": "سلوفاكيا",
		"SL": "سيراليون",
		"SM": "سان مارينو",
		"SN": "السنغال",
		"SO": "الصومال",
		"SR": "سورينام",
		"SS": "جنوب السودان",
		"ST": "ساو تومي وبرينسيبي",
		"SV": "السلفادور",
		"SX": "سينت مارتن",
		"SY": "سوريا",
		"SZ": "سوازيلاند",
		"TA": "تريستان دي كونها",
		"TC": "جزر توركس وكايكوس",
		"TD": "تشاد",
		"TF": "الأقاليم الجنوبية الفرنسية",
		"TG": "توغو",
		"TH": "تايلاند",
		"TJ": "طاجيكستان",
		"TK": "توكيلو",
		"TL": "تيمور الشرقية",
		"TL-alt-variant": "TL",
		"TM": "تركمانستان",
		"TN": "تونس",
		"TO": "تونغا",
		"TR": "تركيا",
		"TT": "ترينيداد وتوباغو",
		"TV": "توفالو",
		"TW": "تايوان",
		"TZ": "تنزانيا",
		"UA": "أوكرانيا",
		"UG": "أوغندا",
		"UM": "جزر الولايات المتحدة النائية",
		"US": "الولايات المتحدة",
		"US-alt-short": "الولايات المتحدة",
		"UY": "أورغواي",
		"UZ": "أوزبكستان",
		"VA": "الفاتيكان",
		"VC": "سانت فنسنت وغرنادين",
		"VE": "فنزويلا",
		"VG": "جزر فرجين البريطانية",
		"VI": "جزر فرجين الأمريكية",
		"VN": "فيتنام",
		"VU": "فانواتو",
		"WF": "جزر والس وفوتونا",
		"WS": "ساموا",
		"XK": "كوسوفو",
		"YE": "اليمن",
		"YT": "مايوت",
		"ZA": "جنوب أفريقيا",
		"ZM": "زامبيا",
		"ZW": "زيمبابوي",
		"ZZ": "منطقة غير معروفة"
	},
	"orientation": "right-to-left",
	"ca-gregorian": {
		"dateFormats": {
			"full": "EEEE، d MMMM، y",
			"long": "d MMMM، y",
			"medium": "dd‏/MM‏/y",
			"short": "d‏/M‏/y"
		},
		"timeFormats": {
			"full": "h:mm:ss a zzzz",
			"long": "h:mm:ss a z",
			"medium": "h:mm:ss a",
			"short": "h:mm a"
		},
		"dateTimeFormats": {
			"full": "{1} {0}",
			"long": "{1} {0}",
			"medium": "{1} {0}",
			"short": "{1} {0}",
			"availableFormats": {
				"d": "d",
				"E": "ccc",
				"Ed": "E، d",
				"Ehm": "E h:mm a",
				"EHm": "E HH:mm",
				"Ehms": "E h:mm:ss a",
				"EHms": "E HH:mm:ss",
				"Gy": "y G",
				"GyMMM": "MMM y G",
				"GyMMMd": "d MMM، y G",
				"GyMMMEd": "E، d MMM، y G",
				"h": "h a",
				"H": "HH",
				"hm": "h:mm a",
				"Hm": "HH:mm",
				"hms": "h:mm:ss a",
				"Hms": "HH:mm:ss",
				"hmsv": "h:mm:ss a v",
				"Hmsv": "HH:mm:ss v",
				"hmv": "h:mm a v",
				"Hmv": "HH:mm v",
				"M": "L",
				"Md": "d/‏M",
				"MEd": "E، d/M",
				"MMdd": "dd‏/MM",
				"MMM": "LLL",
				"MMMd": "d MMM",
				"MMMEd": "E، d MMM",
				"MMMMd": "d MMMM",
				"MMMMEd": "E، d MMMM",
				"ms": "mm:ss",
				"y": "y",
				"yM": "M‏/y",
				"yMd": "d‏/M‏/y",
				"yMEd": "E، d/‏M/‏y",
				"yMM": "MM‏/y",
				"yMMM": "MMM y",
				"yMMMd": "d MMM، y",
				"yMMMEd": "E، d MMM، y",
				"yMMMM": "MMMM y",
				"yQQQ": "QQQ y",
				"yQQQQ": "QQQQ y"
			},
			"appendItems": {
				"Day": "{0} ({2}: {1})",
				"Day-Of-Week": "{0} {1}",
				"Era": "{1} {0}",
				"Hour": "{0} ({2}: {1})",
				"Minute": "{0} ({2}: {1})",
				"Month": "{0} ({2}: {1})",
				"Quarter": "{0} ({2}: {1})",
				"Second": "{0} ({2}: {1})",
				"Timezone": "{0} {1}",
				"Week": "{0} ({2}: {1})",
				"Year": "{1} {0}"
			},
			"intervalFormats": {
				"intervalFormatFallback": "{0} – {1}",
				"d": {
					"d": "d–d"
				},
				"h": {
					"a": "h a – h a",
					"h": "h–h a"
				},
				"H": {
					"H": "HH–HH"
				},
				"hm": {
					"a": "h:mm a – h:mm a",
					"h": "h:mm–h:mm a",
					"m": "h:mm–h:mm a"
				},
				"Hm": {
					"H": "HH:mm–HH:mm",
					"m": "HH:mm–HH:mm"
				},
				"hmv": {
					"a": "h:mm a – h:mm a v",
					"h": "h:mm–h:mm a v",
					"m": "h:mm–h:mm a v"
				},
				"Hmv": {
					"H": "HH:mm–HH:mm v",
					"m": "HH:mm–HH:mm v"
				},
				"hv": {
					"a": "h a – h a v",
					"h": "h–h a v"
				},
				"Hv": {
					"H": "HH–HH v"
				},
				"M": {
					"M": "M–M"
				},
				"Md": {
					"d": "M/d – M/d",
					"M": "M/d – M/d"
				},
				"MEd": {
					"d": "E، d/‏M –‏ E، d/‏M",
					"M": "E، d/‏M – E، d/‏M"
				},
				"MMM": {
					"M": "MMM–MMM"
				},
				"MMMd": {
					"d": "d–d MMM",
					"M": "d MMM – d MMM"
				},
				"MMMEd": {
					"d": "E، d – E، d MMM",
					"M": "E، d MMM – E، d MMM"
				},
				"MMMM": {
					"M": "LLLL–LLLL"
				},
				"y": {
					"y": "y–y"
				},
				"yM": {
					"M": "M‏/y – M‏/y",
					"y": "M‏/y – M‏/y"
				},
				"yMd": {
					"d": "d‏/M‏/y – d‏/M‏/y",
					"M": "d‏/M‏/y – d‏/M‏/y",
					"y": "d‏/M‏/y – d‏/M‏/y"
				},
				"yMEd": {
					"d": "E، dd‏/MM‏/y – E، dd‏/MM‏/y",
					"M": "E، d‏/M‏/y – E، d‏/M‏/y",
					"y": "E، d‏/M‏/y – E، d‏/M‏/y"
				},
				"yMMM": {
					"M": "MMM – MMM، y",
					"y": "MMM، y – MMM، y"
				},
				"yMMMd": {
					"d": "d–d MMM، y",
					"M": "d MMM – d MMM، y",
					"y": "d MMM، y – d MMM، y"
				},
				"yMMMEd": {
					"d": "E، d – E، d MMM، y",
					"M": "E، d MMM – E، d MMM، y",
					"y": "E، d MMM، y – E، d MMM، y"
				},
				"yMMMM": {
					"M": "MMMM – MMMM، y",
					"y": "MMMM، y – MMMM، y"
				}
			}
		},
		"months": {
			"format": {
				"abbreviated": [
					"يناير",
					"فبراير",
					"مارس",
					"أبريل",
					"مايو",
					"يونيو",
					"يوليو",
					"أغسطس",
					"سبتمبر",
					"أكتوبر",
					"نوفمبر",
					"ديسمبر"
				],
				"narrow": [
					"ي",
					"ف",
					"م",
					"أ",
					"و",
					"ن",
					"ل",
					"غ",
					"س",
					"ك",
					"ب",
					"د"
				],
				"wide": [
					"يناير",
					"فبراير",
					"مارس",
					"أبريل",
					"مايو",
					"يونيو",
					"يوليو",
					"أغسطس",
					"سبتمبر",
					"أكتوبر",
					"نوفمبر",
					"ديسمبر"
				]
			},
			"stand-alone": {
				"abbreviated": [
					"يناير",
					"فبراير",
					"مارس",
					"أبريل",
					"مايو",
					"يونيو",
					"يوليو",
					"أغسطس",
					"سبتمبر",
					"أكتوبر",
					"نوفمبر",
					"ديسمبر"
				],
				"narrow": [
					"ي",
					"ف",
					"م",
					"أ",
					"و",
					"ن",
					"ل",
					"غ",
					"س",
					"ك",
					"ب",
					"د"
				],
				"wide": [
					"يناير",
					"فبراير",
					"مارس",
					"أبريل",
					"مايو",
					"يونيو",
					"يوليو",
					"أغسطس",
					"سبتمبر",
					"أكتوبر",
					"نوفمبر",
					"ديسمبر"
				]
			}
		},
		"days": {
			"format": {
				"abbreviated": [
					"الأحد",
					"الاثنين",
					"الثلاثاء",
					"الأربعاء",
					"الخميس",
					"الجمعة",
					"السبت"
				],
				"narrow": [
					"ح",
					"ن",
					"ث",
					"ر",
					"خ",
					"ج",
					"س"
				],
				"short": [
					"الأحد",
					"الاثنين",
					"الثلاثاء",
					"الأربعاء",
					"الخميس",
					"الجمعة",
					"السبت"
				],
				"wide": [
					"الأحد",
					"الاثنين",
					"الثلاثاء",
					"الأربعاء",
					"الخميس",
					"الجمعة",
					"السبت"
				]
			},
			"stand-alone": {
				"abbreviated": [
					"الأحد",
					"الاثنين",
					"الثلاثاء",
					"الأربعاء",
					"الخميس",
					"الجمعة",
					"السبت"
				],
				"narrow": [
					"ح",
					"ن",
					"ث",
					"ر",
					"خ",
					"ج",
					"س"
				],
				"short": [
					"الأحد",
					"الاثنين",
					"الثلاثاء",
					"الأربعاء",
					"الخميس",
					"الجمعة",
					"السبت"
				],
				"wide": [
					"الأحد",
					"الاثنين",
					"الثلاثاء",
					"الأربعاء",
					"الخميس",
					"الجمعة",
					"السبت"
				]
			}
		},
		"quarters": {
			"format": {
				"abbreviated": [
					"الربع الأول",
					"الربع الثاني",
					"الربع الثالث",
					"الربع الرابع"
				],
				"narrow": [
					"١",
					"٢",
					"٣",
					"٤"
				],
				"wide": [
					"الربع الأول",
					"الربع الثاني",
					"الربع الثالث",
					"الربع الرابع"
				]
			},
			"stand-alone": {
				"abbreviated": [
					"الربع الأول",
					"الربع الثاني",
					"الربع الثالث",
					"الربع الرابع"
				],
				"narrow": [
					"١",
					"٢",
					"٣",
					"٤"
				],
				"wide": [
					"الربع الأول",
					"الربع الثاني",
					"الربع الثالث",
					"الربع الرابع"
				]
			}
		},
		"dayPeriods": {
			"format": {
				"abbreviated": [
					"ص",
					"م"
				],
				"narrow": [
					"ص",
					"م"
				],
				"wide": [
					"ص",
					"م"
				]
			},
			"stand-alone": {
				"abbreviated": [
					"ص",
					"م"
				],
				"narrow": [
					"ص",
					"م"
				],
				"wide": [
					"صباحًا",
					"مساءً"
				]
			}
		},
		"era-wide": {
			"0": "قبل الميلاد",
			"1": "ميلادي"
		},
		"era-abbreviated": {
			"0": "ق.م",
			"1": "م"
		},
		"era-narrow": {
			"0": "ق.م",
			"1": "م"
		}
	},
	"ca-islamic": {
		"dateFormats": {
			"full": "EEEE، d MMMM، y G",
			"long": "d MMMM، y G",
			"medium": "d MMM، y G",
			"short": "d‏/M‏/y GGGGG"
		},
		"timeFormats": {
			"full": "h:mm:ss a zzzz",
			"long": "h:mm:ss a z",
			"medium": "h:mm:ss a",
			"short": "h:mm a"
		},
		"dateTimeFormats": {
			"full": "{1} {0}",
			"long": "{1} {0}",
			"medium": "{1} {0}",
			"short": "{1} {0}",
			"availableFormats": {
				"d": "d",
				"E": "ccc",
				"Ed": "E، d",
				"Ehm": "E h:mm a",
				"EHm": "E HH:mm",
				"Ehms": "E h:mm:ss a",
				"EHms": "E HH:mm:ss",
				"Gy": "y G",
				"GyMMM": "MMM y G",
				"GyMMMd": "d MMM، y G",
				"GyMMMEd": "E، d MMM، y G",
				"h": "h a",
				"H": "HH",
				"hm": "h:mm a",
				"Hm": "HH:mm",
				"hms": "h:mm:ss a",
				"Hms": "HH:mm:ss",
				"M": "L",
				"Md": "d/‏M",
				"MEd": "E، d/M",
				"MMM": "LLL",
				"MMMd": "d MMM",
				"MMMEd": "E، d MMM",
				"MMMMd": "d MMMM",
				"ms": "mm:ss",
				"y": "y G",
				"yyyy": "y G",
				"yyyyM": "M‏/y G",
				"yyyyMd": "d‏/M‏/y G",
				"yyyyMEd": "E، d/‏M/‏y G",
				"yyyyMMM": "MMM، y G",
				"yyyyMMMd": "d MMM، y G",
				"yyyyMMMEd": "E، d MMM، y G",
				"yyyyMMMM": "MMMM، y G",
				"yyyyQQQ": "QQQ y G",
				"yyyyQQQQ": "QQQQ y G"
			},
			"appendItems": {
				"Day": "{0} ({2}: {1})",
				"Day-Of-Week": "{0} {1}",
				"Era": "{1} {0}",
				"Hour": "{0} ({2}: {1})",
				"Minute": "{0} ({2}: {1})",
				"Month": "{0} ({2}: {1})",
				"Quarter": "{0} ({2}: {1})",
				"Second": "{0} ({2}: {1})",
				"Timezone": "{0} {1}",
				"Week": "{0} ({2}: {1})",
				"Year": "{1} {0}"
			},
			"intervalFormats": {
				"intervalFormatFallback": "{0} – {1}",
				"d": {
					"d": "d–d"
				},
				"h": {
					"a": "h a – h a",
					"h": "h–h a"
				},
				"H": {
					"H": "HH–HH"
				},
				"hm": {
					"a": "h:mm a – h:mm a",
					"h": "h:mm–h:mm a",
					"m": "h:mm–h:mm a"
				},
				"Hm": {
					"H": "HH:mm–HH:mm",
					"m": "HH:mm–HH:mm"
				},
				"hmv": {
					"a": "h:mm a – h:mm a v",
					"h": "h:mm–h:mm a v",
					"m": "h:mm–h:mm a v"
				},
				"Hmv": {
					"H": "HH:mm–HH:mm v",
					"m": "HH:mm–HH:mm v"
				},
				"hv": {
					"a": "h a – h a v",
					"h": "h–h a v"
				},
				"Hv": {
					"H": "HH–HH v"
				},
				"M": {
					"M": "M–M"
				},
				"Md": {
					"d": "M/d – M/d",
					"M": "M/d – M/d"
				},
				"MEd": {
					"d": "E، d/‏M –‏ E، d/‏M",
					"M": "E، d/‏M – E، d/‏M"
				},
				"MMM": {
					"M": "MMM–MMM"
				},
				"MMMd": {
					"d": "MMM d–d",
					"M": "d MMM – d MMM"
				},
				"MMMEd": {
					"d": "E، d – E، d MMM",
					"M": "E، d MMM – E، d MMM"
				},
				"MMMM": {
					"M": "LLLL–LLLL"
				},
				"y": {
					"y": "y–y G"
				},
				"yM": {
					"M": "M‏/y – M‏/y G",
					"y": "M‏/y – M‏/y G"
				},
				"yMd": {
					"d": "d‏/M‏/y – d‏/M‏/y G",
					"M": "d‏/M‏/y – d‏/M‏/y G",
					"y": "d‏/M‏/y – d‏/M‏/y G"
				},
				"yMEd": {
					"d": "E، dd‏/MM‏/y – E، dd‏/MM‏/y G",
					"M": "E، d‏/M‏/y – E، d‏/M‏/y G",
					"y": "E، d‏/M‏/y – E، d‏/M‏/y G"
				},
				"yMMM": {
					"M": "MMM – MMM، y G",
					"y": "MMM، y – MMM، y G"
				},
				"yMMMd": {
					"d": "d–d MMM، y G",
					"M": "d MMM – d MMM، y G",
					"y": "d MMM، y – d MMM، y G"
				},
				"yMMMEd": {
					"d": "E، d – E، d MMM، y G",
					"M": "E، d MMM – E، d MMM، y G",
					"y": "E، d MMM، y – E، d MMM، y G"
				},
				"yMMMM": {
					"M": "MMMM – MMMM، y G",
					"y": "MMMM، y – MMMM، y G"
				}
			}
		},
		"months": {
			"format": {
				"abbreviated": [
					"محرم",
					"صفر",
					"ربيع الأول",
					"ربيع الآخر",
					"جمادى الأولى",
					"جمادى الآخرة",
					"رجب",
					"شعبان",
					"رمضان",
					"شوال",
					"ذو القعدة",
					"ذو الحجة"
				],
				"narrow": [
					"١",
					"٢",
					"٣",
					"٤",
					"٥",
					"٦",
					"٧",
					"٨",
					"٩",
					"١٠",
					"١١",
					"١٢"
				],
				"wide": [
					"محرم",
					"صفر",
					"ربيع الأول",
					"ربيع الآخر",
					"جمادى الأولى",
					"جمادى الآخرة",
					"رجب",
					"شعبان",
					"رمضان",
					"شوال",
					"ذو القعدة",
					"ذو الحجة"
				]
			},
			"stand-alone": {
				"abbreviated": [
					"محرم",
					"صفر",
					"ربيع الأول",
					"ربيع الآخر",
					"جمادى الأولى",
					"جمادى الآخرة",
					"رجب",
					"شعبان",
					"رمضان",
					"شوال",
					"ذو القعدة",
					"ذو الحجة"
				],
				"narrow": [
					"١",
					"٢",
					"٣",
					"٤",
					"٥",
					"٦",
					"٧",
					"٨",
					"٩",
					"١٠",
					"١١",
					"١٢"
				],
				"wide": [
					"محرم",
					"صفر",
					"ربيع الأول",
					"ربيع الآخر",
					"جمادى الأولى",
					"جمادى الآخرة",
					"رجب",
					"شعبان",
					"رمضان",
					"شوال",
					"ذو القعدة",
					"ذو الحجة"
				]
			}
		},
		"days": {
			"format": {
				"abbreviated": [
					"الأحد",
					"الاثنين",
					"الثلاثاء",
					"الأربعاء",
					"الخميس",
					"الجمعة",
					"السبت"
				],
				"narrow": [
					"ح",
					"ن",
					"ث",
					"ر",
					"خ",
					"ج",
					"س"
				],
				"short": [
					"الأحد",
					"الاثنين",
					"الثلاثاء",
					"الأربعاء",
					"الخميس",
					"الجمعة",
					"السبت"
				],
				"wide": [
					"الأحد",
					"الاثنين",
					"الثلاثاء",
					"الأربعاء",
					"الخميس",
					"الجمعة",
					"السبت"
				]
			},
			"stand-alone": {
				"abbreviated": [
					"الأحد",
					"الاثنين",
					"الثلاثاء",
					"الأربعاء",
					"الخميس",
					"الجمعة",
					"السبت"
				],
				"narrow": [
					"ح",
					"ن",
					"ث",
					"ر",
					"خ",
					"ج",
					"س"
				],
				"short": [
					"الأحد",
					"الاثنين",
					"الثلاثاء",
					"الأربعاء",
					"الخميس",
					"الجمعة",
					"السبت"
				],
				"wide": [
					"الأحد",
					"الاثنين",
					"الثلاثاء",
					"الأربعاء",
					"الخميس",
					"الجمعة",
					"السبت"
				]
			}
		},
		"quarters": {
			"format": {
				"abbreviated": [
					"الربع الأول",
					"الربع الثاني",
					"الربع الثالث",
					"الربع الرابع"
				],
				"narrow": [
					"١",
					"٢",
					"٣",
					"٤"
				],
				"wide": [
					"الربع الأول",
					"الربع الثاني",
					"الربع الثالث",
					"الربع الرابع"
				]
			},
			"stand-alone": {
				"abbreviated": [
					"الربع الأول",
					"الربع الثاني",
					"الربع الثالث",
					"الربع الرابع"
				],
				"narrow": [
					"١",
					"٢",
					"٣",
					"٤"
				],
				"wide": [
					"الربع الأول",
					"الربع الثاني",
					"الربع الثالث",
					"الربع الرابع"
				]
			}
		},
		"dayPeriods": {
			"format": {
				"abbreviated": [
					"ص",
					"م"
				],
				"narrow": [
					"ص",
					"م"
				],
				"wide": [
					"ص",
					"م"
				]
			},
			"stand-alone": {
				"abbreviated": [
					"ص",
					"م"
				],
				"narrow": [
					"ص",
					"م"
				],
				"wide": [
					"صباحًا",
					"مساءً"
				]
			}
		},
		"era-wide": {
			"0": "هـ"
		},
		"era-abbreviated": {
			"0": "هـ"
		},
		"era-narrow": {
			"0": "هـ"
		}
	},
	"ca-japanese": {
		"dateFormats": {
			"full": "EEEE، d MMMM، y G",
			"long": "d MMMM، y G",
			"medium": "dd‏/MM‏/y G",
			"short": "d‏/M‏/y GGGGG"
		},
		"timeFormats": {
			"full": "h:mm:ss a zzzz",
			"long": "h:mm:ss a z",
			"medium": "h:mm:ss a",
			"short": "h:mm a"
		},
		"dateTimeFormats": {
			"full": "{1} {0}",
			"long": "{1} {0}",
			"medium": "{1} {0}",
			"short": "{1} {0}",
			"availableFormats": {
				"d": "d",
				"E": "ccc",
				"Ed": "E، d",
				"Ehm": "E h:mm a",
				"EHm": "E HH:mm",
				"Ehms": "E h:mm:ss a",
				"EHms": "E HH:mm:ss",
				"Gy": "y G",
				"GyMMM": "MMM y G",
				"GyMMMd": "d MMM، y G",
				"GyMMMEd": "E، d MMM، y G",
				"h": "h a",
				"H": "HH",
				"hm": "h:mm a",
				"Hm": "HH:mm",
				"hms": "h:mm:ss a",
				"Hms": "HH:mm:ss",
				"M": "L",
				"Md": "d/‏M",
				"MEd": "E، d/M",
				"MMM": "LLL",
				"MMMd": "d MMM",
				"MMMEd": "E، d MMM",
				"MMMMd": "d MMMM",
				"ms": "mm:ss",
				"y": "y G",
				"yyyy": "y G",
				"yyyyM": "M‏/y G",
				"yyyyMd": "d‏/M‏/y G",
				"yyyyMEd": "E، d/‏M/‏y G",
				"yyyyMMM": "MMM، y G",
				"yyyyMMMd": "d MMM، y G",
				"yyyyMMMEd": "E، d MMM، y G",
				"yyyyMMMM": "MMMM، y G",
				"yyyyQQQ": "QQQ y G",
				"yyyyQQQQ": "QQQQ y G"
			},
			"appendItems": {
				"Day": "{0} ({2}: {1})",
				"Day-Of-Week": "{0} {1}",
				"Era": "{1} {0}",
				"Hour": "{0} ({2}: {1})",
				"Minute": "{0} ({2}: {1})",
				"Month": "{0} ({2}: {1})",
				"Quarter": "{0} ({2}: {1})",
				"Second": "{0} ({2}: {1})",
				"Timezone": "{0} {1}",
				"Week": "{0} ({2}: {1})",
				"Year": "{1} {0}"
			},
			"intervalFormats": {
				"intervalFormatFallback": "{0} – {1}",
				"d": {
					"d": "d–d"
				},
				"h": {
					"a": "h a – h a",
					"h": "h–h a"
				},
				"H": {
					"H": "HH–HH"
				},
				"hm": {
					"a": "h:mm a – h:mm a",
					"h": "h:mm–h:mm a",
					"m": "h:mm–h:mm a"
				},
				"Hm": {
					"H": "HH:mm–HH:mm",
					"m": "HH:mm–HH:mm"
				},
				"hmv": {
					"a": "h:mm a – h:mm a v",
					"h": "h:mm–h:mm a v",
					"m": "h:mm–h:mm a v"
				},
				"Hmv": {
					"H": "HH:mm–HH:mm v",
					"m": "HH:mm–HH:mm v"
				},
				"hv": {
					"a": "h a – h a v",
					"h": "h–h a v"
				},
				"Hv": {
					"H": "HH–HH v"
				},
				"M": {
					"M": "M–M"
				},
				"Md": {
					"d": "M/d – M/d",
					"M": "M/d – M/d"
				},
				"MEd": {
					"d": "E، d/‏M –‏ E، d/‏M",
					"M": "E، d/‏M – E، d/‏M"
				},
				"MMM": {
					"M": "MMM–MMM"
				},
				"MMMd": {
					"d": "MMM d–d",
					"M": "d MMM – d MMM"
				},
				"MMMEd": {
					"d": "E، d – E، d MMM",
					"M": "E، d MMM – E، d MMM"
				},
				"MMMM": {
					"M": "LLLL–LLLL"
				},
				"y": {
					"y": "y–y G"
				},
				"yM": {
					"M": "M‏/y – M‏/y G",
					"y": "M‏/y – M‏/y G"
				},
				"yMd": {
					"d": "d‏/M‏/y – d‏/M‏/y G",
					"M": "d‏/M‏/y – d‏/M‏/y G",
					"y": "d‏/M‏/y – d‏/M‏/y G"
				},
				"yMEd": {
					"d": "E، dd‏/MM‏/y – E، dd‏/MM‏/y G",
					"M": "E، d‏/M‏/y – E، d‏/M‏/y G",
					"y": "E، d‏/M‏/y – E، d‏/M‏/y G"
				},
				"yMMM": {
					"M": "MMM – MMM، y G",
					"y": "MMM، y – MMM، y G"
				},
				"yMMMd": {
					"d": "d–d MMM، y G",
					"M": "d MMM – d MMM، y G",
					"y": "d MMM، y – d MMM، y G"
				},
				"yMMMEd": {
					"d": "E، d – E، d MMM، y G",
					"M": "E، d MMM – E، d MMM، y G",
					"y": "E، d MMM، y – E، d MMM، y G"
				},
				"yMMMM": {
					"M": "MMMM – MMMM، y G",
					"y": "MMMM، y – MMMM، y G"
				}
			}
		},
		"months": {
			"format": {
				"abbreviated": [
					"يناير",
					"فبراير",
					"مارس",
					"أبريل",
					"مايو",
					"يونيو",
					"يوليو",
					"أغسطس",
					"سبتمبر",
					"أكتوبر",
					"نوفمبر",
					"ديسمبر"
				],
				"narrow": [
					"ي",
					"ف",
					"م",
					"أ",
					"و",
					"ن",
					"ل",
					"غ",
					"س",
					"ك",
					"ب",
					"د"
				],
				"wide": [
					"يناير",
					"فبراير",
					"مارس",
					"أبريل",
					"مايو",
					"يونيو",
					"يوليو",
					"أغسطس",
					"سبتمبر",
					"أكتوبر",
					"نوفمبر",
					"ديسمبر"
				]
			},
			"stand-alone": {
				"abbreviated": [
					"يناير",
					"فبراير",
					"مارس",
					"أبريل",
					"مايو",
					"يونيو",
					"يوليو",
					"أغسطس",
					"سبتمبر",
					"أكتوبر",
					"نوفمبر",
					"ديسمبر"
				],
				"narrow": [
					"ي",
					"ف",
					"م",
					"أ",
					"و",
					"ن",
					"ل",
					"غ",
					"س",
					"ك",
					"ب",
					"د"
				],
				"wide": [
					"يناير",
					"فبراير",
					"مارس",
					"أبريل",
					"مايو",
					"يونيو",
					"يوليو",
					"أغسطس",
					"سبتمبر",
					"أكتوبر",
					"نوفمبر",
					"ديسمبر"
				]
			}
		},
		"days": {
			"format": {
				"abbreviated": [
					"الأحد",
					"الاثنين",
					"الثلاثاء",
					"الأربعاء",
					"الخميس",
					"الجمعة",
					"السبت"
				],
				"narrow": [
					"ح",
					"ن",
					"ث",
					"ر",
					"خ",
					"ج",
					"س"
				],
				"short": [
					"الأحد",
					"الاثنين",
					"الثلاثاء",
					"الأربعاء",
					"الخميس",
					"الجمعة",
					"السبت"
				],
				"wide": [
					"الأحد",
					"الاثنين",
					"الثلاثاء",
					"الأربعاء",
					"الخميس",
					"الجمعة",
					"السبت"
				]
			},
			"stand-alone": {
				"abbreviated": [
					"الأحد",
					"الاثنين",
					"الثلاثاء",
					"الأربعاء",
					"الخميس",
					"الجمعة",
					"السبت"
				],
				"narrow": [
					"ح",
					"ن",
					"ث",
					"ر",
					"خ",
					"ج",
					"س"
				],
				"short": [
					"الأحد",
					"الاثنين",
					"الثلاثاء",
					"الأربعاء",
					"الخميس",
					"الجمعة",
					"السبت"
				],
				"wide": [
					"الأحد",
					"الاثنين",
					"الثلاثاء",
					"الأربعاء",
					"الخميس",
					"الجمعة",
					"السبت"
				]
			}
		},
		"quarters": {
			"format": {
				"abbreviated": [
					"الربع الأول",
					"الربع الثاني",
					"الربع الثالث",
					"الربع الرابع"
				],
				"narrow": [
					"١",
					"٢",
					"٣",
					"٤"
				],
				"wide": [
					"الربع الأول",
					"الربع الثاني",
					"الربع الثالث",
					"الربع الرابع"
				]
			},
			"stand-alone": {
				"abbreviated": [
					"الربع الأول",
					"الربع الثاني",
					"الربع الثالث",
					"الربع الرابع"
				],
				"narrow": [
					"١",
					"٢",
					"٣",
					"٤"
				],
				"wide": [
					"الربع الأول",
					"الربع الثاني",
					"الربع الثالث",
					"الربع الرابع"
				]
			}
		},
		"dayPeriods": {
			"format": {
				"abbreviated": [
					"ص",
					"م"
				],
				"narrow": [
					"ص",
					"م"
				],
				"wide": [
					"ص",
					"م"
				]
			},
			"stand-alone": {
				"abbreviated": [
					"ص",
					"م"
				],
				"narrow": [
					"ص",
					"م"
				],
				"wide": [
					"صباحًا",
					"مساءً"
				]
			}
		},
		"era-wide": {
			"232": "ميجي",
			"233": "تيشو",
			"234": "شووا",
			"235": "هيسي"
		},
		"era-abbreviated": {
			"232": "ميجي",
			"233": "تيشو",
			"234": "شووا",
			"235": "هيسي"
		},
		"era-narrow": {
			"232": "M",
			"233": "T",
			"234": "S",
			"235": "H"
		}
	},
	"ca-persian": {
		"dateFormats": {
			"full": "EEEE، d MMMM، y G",
			"long": "d MMMM، y G",
			"medium": "dd‏/MM‏/y G",
			"short": "d‏/M‏/y GGGGG"
		},
		"timeFormats": {
			"full": "h:mm:ss a zzzz",
			"long": "h:mm:ss a z",
			"medium": "h:mm:ss a",
			"short": "h:mm a"
		},
		"dateTimeFormats": {
			"full": "{1} {0}",
			"long": "{1} {0}",
			"medium": "{1} {0}",
			"short": "{1} {0}",
			"availableFormats": {
				"d": "d",
				"E": "ccc",
				"Ed": "E، d",
				"Ehm": "E h:mm a",
				"EHm": "E HH:mm",
				"Ehms": "E h:mm:ss a",
				"EHms": "E HH:mm:ss",
				"Gy": "y G",
				"GyMMM": "MMM y G",
				"GyMMMd": "d MMM، y G",
				"GyMMMEd": "E، d MMM، y G",
				"h": "h a",
				"H": "HH",
				"hm": "h:mm a",
				"Hm": "HH:mm",
				"hms": "h:mm:ss a",
				"Hms": "HH:mm:ss",
				"M": "L",
				"Md": "d/‏M",
				"MEd": "E، d/M",
				"MMM": "LLL",
				"MMMd": "d MMM",
				"MMMEd": "E، d MMM",
				"MMMMd": "d MMMM",
				"ms": "mm:ss",
				"y": "y G",
				"yyyy": "y G",
				"yyyyM": "M‏/y G",
				"yyyyMd": "d‏/M‏/y G",
				"yyyyMEd": "E، d/‏M/‏y G",
				"yyyyMMM": "MMM، y G",
				"yyyyMMMd": "d MMM، y G",
				"yyyyMMMEd": "E، d MMM، y G",
				"yyyyMMMM": "MMMM، y G",
				"yyyyQQQ": "QQQ y G",
				"yyyyQQQQ": "QQQQ y G"
			},
			"appendItems": {
				"Day": "{0} ({2}: {1})",
				"Day-Of-Week": "{0} {1}",
				"Era": "{1} {0}",
				"Hour": "{0} ({2}: {1})",
				"Minute": "{0} ({2}: {1})",
				"Month": "{0} ({2}: {1})",
				"Quarter": "{0} ({2}: {1})",
				"Second": "{0} ({2}: {1})",
				"Timezone": "{0} {1}",
				"Week": "{0} ({2}: {1})",
				"Year": "{1} {0}"
			},
			"intervalFormats": {
				"intervalFormatFallback": "{0} – {1}",
				"d": {
					"d": "d–d"
				},
				"h": {
					"a": "h a – h a",
					"h": "h–h a"
				},
				"H": {
					"H": "HH–HH"
				},
				"hm": {
					"a": "h:mm a – h:mm a",
					"h": "h:mm–h:mm a",
					"m": "h:mm–h:mm a"
				},
				"Hm": {
					"H": "HH:mm–HH:mm",
					"m": "HH:mm–HH:mm"
				},
				"hmv": {
					"a": "h:mm a – h:mm a v",
					"h": "h:mm–h:mm a v",
					"m": "h:mm–h:mm a v"
				},
				"Hmv": {
					"H": "HH:mm–HH:mm v",
					"m": "HH:mm–HH:mm v"
				},
				"hv": {
					"a": "h a – h a v",
					"h": "h–h a v"
				},
				"Hv": {
					"H": "HH–HH v"
				},
				"M": {
					"M": "M–M"
				},
				"Md": {
					"d": "M/d – M/d",
					"M": "M/d – M/d"
				},
				"MEd": {
					"d": "E، d/‏M –‏ E، d/‏M",
					"M": "E، d/‏M – E، d/‏M"
				},
				"MMM": {
					"M": "MMM–MMM"
				},
				"MMMd": {
					"d": "MMM d–d",
					"M": "d MMM – d MMM"
				},
				"MMMEd": {
					"d": "E، d – E، d MMM",
					"M": "E، d MMM – E، d MMM"
				},
				"MMMM": {
					"M": "LLLL–LLLL"
				},
				"y": {
					"y": "y–y G"
				},
				"yM": {
					"M": "M‏/y – M‏/y G",
					"y": "M‏/y – M‏/y G"
				},
				"yMd": {
					"d": "d‏/M‏/y – d‏/M‏/y G",
					"M": "d‏/M‏/y – d‏/M‏/y G",
					"y": "d‏/M‏/y – d‏/M‏/y G"
				},
				"yMEd": {
					"d": "E، dd‏/MM‏/y – E، dd‏/MM‏/y G",
					"M": "E، d‏/M‏/y – E، d‏/M‏/y G",
					"y": "E، d‏/M‏/y – E، d‏/M‏/y G"
				},
				"yMMM": {
					"M": "MMM – MMM، y G",
					"y": "MMM، y – MMM، y G"
				},
				"yMMMd": {
					"d": "d–d MMM، y G",
					"M": "d MMM – d MMM، y G",
					"y": "d MMM، y – d MMM، y G"
				},
				"yMMMEd": {
					"d": "E، d – E، d MMM، y G",
					"M": "E، d MMM – E، d MMM، y G",
					"y": "E، d MMM، y – E، d MMM، y G"
				},
				"yMMMM": {
					"M": "MMMM – MMMM، y G",
					"y": "MMMM، y – MMMM، y G"
				}
			}
		},
		"months": {
			"format": {
				"abbreviated": [
					"فرفردن",
					"أذربيهشت",
					"خرداد",
					"تار",
					"مرداد",
					"شهرفار",
					"مهر",
					"آيان",
					"آذر",
					"دي",
					"بهمن",
					"اسفندار"
				],
				"narrow": [
					"1",
					"2",
					"3",
					"4",
					"5",
					"6",
					"7",
					"8",
					"9",
					"10",
					"11",
					"12"
				],
				"wide": [
					"فرفردن",
					"أذربيهشت",
					"خرداد",
					"تار",
					"مرداد",
					"شهرفار",
					"مهر",
					"آيان",
					"آذر",
					"دي",
					"بهمن",
					"اسفندار"
				]
			},
			"stand-alone": {
				"abbreviated": [
					"فرفردن",
					"أذربيهشت",
					"خرداد",
					"تار",
					"مرداد",
					"شهرفار",
					"مهر",
					"آيان",
					"آذر",
					"دي",
					"بهمن",
					"اسفندار"
				],
				"narrow": [
					"1",
					"2",
					"3",
					"4",
					"5",
					"6",
					"7",
					"8",
					"9",
					"10",
					"11",
					"12"
				],
				"wide": [
					"فرفردن",
					"أذربيهشت",
					"خرداد",
					"تار",
					"مرداد",
					"شهرفار",
					"مهر",
					"آيان",
					"آذر",
					"دي",
					"بهمن",
					"اسفندار"
				]
			}
		},
		"days": {
			"format": {
				"abbreviated": [
					"الأحد",
					"الاثنين",
					"الثلاثاء",
					"الأربعاء",
					"الخميس",
					"الجمعة",
					"السبت"
				],
				"narrow": [
					"ح",
					"ن",
					"ث",
					"ر",
					"خ",
					"ج",
					"س"
				],
				"short": [
					"الأحد",
					"الاثنين",
					"الثلاثاء",
					"الأربعاء",
					"الخميس",
					"الجمعة",
					"السبت"
				],
				"wide": [
					"الأحد",
					"الاثنين",
					"الثلاثاء",
					"الأربعاء",
					"الخميس",
					"الجمعة",
					"السبت"
				]
			},
			"stand-alone": {
				"abbreviated": [
					"الأحد",
					"الاثنين",
					"الثلاثاء",
					"الأربعاء",
					"الخميس",
					"الجمعة",
					"السبت"
				],
				"narrow": [
					"ح",
					"ن",
					"ث",
					"ر",
					"خ",
					"ج",
					"س"
				],
				"short": [
					"الأحد",
					"الاثنين",
					"الثلاثاء",
					"الأربعاء",
					"الخميس",
					"الجمعة",
					"السبت"
				],
				"wide": [
					"الأحد",
					"الاثنين",
					"الثلاثاء",
					"الأربعاء",
					"الخميس",
					"الجمعة",
					"السبت"
				]
			}
		},
		"quarters": {
			"format": {
				"abbreviated": [
					"الربع الأول",
					"الربع الثاني",
					"الربع الثالث",
					"الربع الرابع"
				],
				"narrow": [
					"١",
					"٢",
					"٣",
					"٤"
				],
				"wide": [
					"الربع الأول",
					"الربع الثاني",
					"الربع الثالث",
					"الربع الرابع"
				]
			},
			"stand-alone": {
				"abbreviated": [
					"الربع الأول",
					"الربع الثاني",
					"الربع الثالث",
					"الربع الرابع"
				],
				"narrow": [
					"١",
					"٢",
					"٣",
					"٤"
				],
				"wide": [
					"الربع الأول",
					"الربع الثاني",
					"الربع الثالث",
					"الربع الرابع"
				]
			}
		},
		"dayPeriods": {
			"format": {
				"abbreviated": [
					"ص",
					"م"
				],
				"narrow": [
					"ص",
					"م"
				],
				"wide": [
					"ص",
					"م"
				]
			},
			"stand-alone": {
				"abbreviated": [
					"ص",
					"م"
				],
				"narrow": [
					"ص",
					"م"
				],
				"wide": [
					"صباحًا",
					"مساءً"
				]
			}
		},
		"era-wide": {
			"0": "ه‍.ش"
		},
		"era-abbreviated": {
			"0": "ه‍.ش"
		},
		"era-narrow": {
			"0": "ه‍.ش"
		}
	},
	"dateFields": {
		"era": {
			"displayName": "العصر"
		},
		"year-wide": {
			"displayName": "السنة",
			"relative-type--1": "السنة الماضية",
			"relative-type-0": "السنة الحالية",
			"relative-type-1": "السنة التالية",
			"relativeTime-type-future": {
				"relativeTimePattern-count-zero": "خلال {0} سنة",
				"relativeTimePattern-count-one": "خلال سنة واحدة",
				"relativeTimePattern-count-two": "خلال سنتين",
				"relativeTimePattern-count-few": "خلال {0} سنوات",
				"relativeTimePattern-count-many": "خلال {0} سنة",
				"relativeTimePattern-count-other": "خلال {0} سنة"
			},
			"relativeTime-type-past": {
				"relativeTimePattern-count-zero": "قبل {0} سنة",
				"relativeTimePattern-count-one": "قبل سنة واحدة",
				"relativeTimePattern-count-two": "قبل سنتين",
				"relativeTimePattern-count-few": "قبل {0} سنوات",
				"relativeTimePattern-count-many": "قبل {0} سنة",
				"relativeTimePattern-count-other": "قبل {0} سنة"
			}
		},
		"year-short": {
			"displayName": "السنة",
			"relative-type--1": "السنة الماضية",
			"relative-type-0": "السنة الحالية",
			"relative-type-1": "السنة التالية",
			"relativeTime-type-future": {
				"relativeTimePattern-count-zero": "خلال {0} سنة",
				"relativeTimePattern-count-one": "خلال سنة واحدة",
				"relativeTimePattern-count-two": "خلال سنتين",
				"relativeTimePattern-count-few": "خلال {0} سنوات",
				"relativeTimePattern-count-many": "خلال {0} سنة",
				"relativeTimePattern-count-other": "خلال {0} سنة"
			},
			"relativeTime-type-past": {
				"relativeTimePattern-count-zero": "قبل {0} سنة",
				"relativeTimePattern-count-one": "قبل سنة واحدة",
				"relativeTimePattern-count-two": "قبل سنتين",
				"relativeTimePattern-count-few": "قبل {0} سنوات",
				"relativeTimePattern-count-many": "قبل {0} سنة",
				"relativeTimePattern-count-other": "قبل {0} سنة"
			}
		},
		"year-narrow": {
			"displayName": "السنة",
			"relative-type--1": "السنة الماضية",
			"relative-type-0": "السنة الحالية",
			"relative-type-1": "السنة التالية",
			"relativeTime-type-future": {
				"relativeTimePattern-count-zero": "خلال {0} سنة",
				"relativeTimePattern-count-one": "خلال سنة واحدة",
				"relativeTimePattern-count-two": "خلال سنتين",
				"relativeTimePattern-count-few": "خلال {0} سنوات",
				"relativeTimePattern-count-many": "خلال {0} سنة",
				"relativeTimePattern-count-other": "خلال {0} سنة"
			},
			"relativeTime-type-past": {
				"relativeTimePattern-count-zero": "قبل {0} سنة",
				"relativeTimePattern-count-one": "قبل سنة واحدة",
				"relativeTimePattern-count-two": "قبل سنتين",
				"relativeTimePattern-count-few": "قبل {0} سنوات",
				"relativeTimePattern-count-many": "قبل {0} سنة",
				"relativeTimePattern-count-other": "قبل {0} سنة"
			}
		},
		"quarter-wide": {
			"displayName": "ربع السنة",
			"relative-type--1": "الربع الأخير",
			"relative-type-0": "هذا الربع",
			"relative-type-1": "الربع القادم",
			"relativeTime-type-future": {
				"relativeTimePattern-count-zero": "خلال {0} ربع سنة",
				"relativeTimePattern-count-one": "خلال ربع سنة واحد",
				"relativeTimePattern-count-two": "خلال ربعي سنة",
				"relativeTimePattern-count-few": "خلال {0} أرباع سنة",
				"relativeTimePattern-count-many": "خلال {0} ربع سنة",
				"relativeTimePattern-count-other": "خلال {0} ربع سنة"
			},
			"relativeTime-type-past": {
				"relativeTimePattern-count-zero": "قبل {0} ربع سنة",
				"relativeTimePattern-count-one": "قبل ربع سنة واحد",
				"relativeTimePattern-count-two": "قبل ربعي سنة",
				"relativeTimePattern-count-few": "قبل {0} أرباع سنة",
				"relativeTimePattern-count-many": "قبل {0} ربع سنة",
				"relativeTimePattern-count-other": "قبل {0} ربع سنة"
			}
		},
		"quarter-short": {
			"displayName": "ربع السنة",
			"relative-type--1": "الربع الأخير",
			"relative-type-0": "هذا الربع",
			"relative-type-1": "الربع القادم",
			"relativeTime-type-future": {
				"relativeTimePattern-count-zero": "خلال {0} ربع سنة",
				"relativeTimePattern-count-one": "خلال ربع سنة واحد",
				"relativeTimePattern-count-two": "خلال ربعي سنة",
				"relativeTimePattern-count-few": "خلال {0} أرباع سنة",
				"relativeTimePattern-count-many": "خلال {0} ربع سنة",
				"relativeTimePattern-count-other": "خلال {0} ربع سنة"
			},
			"relativeTime-type-past": {
				"relativeTimePattern-count-zero": "قبل {0} ربع سنة",
				"relativeTimePattern-count-one": "قبل ربع سنة واحد",
				"relativeTimePattern-count-two": "قبل ربعي سنة",
				"relativeTimePattern-count-few": "قبل {0} أرباع سنة",
				"relativeTimePattern-count-many": "قبل {0} ربع سنة",
				"relativeTimePattern-count-other": "قبل {0} ربع سنة"
			}
		},
		"quarter-narrow": {
			"displayName": "ربع السنة",
			"relative-type--1": "الربع الأخير",
			"relative-type-0": "هذا الربع",
			"relative-type-1": "الربع القادم",
			"relativeTime-type-future": {
				"relativeTimePattern-count-zero": "خلال {0} ربع سنة",
				"relativeTimePattern-count-one": "خلال ربع سنة واحد",
				"relativeTimePattern-count-two": "خلال ربعي سنة",
				"relativeTimePattern-count-few": "خلال {0} أرباع سنة",
				"relativeTimePattern-count-many": "خلال {0} ربع سنة",
				"relativeTimePattern-count-other": "خلال {0} ربع سنة"
			},
			"relativeTime-type-past": {
				"relativeTimePattern-count-zero": "قبل {0} ربع سنة",
				"relativeTimePattern-count-one": "قبل ربع سنة واحد",
				"relativeTimePattern-count-two": "قبل ربعي سنة",
				"relativeTimePattern-count-few": "قبل {0} أرباع سنة",
				"relativeTimePattern-count-many": "قبل {0} ربع سنة",
				"relativeTimePattern-count-other": "قبل {0} ربع سنة"
			}
		},
		"month-wide": {
			"displayName": "الشهر",
			"relative-type--1": "الشهر الماضي",
			"relative-type-0": "هذا الشهر",
			"relative-type-1": "الشهر التالي",
			"relativeTime-type-future": {
				"relativeTimePattern-count-zero": "خلال {0} شهر",
				"relativeTimePattern-count-one": "خلال شهر واحد",
				"relativeTimePattern-count-two": "خلال شهرين",
				"relativeTimePattern-count-few": "خلال {0} أشهر",
				"relativeTimePattern-count-many": "خلال {0} شهرًا",
				"relativeTimePattern-count-other": "خلال {0} شهر"
			},
			"relativeTime-type-past": {
				"relativeTimePattern-count-zero": "قبل {0} شهر",
				"relativeTimePattern-count-one": "قبل شهر واحد",
				"relativeTimePattern-count-two": "قبل شهرين",
				"relativeTimePattern-count-few": "قبل {0} أشهر",
				"relativeTimePattern-count-many": "قبل {0} شهرًا",
				"relativeTimePattern-count-other": "قبل {0} شهر"
			}
		},
		"month-short": {
			"displayName": "الشهر",
			"relative-type--1": "الشهر الماضي",
			"relative-type-0": "هذا الشهر",
			"relative-type-1": "الشهر التالي",
			"relativeTime-type-future": {
				"relativeTimePattern-count-zero": "خلال {0} شهر",
				"relativeTimePattern-count-one": "خلال شهر واحد",
				"relativeTimePattern-count-two": "خلال شهرين",
				"relativeTimePattern-count-few": "خلال {0} أشهر",
				"relativeTimePattern-count-many": "خلال {0} شهرًا",
				"relativeTimePattern-count-other": "خلال {0} شهر"
			},
			"relativeTime-type-past": {
				"relativeTimePattern-count-zero": "قبل {0} شهر",
				"relativeTimePattern-count-one": "قبل شهر واحد",
				"relativeTimePattern-count-two": "قبل شهرين",
				"relativeTimePattern-count-few": "خلال {0} أشهر",
				"relativeTimePattern-count-many": "قبل {0} شهرًا",
				"relativeTimePattern-count-other": "قبل {0} شهر"
			}
		},
		"month-narrow": {
			"displayName": "الشهر",
			"relative-type--1": "الشهر الماضي",
			"relative-type-0": "هذا الشهر",
			"relative-type-1": "الشهر التالي",
			"relativeTime-type-future": {
				"relativeTimePattern-count-zero": "خلال {0} شهر",
				"relativeTimePattern-count-one": "خلال شهر واحد",
				"relativeTimePattern-count-two": "خلال شهرين",
				"relativeTimePattern-count-few": "خلال {0} أشهر",
				"relativeTimePattern-count-many": "خلال {0} شهرًا",
				"relativeTimePattern-count-other": "خلال {0} شهر"
			},
			"relativeTime-type-past": {
				"relativeTimePattern-count-zero": "قبل {0} شهر",
				"relativeTimePattern-count-one": "قبل شهر واحد",
				"relativeTimePattern-count-two": "قبل شهرين",
				"relativeTimePattern-count-few": "قبل {0} أشهر",
				"relativeTimePattern-count-many": "قبل {0} شهرًا",
				"relativeTimePattern-count-other": "قبل {0} شهر"
			}
		},
		"week-wide": {
			"displayName": "الأسبوع",
			"relative-type--1": "الأسبوع الماضي",
			"relative-type-0": "هذا الأسبوع",
			"relative-type-1": "الأسبوع التالي",
			"relativeTime-type-future": {
				"relativeTimePattern-count-zero": "خلال {0} أسبوع",
				"relativeTimePattern-count-one": "خلال أسبوع واحد",
				"relativeTimePattern-count-two": "خلال أسبوعين",
				"relativeTimePattern-count-few": "خلال {0} أسابيع",
				"relativeTimePattern-count-many": "خلال {0} أسبوعًا",
				"relativeTimePattern-count-other": "خلال {0} أسبوع"
			},
			"relativeTime-type-past": {
				"relativeTimePattern-count-zero": "قبل {0} أسبوع",
				"relativeTimePattern-count-one": "قبل أسبوع واحد",
				"relativeTimePattern-count-two": "قبل أسبوعين",
				"relativeTimePattern-count-few": "قبل {0} أسابيع",
				"relativeTimePattern-count-many": "قبل {0} أسبوعًا",
				"relativeTimePattern-count-other": "قبل {0} أسبوع"
			}
		},
		"week-short": {
			"displayName": "الأسبوع",
			"relative-type--1": "الأسبوع الماضي",
			"relative-type-0": "هذا الأسبوع",
			"relative-type-1": "الأسبوع التالي",
			"relativeTime-type-future": {
				"relativeTimePattern-count-zero": "خلال {0} أسبوع",
				"relativeTimePattern-count-one": "خلال أسبوع واحد",
				"relativeTimePattern-count-two": "خلال {0} أسبوعين",
				"relativeTimePattern-count-few": "خلال {0} أسابيع",
				"relativeTimePattern-count-many": "خلال {0} أسبوعًا",
				"relativeTimePattern-count-other": "خلال {0} أسبوع"
			},
			"relativeTime-type-past": {
				"relativeTimePattern-count-zero": "قبل {0} أسبوع",
				"relativeTimePattern-count-one": "قبل أسبوع واحد",
				"relativeTimePattern-count-two": "قبل أسبوعين",
				"relativeTimePattern-count-few": "قبل {0} أسابيع",
				"relativeTimePattern-count-many": "قبل {0} أسبوعًا",
				"relativeTimePattern-count-other": "قبل {0} أسبوع"
			}
		},
		"week-narrow": {
			"displayName": "الأسبوع",
			"relative-type--1": "الأسبوع الماضي",
			"relative-type-0": "هذا الأسبوع",
			"relative-type-1": "الأسبوع التالي",
			"relativeTime-type-future": {
				"relativeTimePattern-count-zero": "خلال {0} أسبوع",
				"relativeTimePattern-count-one": "خلال أسبوع واحد",
				"relativeTimePattern-count-two": "خلال أسبوعين",
				"relativeTimePattern-count-few": "خلال {0} أسابيع",
				"relativeTimePattern-count-many": "خلال {0} أسبوعًا",
				"relativeTimePattern-count-other": "خلال {0} أسبوع"
			},
			"relativeTime-type-past": {
				"relativeTimePattern-count-zero": "قبل {0} أسبوع",
				"relativeTimePattern-count-one": "قبل أسبوع واحد",
				"relativeTimePattern-count-two": "قبل أسبوعين",
				"relativeTimePattern-count-few": "قبل {0} أسابيع",
				"relativeTimePattern-count-many": "قبل {0} أسبوعًا",
				"relativeTimePattern-count-other": "قبل {0} أسبوع"
			}
		},
		"day-wide": {
			"displayName": "يوم",
			"relative-type--2": "أول أمس",
			"relative-type--1": "أمس",
			"relative-type-0": "اليوم",
			"relative-type-1": "غدًا",
			"relative-type-2": "بعد الغد",
			"relativeTime-type-future": {
				"relativeTimePattern-count-zero": "خلال {0} يوم",
				"relativeTimePattern-count-one": "خلال يوم واحد",
				"relativeTimePattern-count-two": "خلال يومين",
				"relativeTimePattern-count-few": "خلال {0} أيام",
				"relativeTimePattern-count-many": "خلال {0} يومًا",
				"relativeTimePattern-count-other": "خلال {0} يوم"
			},
			"relativeTime-type-past": {
				"relativeTimePattern-count-zero": "قبل {0} يوم",
				"relativeTimePattern-count-one": "قبل يوم واحد",
				"relativeTimePattern-count-two": "قبل يومين",
				"relativeTimePattern-count-few": "قبل {0} أيام",
				"relativeTimePattern-count-many": "قبل {0} يومًا",
				"relativeTimePattern-count-other": "قبل {0} يوم"
			}
		},
		"day-short": {
			"displayName": "يوم",
			"relative-type--2": "أول أمس",
			"relative-type--1": "أمس",
			"relative-type-0": "اليوم",
			"relative-type-1": "غدًا",
			"relative-type-2": "بعد الغد",
			"relativeTime-type-future": {
				"relativeTimePattern-count-zero": "خلال {0} يوم",
				"relativeTimePattern-count-one": "خلال يوم واحد",
				"relativeTimePattern-count-two": "خلال يومين",
				"relativeTimePattern-count-few": "خلال {0} أيام",
				"relativeTimePattern-count-many": "خلال {0} يومًا",
				"relativeTimePattern-count-other": "خلال {0} يوم"
			},
			"relativeTime-type-past": {
				"relativeTimePattern-count-zero": "قبل {0} يوم",
				"relativeTimePattern-count-one": "قبل يوم واحد",
				"relativeTimePattern-count-two": "قبل يومين",
				"relativeTimePattern-count-few": "قبل {0} أيام",
				"relativeTimePattern-count-many": "قبل {0} يومًا",
				"relativeTimePattern-count-other": "قبل {0} يوم"
			}
		},
		"day-narrow": {
			"displayName": "يوم",
			"relative-type--2": "أول أمس",
			"relative-type--1": "أمس",
			"relative-type-0": "اليوم",
			"relative-type-1": "غدًا",
			"relative-type-2": "بعد الغد",
			"relativeTime-type-future": {
				"relativeTimePattern-count-zero": "خلال {0} يوم",
				"relativeTimePattern-count-one": "خلال يوم واحد",
				"relativeTimePattern-count-two": "خلال يومين",
				"relativeTimePattern-count-few": "خلال {0} أيام",
				"relativeTimePattern-count-many": "خلال {0} يومًا",
				"relativeTimePattern-count-other": "خلال {0} يوم"
			},
			"relativeTime-type-past": {
				"relativeTimePattern-count-zero": "قبل {0} يوم",
				"relativeTimePattern-count-one": "قبل يوم واحد",
				"relativeTimePattern-count-two": "قبل يومين",
				"relativeTimePattern-count-few": "قبل {0} أيام",
				"relativeTimePattern-count-many": "قبل {0} يومًا",
				"relativeTimePattern-count-other": "قبل {0} يوم"
			}
		},
		"weekday": {
			"displayName": "اليوم"
		},
		"hour-wide": {
			"displayName": "الساعات",
			"relativeTime-type-future": {
				"relativeTimePattern-count-zero": "خلال {0} ساعة",
				"relativeTimePattern-count-one": "خلال ساعة واحدة",
				"relativeTimePattern-count-two": "خلال ساعتين",
				"relativeTimePattern-count-few": "خلال {0} ساعات",
				"relativeTimePattern-count-many": "خلال {0} ساعة",
				"relativeTimePattern-count-other": "خلال {0} ساعة"
			},
			"relativeTime-type-past": {
				"relativeTimePattern-count-zero": "قبل {0} ساعة",
				"relativeTimePattern-count-one": "قبل ساعة واحدة",
				"relativeTimePattern-count-two": "قبل ساعتين",
				"relativeTimePattern-count-few": "قبل {0} ساعات",
				"relativeTimePattern-count-many": "قبل {0} ساعة",
				"relativeTimePattern-count-other": "قبل {0} ساعة"
			}
		},
		"hour-short": {
			"displayName": "الساعات",
			"relativeTime-type-future": {
				"relativeTimePattern-count-zero": "خلال {0} ساعة",
				"relativeTimePattern-count-one": "خلال ساعة واحدة",
				"relativeTimePattern-count-two": "خلال ساعتين",
				"relativeTimePattern-count-few": "خلال {0} ساعات",
				"relativeTimePattern-count-many": "خلال {0} ساعة",
				"relativeTimePattern-count-other": "خلال {0} ساعة"
			},
			"relativeTime-type-past": {
				"relativeTimePattern-count-zero": "قبل {0} ساعة",
				"relativeTimePattern-count-one": "قبل ساعة واحدة",
				"relativeTimePattern-count-two": "قبل ساعتين",
				"relativeTimePattern-count-few": "قبل {0} ساعات",
				"relativeTimePattern-count-many": "قبل {0} ساعة",
				"relativeTimePattern-count-other": "قبل {0} ساعة"
			}
		},
		"hour-narrow": {
			"displayName": "الساعات",
			"relativeTime-type-future": {
				"relativeTimePattern-count-zero": "خلال {0} ساعة",
				"relativeTimePattern-count-one": "خلال ساعة واحدة",
				"relativeTimePattern-count-two": "خلال ساعتين",
				"relativeTimePattern-count-few": "خلال {0} ساعات",
				"relativeTimePattern-count-many": "خلال {0} ساعة",
				"relativeTimePattern-count-other": "خلال {0} ساعة"
			},
			"relativeTime-type-past": {
				"relativeTimePattern-count-zero": "قبل {0} ساعة",
				"relativeTimePattern-count-one": "قبل ساعة واحدة",
				"relativeTimePattern-count-two": "قبل ساعتين",
				"relativeTimePattern-count-few": "قبل {0} ساعات",
				"relativeTimePattern-count-many": "قبل {0} ساعة",
				"relativeTimePattern-count-other": "قبل {0} ساعة"
			}
		},
		"minute-wide": {
			"displayName": "الدقائق",
			"relativeTime-type-future": {
				"relativeTimePattern-count-zero": "خلال {0} دقيقة",
				"relativeTimePattern-count-one": "خلال دقيقة واحدة",
				"relativeTimePattern-count-two": "خلال دقيقتين",
				"relativeTimePattern-count-few": "خلال {0} دقائق",
				"relativeTimePattern-count-many": "خلال {0} دقيقة",
				"relativeTimePattern-count-other": "خلال {0} دقيقة"
			},
			"relativeTime-type-past": {
				"relativeTimePattern-count-zero": "قبل {0} دقيقة",
				"relativeTimePattern-count-one": "قبل دقيقة واحدة",
				"relativeTimePattern-count-two": "قبل دقيقتين",
				"relativeTimePattern-count-few": "قبل {0} دقائق",
				"relativeTimePattern-count-many": "قبل {0} دقيقة",
				"relativeTimePattern-count-other": "قبل {0} دقيقة"
			}
		},
		"minute-short": {
			"displayName": "الدقائق",
			"relativeTime-type-future": {
				"relativeTimePattern-count-zero": "خلال {0} دقيقة",
				"relativeTimePattern-count-one": "خلال دقيقة واحدة",
				"relativeTimePattern-count-two": "خلال دقيقتين",
				"relativeTimePattern-count-few": "خلال {0} دقائق",
				"relativeTimePattern-count-many": "خلال {0} دقيقة",
				"relativeTimePattern-count-other": "خلال {0} دقيقة"
			},
			"relativeTime-type-past": {
				"relativeTimePattern-count-zero": "قبل {0} دقيقة",
				"relativeTimePattern-count-one": "قبل دقيقة واحدة",
				"relativeTimePattern-count-two": "قبل دقيقتين",
				"relativeTimePattern-count-few": "قبل {0} دقائق",
				"relativeTimePattern-count-many": "قبل {0} دقيقة",
				"relativeTimePattern-count-other": "قبل {0} دقيقة"
			}
		},
		"minute-narrow": {
			"displayName": "الدقائق",
			"relativeTime-type-future": {
				"relativeTimePattern-count-zero": "خلال {0} دقيقة",
				"relativeTimePattern-count-one": "خلال دقيقة واحدة",
				"relativeTimePattern-count-two": "خلال دقيقتين",
				"relativeTimePattern-count-few": "خلال {0} دقائق",
				"relativeTimePattern-count-many": "خلال {0} دقيقة",
				"relativeTimePattern-count-other": "خلال {0} دقيقة"
			},
			"relativeTime-type-past": {
				"relativeTimePattern-count-zero": "قبل {0} دقيقة",
				"relativeTimePattern-count-one": "قبل دقيقة واحدة",
				"relativeTimePattern-count-two": "قبل دقيقتين",
				"relativeTimePattern-count-few": "قبل {0} دقائق",
				"relativeTimePattern-count-many": "قبل {0} دقيقة",
				"relativeTimePattern-count-other": "قبل {0} دقيقة"
			}
		},
		"second-wide": {
			"displayName": "الثواني",
			"relative-type-0": "الآن",
			"relativeTime-type-future": {
				"relativeTimePattern-count-zero": "خلال {0} ثانية",
				"relativeTimePattern-count-one": "خلال ثانية واحدة",
				"relativeTimePattern-count-two": "خلال ثانيتين",
				"relativeTimePattern-count-few": "خلال {0} ثوانِ",
				"relativeTimePattern-count-many": "خلال {0} ثانية",
				"relativeTimePattern-count-other": "خلال {0} ثانية"
			},
			"relativeTime-type-past": {
				"relativeTimePattern-count-zero": "قبل {0} ثانية",
				"relativeTimePattern-count-one": "قبل ثانية واحدة",
				"relativeTimePattern-count-two": "قبل ثانيتين",
				"relativeTimePattern-count-few": "قبل {0} ثوانِ",
				"relativeTimePattern-count-many": "قبل {0} ثانية",
				"relativeTimePattern-count-other": "قبل {0} ثانية"
			}
		},
		"second-short": {
			"displayName": "الثواني",
			"relative-type-0": "الآن",
			"relativeTime-type-future": {
				"relativeTimePattern-count-zero": "خلال {0} ثانية",
				"relativeTimePattern-count-one": "خلال ثانية واحدة",
				"relativeTimePattern-count-two": "خلال ثانيتين",
				"relativeTimePattern-count-few": "خلال {0} ثوانٍ",
				"relativeTimePattern-count-many": "خلال {0} ثانية",
				"relativeTimePattern-count-other": "خلال {0} ثانية"
			},
			"relativeTime-type-past": {
				"relativeTimePattern-count-zero": "قبل {0} ثانية",
				"relativeTimePattern-count-one": "قبل ثانية واحدة",
				"relativeTimePattern-count-two": "قبل ثانيتين",
				"relativeTimePattern-count-few": "قبل {0} ثوانٍ",
				"relativeTimePattern-count-many": "قبل {0} ثانية",
				"relativeTimePattern-count-other": "قبل {0} ثانية"
			}
		},
		"second-narrow": {
			"displayName": "الثواني",
			"relative-type-0": "الآن",
			"relativeTime-type-future": {
				"relativeTimePattern-count-zero": "خلال {0} ثانية",
				"relativeTimePattern-count-one": "خلال ثانية واحدة",
				"relativeTimePattern-count-two": "خلال ثانيتين",
				"relativeTimePattern-count-few": "خلال {0} ثوانٍ",
				"relativeTimePattern-count-many": "خلال {0} ثانية",
				"relativeTimePattern-count-other": "خلال {0} ثانية"
			},
			"relativeTime-type-past": {
				"relativeTimePattern-count-zero": "قبل {0} ثانية",
				"relativeTimePattern-count-one": "قبل ثانية واحدة",
				"relativeTimePattern-count-two": "قبل ثانيتين",
				"relativeTimePattern-count-few": "قبل {0} ثوانٍ",
				"relativeTimePattern-count-many": "قبل {0} ثانية",
				"relativeTimePattern-count-other": "قبل {0} ثانية"
			}
		},
		"zone": {
			"displayName": "التوقيت"
		}
	},
	"decimalFormat": {
		"standard": "#,##0.###"
	},
	"decimalFormat-long": {
		"1000-zero": "0 ألف",
		"1000-one": "0 ألف",
		"1000-two": "0 ألف",
		"1000-few": "0 آلاف",
		"1000-many": "0 ألف",
		"1000-other": "0 ألف",
		"10000-zero": "00 ألف",
		"10000-one": "00 ألف",
		"10000-two": "00 ألف",
		"10000-few": "00 ألف",
		"10000-many": "00 ألف",
		"10000-other": "00 ألف",
		"100000-zero": "000 ألف",
		"100000-one": "000 ألف",
		"100000-two": "000 ألف",
		"100000-few": "000 ألف",
		"100000-many": "000 ألف",
		"100000-other": "000 ألف",
		"1000000-zero": "0 مليون",
		"1000000-one": "0 مليون",
		"1000000-two": "0 مليون",
		"1000000-few": "0 ملايين",
		"1000000-many": "0 مليون",
		"1000000-other": "0 مليون",
		"10000000-zero": "00 مليون",
		"10000000-one": "00 مليون",
		"10000000-two": "00 مليون",
		"10000000-few": "00 ملايين",
		"10000000-many": "00 مليون",
		"10000000-other": "00 مليون",
		"100000000-zero": "000 مليون",
		"100000000-one": "000 مليون",
		"100000000-two": "000 مليون",
		"100000000-few": "000 مليون",
		"100000000-many": "000 مليون",
		"100000000-other": "000 مليون",
		"1000000000-zero": "0 مليار",
		"1000000000-one": "0 مليار",
		"1000000000-two": "0 مليار",
		"1000000000-few": "0 مليار",
		"1000000000-many": "0 مليار",
		"1000000000-other": "0 مليار",
		"10000000000-zero": "00 مليار",
		"10000000000-one": "00 مليار",
		"10000000000-two": "00 مليار",
		"10000000000-few": "00 مليار",
		"10000000000-many": "00 مليار",
		"10000000000-other": "00 مليار",
		"100000000000-zero": "000 مليار",
		"100000000000-one": "000 مليار",
		"100000000000-two": "000 مليار",
		"100000000000-few": "000 مليار",
		"100000000000-many": "000 مليار",
		"100000000000-other": "000 مليار",
		"1000000000000-zero": "0 تريليون",
		"1000000000000-one": "0 تريليون",
		"1000000000000-two": "0 تريليون",
		"1000000000000-few": "0 تريليونات",
		"1000000000000-many": "0 تريليون",
		"1000000000000-other": "0 تريليون",
		"10000000000000-zero": "00 تريليون",
		"10000000000000-one": "00 تريليون",
		"10000000000000-two": "00 تريليون",
		"10000000000000-few": "00 تريليون",
		"10000000000000-many": "00 تريليون",
		"10000000000000-other": "00 تريليون",
		"100000000000000-zero": "000 تريليون",
		"100000000000000-one": "000 تريليون",
		"100000000000000-two": "000 تريليون",
		"100000000000000-few": "000 تريليون",
		"100000000000000-many": "000 تريليون",
		"100000000000000-other": "000 تريليون"
	},
	"decimalFormat-short": {
		"1000-zero": "0 ألف",
		"1000-one": "0 ألف",
		"1000-two": "0 ألف",
		"1000-few": "0 آلاف",
		"1000-many": "0 ألف",
		"1000-other": "0 ألف",
		"10000-zero": "00 ألف",
		"10000-one": "00 ألف",
		"10000-two": "00 ألف",
		"10000-few": "00 ألف",
		"10000-many": "00 ألف",
		"10000-other": "00 ألف",
		"100000-zero": "000 ألف",
		"100000-one": "000 ألف",
		"100000-two": "000 ألف",
		"100000-few": "000 ألف",
		"100000-many": "000 ألف",
		"100000-other": "000 ألف",
		"1000000-zero": "0 مليون",
		"1000000-one": "0 مليون",
		"1000000-two": "0 مليون",
		"1000000-few": "0 ملايين",
		"1000000-many": "0 مليون",
		"1000000-other": "0 مليون",
		"10000000-zero": "00 مليون",
		"10000000-one": "00 مليون",
		"10000000-two": "00 مليون",
		"10000000-few": "00 ملايين",
		"10000000-many": "00 مليون",
		"10000000-other": "00 مليون",
		"100000000-zero": "000 مليون",
		"100000000-one": "000 مليون",
		"100000000-two": "000 مليون",
		"100000000-few": "000 مليون",
		"100000000-many": "000 مليون",
		"100000000-other": "000 مليون",
		"1000000000-zero": "0 مليار",
		"1000000000-one": "0 مليار",
		"1000000000-two": "0 مليار",
		"1000000000-few": "0 مليار",
		"1000000000-many": "0 مليار",
		"1000000000-other": "0 مليار",
		"10000000000-zero": "00 مليار",
		"10000000000-one": "00 مليار",
		"10000000000-two": "00 مليار",
		"10000000000-few": "00 مليار",
		"10000000000-many": "00 مليار",
		"10000000000-other": "00 مليار",
		"100000000000-zero": "000 مليار",
		"100000000000-one": "000 مليار",
		"100000000000-two": "000 مليار",
		"100000000000-few": "000 مليار",
		"100000000000-many": "000 مليار",
		"100000000000-other": "000 مليار",
		"1000000000000-zero": "0 تريليون",
		"1000000000000-one": "0 تريليون",
		"1000000000000-two": "0 تريليون",
		"1000000000000-few": "0 تريليونات",
		"1000000000000-many": "0 تريليون",
		"1000000000000-other": "0 تريليون",
		"10000000000000-zero": "00 تريليون",
		"10000000000000-one": "00 تريليون",
		"10000000000000-two": "00 تريليون",
		"10000000000000-few": "00 تريليون",
		"10000000000000-many": "00 تريليون",
		"10000000000000-other": "00 تريليون",
		"100000000000000-zero": "000 تريليون",
		"100000000000000-one": "000 تريليون",
		"100000000000000-two": "000 تريليون",
		"100000000000000-few": "000 تريليون",
		"100000000000000-many": "000 تريليون",
		"100000000000000-other": "000 تريليون"
	},
	"scientificFormat": {
		"standard": "#E0"
	},
	"percentFormat": {
		"standard": "#,##0%"
	},
	"currencyFormat": {
		"standard": "¤ #,##0.00",
		"accounting": "¤#,##0.00;(¤#,##0.00)",
		"currencySpacing": {
			"beforeCurrency": {
				"currencyMatch": "[:^S:]",
				"surroundingMatch": "[:digit:]",
				"insertBetween": " "
			},
			"afterCurrency": {
				"currencyMatch": "[:^S:]",
				"surroundingMatch": "[:digit:]",
				"insertBetween": " "
			}
		}
	},
	"symbols-latn-decimal": ".",
	"symbols-latn-group": ",",
	"symbols-latn-list": ";",
	"symbols-latn-percentSign": "٪",
	"symbols-latn-plusSign": "‎+",
	"symbols-latn-minusSign": "‎-",
	"symbols-latn-exponential": "E",
	"symbols-latn-superscriptingExponent": "×",
	"symbols-latn-perMille": "‰",
	"symbols-latn-infinity": "∞",
	"symbols-latn-nan": "ليس رقمًا",
	"symbols-latn-timeSeparator": ":",
	"currencySymbols": {
		"AED": "د.إ.‏",
		"AUD": "AU$",
		"BHD": "د.ب.‏",
		"BRL": "R$",
		"CAD": "CA$",
		"CNY": "CN¥",
		"DZD": "د.ج.‏",
		"EGP": "ج.م.‏",
		"EUR": "€",
		"GBP": "£",
		"HKD": "HK$",
		"IDR": "ر.إن.",
		"ILS": "₪",
		"INR": "₹",
		"IQD": "د.ع.‏",
		"IRR": "ر.إ.",
		"JOD": "د.أ.‏",
		"JPY": "JP¥",
		"KMF": "ف.ج.ق.‏",
		"KRW": "₩",
		"KWD": "د.ك.‏",
		"LBP": "ل.ل.‏",
		"LYD": "د.ل.‏",
		"MAD": "د.م.‏",
		"MRO": "أ.م.‏",
		"MXN": "MX$",
		"NZD": "NZ$",
		"OMR": "ر.ع.‏",
		"PKR": "ر.ب.",
		"QAR": "ر.ق.‏",
		"SAR": "ر.س.‏",
		"SDD": "د.س.‏",
		"SDG": "ج.س.",
		"SSP": "ج.ج.س.",
		"SYP": "ل.س.‏",
		"THB": "฿",
		"TND": "د.ت.‏",
		"TRY": "ل.ت.",
		"TWD": "NT$",
		"USD": "US$",
		"VND": "₫",
		"XAF": "FCFA",
		"XCD": "EC$",
		"XOF": "CFA",
		"XPF": "CFPF",
		"XXX": "***",
		"YER": "ر.ي.‏"
	},
	"currencyDigits": {
		"ADP": 0,
		"AFN": 0,
		"ALL": 0,
		"AMD": 0,
		"BHD": 3,
		"BIF": 0,
		"BYR": 0,
		"CAD": 2,
		"CHF": 2,
		"CLF": 4,
		"CLP": 0,
		"COP": 0,
		"CRC": 0,
		"CZK": 0,
		"DEFAULT": 2,
		"DJF": 0,
		"ESP": 0,
		"GNF": 0,
		"GYD": 0,
		"HUF": 0,
		"IDR": 0,
		"IQD": 0,
		"IRR": 0,
		"ISK": 0,
		"ITL": 0,
		"JOD": 3,
		"JPY": 0,
		"KMF": 0,
		"KPW": 0,
		"KRW": 0,
		"KWD": 3,
		"LAK": 0,
		"LBP": 0,
		"LUF": 0,
		"LYD": 3,
		"MGA": 0,
		"MGF": 0,
		"MMK": 0,
		"MNT": 0,
		"MRO": 0,
		"MUR": 0,
		"OMR": 3,
		"PKR": 0,
		"PYG": 0,
		"RSD": 0,
		"RWF": 0,
		"SLL": 0,
		"SOS": 0,
		"STD": 0,
		"SYP": 0,
		"TMM": 0,
		"TND": 3,
		"TRL": 0,
		"TWD": 0,
		"TZS": 0,
		"UGX": 0,
		"UYI": 0,
		"UZS": 0,
		"VND": 0,
		"VUV": 0,
		"XAF": 0,
		"XOF": 0,
		"XPF": 0,
		"YER": 0,
		"ZMK": 0,
		"ZWD": 0
	},
	"weekData-minDays": 1,
	"weekData-firstDay": 6,
	"weekData-weekendStart": 5,
	"weekData-weekendEnd": 6,
	"timeData": {
		"_allowed": "h hB hb H",
		"_preferred": "h"
	},
	"eras-gregorian": {
		"0": {
			"_end": "0-12-31"
		},
		"1": {
			"_start": "1-01-01"
		}
	},
	"eras-islamic": {
		"0": {
			"_start": "622-7-15"
		}
	},
	"eras-persian": {
		"0": {
			"_start": "622-01-01"
		}
	},
	"eras-japanese": {
		"232": {
			"_start": "1868-9-8"
		},
		"233": {
			"_start": "1912-7-30"
		},
		"234": {
			"_start": "1926-12-25"
		},
		"235": {
			"_start": "1989-1-8"
		}
	},
	"calendarPreference": "gregorian coptic islamic islamic-civil islamic-tbla"
}