{
	"__license": "This file has been derived from Unicode Common Locale Data Repository (CLDR) files (http://cldr.unicode.org). See the copyright and permission notice in the Unicode-Data-Files-LICENSE.txt available at the same location as this file or visit http://www.unicode.org/copyright.html",
	"languages": {
		"aa": "afar",
		"ab": "abház",
		"ace": "achinéz",
		"ach": "akoli",
		"ada": "adangme",
		"ady": "adyghe",
		"ae": "avesztán",
		"aeb": "aeb",
		"af": "afrikaans",
		"afh": "afrihili",
		"agq": "agem",
		"ain": "ainu",
		"ak": "akan",
		"akk": "akkád",
		"akz": "akz",
		"ale": "aleut",
		"aln": "aln",
		"alt": "dél-altaji",
		"am": "amhara",
		"an": "aragonéz",
		"ang": "óangol",
		"anp": "angika",
		"ar": "arab",
		"ar_001": "modern szabányos arab",
		"arc": "arámi",
		"arn": "araucani",
		"aro": "aro",
		"arp": "arapaho",
		"arq": "arq",
		"arw": "aravak",
		"ary": "ary",
		"arz": "arz",
		"as": "asszámi",
		"asa": "asu",
		"ase": "ase",
		"ast": "asztúr",
		"av": "avar",
		"avk": "avk",
		"awa": "awádi",
		"ay": "ajmara",
		"az": "azerbajdzsáni",
		"az_alt-short": "azeri",
		"ba": "baskír",
		"bal": "balucsi",
		"ban": "balinéz",
		"bar": "bar",
		"bas": "basza",
		"bax": "bamun",
		"bbc": "bbc",
		"bbj": "gomala",
		"be": "belorusz",
		"bej": "bedzsa",
		"bem": "bemba",
		"bew": "bew",
		"bez": "bena",
		"bfd": "bafut",
		"bfq": "bfq",
		"bg": "bolgár",
		"bgn": "nyugati beludzs",
		"bho": "bodzspuri",
		"bi": "bislama",
		"bik": "bikol",
		"bin": "bini",
		"bjn": "bjn",
		"bkm": "kom",
		"bla": "siksika",
		"bm": "bambara",
		"bn": "bengáli",
		"bo": "tibeti",
		"bpy": "bpy",
		"bqi": "bqi",
		"br": "breton",
		"bra": "braj",
		"brh": "brh",
		"brx": "bodo",
		"bs": "bosnyák",
		"bss": "koszi",
		"bua": "burját",
		"bug": "buginéz",
		"bum": "bulu",
		"byn": "blin",
		"byv": "medumba",
		"ca": "katalán",
		"cad": "caddo",
		"car": "karib",
		"cay": "kajuga",
		"cch": "atszam",
		"ce": "csecsen",
		"ceb": "cebui",
		"cgg": "kiga",
		"ch": "csamoró",
		"chb": "csibcsa",
		"chg": "csagatáj",
		"chk": "csukéz",
		"chm": "mari",
		"chn": "csinuk zsargon",
		"cho": "csoktó",
		"chp": "csipevé",
		"chr": "cseroki",
		"chy": "csejen",
		"ckb": "szoráni kurd",
		"co": "korzikai",
		"cop": "kopt",
		"cps": "cps",
		"cr": "krí",
		"crh": "krími tatár",
		"cs": "cseh",
		"csb": "kasub",
		"cu": "egyházi szláv",
		"cv": "csuvas",
		"cy": "walesi",
		"da": "dán",
		"dak": "dakota",
		"dar": "dargva",
		"dav": "taita",
		"de": "német",
		"de_AT": "osztrák német",
		"de_CH": "svájci felnémet",
		"del": "delavár",
		"den": "szlevi",
		"dgr": "dogrib",
		"din": "dinka",
		"dje": "zarma",
		"doi": "dogri",
		"dsb": "alsó szorb",
		"dtp": "dtp",
		"dua": "duala",
		"dum": "közép holland",
		"dv": "divehi",
		"dyo": "jola-fonyi",
		"dyu": "diula",
		"dz": "butáni",
		"dzg": "dazaga",
		"ebu": "embu",
		"ee": "eve",
		"efi": "efik",
		"egl": "egl",
		"egy": "óegyiptomi",
		"eka": "ekadzsuk",
		"el": "görög",
		"elx": "elamit",
		"en": "angol",
		"en_AU": "ausztrál angol",
		"en_CA": "kanadai angol",
		"en_GB": "brit angol",
		"en_GB-alt-short": "angol (UK)",
		"en_US": "amerikai angol",
		"en_US-alt-short": "angol (USA)",
		"enm": "közép angol",
		"eo": "eszperantó",
		"es": "spanyol",
		"es_419": "latin-amerikai spanyol",
		"es_ES": "európai spanyol",
		"es_MX": "spanyol (mexikói)",
		"esu": "esu",
		"et": "észt",
		"eu": "baszk",
		"ewo": "evondo",
		"ext": "ext",
		"fa": "perzsa",
		"fan": "fang",
		"fat": "fanti",
		"ff": "fulani",
		"fi": "finn",
		"fil": "filippínó",
		"fit": "fit",
		"fj": "fidzsi",
		"fo": "feröeri",
		"fon": "fon",
		"fr": "francia",
		"fr_CA": "kanadai francia",
		"fr_CH": "svájci francia",
		"frc": "frc",
		"frm": "közép francia",
		"fro": "ófrancia",
		"frp": "frp",
		"frr": "északi fríz",
		"frs": "keleti fríz",
		"fur": "friuli",
		"fy": "fríz",
		"ga": "ír",
		"gaa": "ga",
		"gag": "gagauz",
		"gan": "gan",
		"gay": "gajo",
		"gba": "gbaja",
		"gbz": "gbz",
		"gd": "skót gael",
		"gez": "geez",
		"gil": "ikiribati",
		"gl": "galíciai",
		"glk": "glk",
		"gmh": "közép felső német",
		"gn": "guarani",
		"goh": "ófelső német",
		"gom": "gom",
		"gon": "gondi",
		"gor": "gorontalo",
		"got": "gót",
		"grb": "grebó",
		"grc": "ógörög",
		"gsw": "svájci német",
		"gu": "gudzsarati",
		"guc": "guc",
		"gur": "gur",
		"guz": "guszii",
		"gv": "man-szigeti",
		"gwi": "gvicsin",
		"ha": "hausza",
		"hai": "haida",
		"hak": "hak",
		"haw": "hawaii",
		"he": "héber",
		"hi": "hindi",
		"hif": "hif",
		"hil": "hiligajnon",
		"hit": "hittite",
		"hmn": "hmong",
		"ho": "hiri motu",
		"hr": "horvát",
		"hsb": "felső szorb",
		"hsn": "hsn",
		"ht": "haiti",
		"hu": "magyar",
		"hup": "hupa",
		"hy": "örmény",
		"hz": "herero",
		"ia": "interlingva",
		"iba": "iban",
		"ibb": "ibibió",
		"id": "indonéz",
		"ie": "interlingue",
		"ig": "igbó",
		"ii": "szecsuán ji",
		"ik": "inupiak",
		"ilo": "ilokó",
		"inh": "ingus",
		"io": "idó",
		"is": "izlandi",
		"it": "olasz",
		"iu": "inuktitut",
		"izh": "izh",
		"ja": "japán",
		"jam": "jam",
		"jbo": "lojban",
		"jgo": "ngomba",
		"jmc": "machame",
		"jpr": "zsidó-perzsa",
		"jrb": "zsidó-arab",
		"jut": "jut",
		"jv": "jávai",
		"ka": "grúz",
		"kaa": "kara-kalpak",
		"kab": "kabije",
		"kac": "kacsin",
		"kaj": "jju",
		"kam": "kamba",
		"kaw": "kawi",
		"kbd": "kabardi",
		"kbl": "kanembu",
		"kcg": "tyap",
		"kde": "makonde",
		"kea": "kabuverdianu",
		"ken": "ken",
		"kfo": "koro",
		"kg": "kongo",
		"kgp": "kgp",
		"kha": "kaszi",
		"kho": "kotanéz",
		"khq": "kojra-csíni",
		"khw": "khw",
		"ki": "kikuju",
		"kiu": "kiu",
		"kj": "kuanyama",
		"kk": "kazah",
		"kkj": "kakó",
		"kl": "grönlandi",
		"kln": "kalendzsin",
		"km": "kambodzsai",
		"kmb": "kimbundu",
		"kn": "kannada",
		"ko": "koreai",
		"koi": "komi-permják",
		"kok": "konkani",
		"kos": "kosrei",
		"kpe": "kpelle",
		"kr": "kanuri",
		"krc": "karacsáj-balkár",
		"kri": "kri",
		"krj": "krj",
		"krl": "karelai",
		"kru": "kuruh",
		"ks": "kásmíri",
		"ksb": "sambala",
		"ksf": "bafia",
		"ksh": "kölsch",
		"ku": "kurd",
		"kum": "kumük",
		"kut": "kutenai",
		"kv": "komi",
		"kw": "korni",
		"ky": "kirgiz",
		"la": "latin",
		"lad": "ladino",
		"lag": "langi",
		"lah": "lahnda",
		"lam": "lamba",
		"lb": "luxemburgi",
		"lez": "lezg",
		"lfn": "lfn",
		"lg": "ganda",
		"li": "limburgi",
		"lij": "lij",
		"liv": "liv",
		"lkt": "lakota",
		"lmo": "lmo",
		"ln": "lingala",
		"lo": "laoszi",
		"lol": "mongó",
		"loz": "lozi",
		"lrc": "északi luri",
		"lt": "litván",
		"ltg": "ltg",
		"lu": "luba-katanga",
		"lua": "luba-lulua",
		"lui": "luiseno",
		"lun": "lunda",
		"luo": "luo",
		"lus": "lushai",
		"luy": "lujia",
		"lv": "lett",
		"lzh": "lzh",
		"lzz": "lzz",
		"mad": "madurai",
		"maf": "mafa",
		"mag": "magahi",
		"mai": "maithili",
		"mak": "makaszar",
		"man": "mandingó",
		"mas": "masai",
		"mde": "maba",
		"mdf": "moksán",
		"mdh": "mdh",
		"mdr": "mandar",
		"men": "mende",
		"mer": "meru",
		"mfe": "mauritiusi kreol",
		"mg": "málgas",
		"mga": "közép ír",
		"mgh": "makua-metó",
		"mgo": "meta’",
		"mh": "marshalli",
		"mi": "maori",
		"mic": "mikmak",
		"min": "minangkabau",
		"mis": "mis",
		"mk": "macedón",
		"ml": "malajálam",
		"mn": "mongol",
		"mnc": "mandzsu",
		"mni": "manipuri",
		"moh": "mohawk",
		"mos": "moszi",
		"mr": "marathi",
		"mrj": "mrj",
		"ms": "maláj",
		"mt": "máltai",
		"mua": "mundang",
		"mul": "többszörös nyelvek",
		"mus": "krík",
		"mwl": "mirandéz",
		"mwr": "marvari",
		"mwv": "mwv",
		"my": "burmai",
		"mye": "myene",
		"myv": "erzjány",
		"mzn": "mázanderáni",
		"na": "naurui",
		"nan": "nan",
		"nap": "nápolyi",
		"naq": "nama",
		"nb": "norvég bokmal",
		"nd": "északi ndebele",
		"nds": "alsónémet",
		"nds_NL": "alsószász",
		"ne": "nepáli",
		"new": "nevari",
		"ng": "ndonga",
		"nia": "nias",
		"niu": "niui",
		"njo": "njo",
		"nl": "holland",
		"nl_BE": "flamand",
		"nmg": "ngumba",
		"nn": "norvég nynorsk",
		"nnh": "ngiemboon",
		"no": "norvég",
		"nog": "nogaj",
		"non": "óskandináv",
		"nov": "nov",
		"nqo": "n’kó",
		"nr": "déli ndebele",
		"nso": "északi szotó",
		"nus": "nuer",
		"nv": "navahó",
		"nwc": "klasszikus newari",
		"ny": "nyanja",
		"nym": "nyamvézi",
		"nyn": "nyankole",
		"nyo": "nyoró",
		"nzi": "nzima",
		"oc": "okszitán",
		"oj": "ojibva",
		"om": "oromói",
		"or": "orija",
		"os": "oszét",
		"osa": "osage",
		"ota": "ottomán török",
		"pa": "pandzsábi",
		"pag": "pangaszinan",
		"pal": "pahlavi",
		"pam": "pampangan",
		"pap": "papiamentó",
		"pau": "palaui",
		"pcd": "pcd",
		"pdc": "pdc",
		"pdt": "pdt",
		"peo": "óperzsa",
		"pfl": "pfl",
		"phn": "főniciai",
		"pi": "pali",
		"pl": "lengyel",
		"pms": "pms",
		"pnt": "pnt",
		"pon": "pohnpei",
		"prg": "prg",
		"pro": "óprovánszi",
		"ps": "pastu",
		"pt": "portugál",
		"pt_BR": "brazíliai portugál",
		"pt_PT": "európai portugál",
		"qu": "kecsua",
		"quc": "kicse",
		"qug": "qug",
		"raj": "radzsasztáni",
		"rap": "rapanui",
		"rar": "rarotongai",
		"rgn": "rgn",
		"rif": "rif",
		"rm": "réto-román",
		"rn": "kirundi",
		"ro": "román",
		"ro_MD": "moldvai",
		"rof": "rombo",
		"rom": "roma",
		"root": "ősi",
		"rtm": "rtm",
		"ru": "orosz",
		"rue": "rue",
		"rug": "rug",
		"rup": "aromán",
		"rw": "kiruanda",
		"rwk": "rwo",
		"sa": "szanszkrit",
		"sad": "szandave",
		"sah": "jakut",
		"sam": "szamaritánus arámi",
		"saq": "szamburu",
		"sas": "sasak",
		"sat": "szantáli",
		"saz": "saz",
		"sba": "ngambay",
		"sbp": "szangu",
		"sc": "szardíniai",
		"scn": "szicíliai",
		"sco": "skót",
		"sd": "szindhi",
		"sdc": "sdc",
		"sdh": "dél-kurd",
		"se": "északi számi",
		"see": "szeneka",
		"seh": "szena",
		"sei": "sei",
		"sel": "szölkup",
		"ses": "kojra-szenni",
		"sg": "szangó",
		"sga": "óír",
		"sgs": "sgs",
		"sh": "szerbhorvát",
		"shi": "tachelhit",
		"shn": "san",
		"shu": "csádi arab",
		"si": "szingaléz",
		"sid": "szidamó",
		"sk": "szlovák",
		"sl": "szlovén",
		"sli": "sli",
		"sly": "sly",
		"sm": "szamoai",
		"sma": "déli számi",
		"smj": "lule számi",
		"smn": "inar sami",
		"sms": "koltta lapp",
		"sn": "sona",
		"snk": "szoninke",
		"so": "szomáliai",
		"sog": "sogdien",
		"sq": "albán",
		"sr": "szerb",
		"srn": "szranai tongó",
		"srr": "szerer",
		"ss": "sziszuati",
		"ssy": "szahó",
		"st": "szeszotó",
		"stq": "stq",
		"su": "szundanéz",
		"suk": "szukuma",
		"sus": "szuszu",
		"sux": "sumér",
		"sv": "svéd",
		"sw": "szuahéli",
		"sw_CD": "kongói szuahéli",
		"swb": "comorei",
		"syc": "klasszikus szír",
		"syr": "szíriai",
		"szl": "szl",
		"ta": "tamil",
		"tcy": "tcy",
		"te": "telugu",
		"tem": "temne",
		"teo": "teszó",
		"ter": "terenó",
		"tet": "tetum",
		"tg": "tadzsik",
		"th": "thai",
		"ti": "tigrinja",
		"tig": "tigré",
		"tiv": "tiv",
		"tk": "türkmén",
		"tkl": "tokelaui",
		"tkr": "tkr",
		"tl": "tagalog",
		"tlh": "klingon",
		"tli": "tlingit",
		"tly": "tly",
		"tmh": "tamasek",
		"tn": "szecsuáni",
		"to": "tonga",
		"tog": "nyasa tonga",
		"tpi": "tok pisin",
		"tr": "török",
		"tru": "tru",
		"trv": "tarokó",
		"ts": "conga",
		"tsd": "tsd",
		"tsi": "csimsiáni",
		"tt": "tatár",
		"ttt": "ttt",
		"tum": "tumbuka",
		"tvl": "tuvalu",
		"tw": "twi",
		"twq": "szavák",
		"ty": "tahiti",
		"tyv": "tuvai",
		"tzm": "közép-marokkói tamazigt",
		"udm": "udmurt",
		"ug": "ujgur",
		"uga": "ugariti",
		"uk": "ukrán",
		"umb": "umbundu",
		"und": "ismeretlen nyelv",
		"ur": "urdu",
		"uz": "üzbég",
		"vai": "vai",
		"ve": "venda",
		"vec": "vec",
		"vep": "vep",
		"vi": "vietnami",
		"vls": "vls",
		"vmf": "vmf",
		"vo": "volapük",
		"vot": "votják",
		"vro": "vro",
		"vun": "vunjo",
		"wa": "vallon",
		"wae": "walser",
		"wal": "valamo",
		"war": "varaó",
		"was": "vasó",
		"wbp": "warlpiri",
		"wo": "volof",
		"wuu": "wuu",
		"xal": "kalmük",
		"xh": "hosza",
		"xmf": "xmf",
		"xog": "szoga",
		"yao": "jaó",
		"yap": "japi",
		"yav": "jangben",
		"ybb": "jemba",
		"yi": "jiddis",
		"yo": "joruba",
		"yrl": "yrl",
		"yue": "kantoni",
		"za": "zsuang",
		"zap": "zapoték",
		"zbl": "Bliss jelképrendszer",
		"zea": "zea",
		"zen": "zenaga",
		"zgh": "marokkói tamazight",
		"zh": "kínai",
		"zh_Hans": "egyszerűsített kínai",
		"zh_Hant": "hagyományos kínai",
		"zu": "zulu",
		"zun": "zuni",
		"zxx": "nincs nyelvészeti tartalom",
		"zza": "zaza"
	},
	"scripts": {
		"Adlm": "Adlm",
		"Aghb": "Aghb",
		"Ahom": "Ahom",
		"Arab": "Arab",
		"Arab-alt-variant": "Perzsa-arab",
		"Armi": "Birodalmi arámi",
		"Armn": "Örmény",
		"Avst": "Avesztán",
		"Bali": "Balinéz",
		"Bamu": "Bamu",
		"Bass": "Bass",
		"Batk": "Batak",
		"Beng": "Bengáli",
		"Bhks": "Bhks",
		"Blis": "Bliss jelképrendszer",
		"Bopo": "Bopomofo",
		"Brah": "Brámi",
		"Brai": "Vakírás",
		"Bugi": "Buginéz",
		"Buhd": "Buhid",
		"Cakm": "Csakma",
		"Cans": "Egyesített kanadai őslakos jelek",
		"Cari": "Kari",
		"Cham": "Csám",
		"Cher": "Cseroki",
		"Copt": "Kopt",
		"Cprt": "Ciprusi",
		"Cyrl": "Cirill",
		"Cyrs": "Óegyházi szláv cirill",
		"Deva": "Devanagári",
		"Dsrt": "Deseret",
		"Dupl": "Dupl",
		"Egyd": "Egyiptomi demotikus",
		"Egyh": "Egyiptomi hieratikus",
		"Egyp": "Egyiptomi hieroglifák",
		"Elba": "Elba",
		"Ethi": "Etióp",
		"Geok": "Grúz kucsuri",
		"Geor": "Grúz",
		"Glag": "Glagolitikus",
		"Goth": "Gót",
		"Gran": "Gran",
		"Grek": "Görög",
		"Gujr": "Gudzsaráti",
		"Guru": "Gurmuki",
		"Hanb": "Hanb",
		"Hang": "Hangul",
		"Hani": "Han",
		"Hano": "Hanunoo",
		"Hans": "Egyszerűsített",
		"Hans-alt-stand-alone": "Egyszerűsített kínai",
		"Hant": "Hagyományos",
		"Hant-alt-stand-alone": "Hagyományos kínai",
		"Hatr": "Hatr",
		"Hebr": "Héber",
		"Hira": "Hiragana",
		"Hluw": "Hluw",
		"Hmng": "Pahawh hmong",
		"Hrkt": "Katakana vagy hiragana",
		"Hung": "Ómagyar",
		"Inds": "Indus",
		"Ital": "Régi olasz",
		"Jamo": "Jamo",
		"Java": "Jávai",
		"Jpan": "Japán",
		"Kali": "Kajah li",
		"Kana": "Katakana",
		"Khar": "Kharoshthi",
		"Khmr": "Khmer",
		"Khoj": "Khoj",
		"Knda": "Kannada",
		"Kore": "Koreai",
		"Kthi": "Kaithi",
		"Lana": "Lanna",
		"Laoo": "Lao",
		"Latf": "Fraktur latin",
		"Latg": "Gael latin",
		"Latn": "Latin",
		"Lepc": "Lepcha",
		"Limb": "Limbu",
		"Lina": "Lineáris A",
		"Linb": "Lineáris B",
		"Lisu": "Lisu",
		"Lyci": "Líciai",
		"Lydi": "Lídiai",
		"Mahj": "Mahj",
		"Mand": "Mandai",
		"Mani": "Manicheus",
		"Marc": "Marc",
		"Maya": "Maja hieroglifák",
		"Mend": "Mend",
		"Merc": "Merc",
		"Mero": "Meroitikus",
		"Mlym": "Malajálam",
		"Modi": "Modi",
		"Mong": "Mongol",
		"Moon": "Moon",
		"Mroo": "Mroo",
		"Mtei": "Meitei mayek",
		"Mult": "Mult",
		"Mymr": "Burmai",
		"Narb": "Narb",
		"Nbat": "Nbat",
		"Newa": "Newa",
		"Nkoo": "N’ko",
		"Ogam": "Ogham",
		"Olck": "Ol chiki",
		"Orkh": "Orhon",
		"Orya": "Oriya",
		"Osge": "Osge",
		"Osma": "Oszmán",
		"Palm": "Palm",
		"Pauc": "Pauc",
		"Perm": "Ópermikus",
		"Phag": "Phags-pa",
		"Phli": "Felriatos pahlavi",
		"Phlp": "Psalter pahlavi",
		"Phlv": "Könyv pahlavi",
		"Phnx": "Főniciai",
		"Plrd": "Pollard fonetikus",
		"Prti": "Feliratos parthian",
		"Qaaa": "Qaaa",
		"Qaab": "Qaab",
		"Qaac": "Qaac",
		"Qaad": "Qaad",
		"Qaae": "Qaae",
		"Qaaf": "Qaaf",
		"Qaag": "Qaag",
		"Qaah": "Qaah",
		"Qaaj": "Qaaj",
		"Qaak": "Qaak",
		"Qaal": "Qaal",
		"Qaam": "Qaam",
		"Qaan": "Qaan",
		"Qaao": "Qaao",
		"Qaap": "Qaap",
		"Qaaq": "Qaaq",
		"Qaar": "Qaar",
		"Qaas": "Qaas",
		"Qaat": "Qaat",
		"Qaau": "Qaau",
		"Qaav": "Qaav",
		"Qaaw": "Qaaw",
		"Qaax": "Qaax",
		"Qaay": "Qaay",
		"Qaaz": "Qaaz",
		"Qaba": "Qaba",
		"Qabb": "Qabb",
		"Qabc": "Qabc",
		"Qabd": "Qabd",
		"Qabe": "Qabe",
		"Qabf": "Qabf",
		"Qabg": "Qabg",
		"Qabh": "Qabh",
		"Qabi": "Qabi",
		"Qabj": "Qabj",
		"Qabk": "Qabk",
		"Qabl": "Qabl",
		"Qabm": "Qabm",
		"Qabn": "Qabn",
		"Qabo": "Qabo",
		"Qabp": "Qabp",
		"Qabq": "Qabq",
		"Qabr": "Qabr",
		"Qabs": "Qabs",
		"Qabt": "Qabt",
		"Qabu": "Qabu",
		"Qabv": "Qabv",
		"Qabw": "Qabw",
		"Qabx": "Qabx",
		"Rjng": "Redzsang",
		"Roro": "Rongorongo",
		"Runr": "Runikus",
		"Samr": "Szamaritán",
		"Sara": "Szarati",
		"Sarb": "Sarb",
		"Saur": "Szaurastra",
		"Sgnw": "Jelírás",
		"Shaw": "Shaw ábécé",
		"Shrd": "Shrd",
		"Sidd": "Sidd",
		"Sind": "Sind",
		"Sinh": "Szingaléz",
		"Sora": "Sora",
		"Sund": "Szundanéz",
		"Sylo": "Sylheti nagári",
		"Syrc": "Szíriai",
		"Syre": "Estrangelo szíriai",
		"Syrj": "Nyugat-szíriai",
		"Syrn": "Kelet-szíriai",
		"Tagb": "Tagbanwa",
		"Takr": "Takr",
		"Tale": "Tai Le",
		"Talu": "Új tai lue",
		"Taml": "Tamil",
		"Tang": "Tang",
		"Tavt": "Tai viet",
		"Telu": "Telugu",
		"Teng": "Tengwar",
		"Tfng": "Berber",
		"Tglg": "Tagalog",
		"Thaa": "Thaana",
		"Thai": "Thai",
		"Tibt": "Tibeti",
		"Tirh": "Tirh",
		"Ugar": "Ugari",
		"Vaii": "Vai",
		"Visp": "Látható beszéd",
		"Wara": "Wara",
		"Xpeo": "Óperzsa",
		"Xsux": "Ékírásos suméro-akkád",
		"Yiii": "Ji",
		"Zinh": "Származtatott",
		"Zmth": "Matematikai jelrendszer",
		"Zsye": "Zsye",
		"Zsym": "Szimbólum",
		"Zxxx": "Íratlan nyelvek kódja",
		"Zyyy": "Meghatározatlan",
		"Zzzz": "Ismeretlen írásrendszer"
	},
	"territories": {
		"142": "Ázsia",
		"143": "Közép-Ázsia",
		"145": "Nyugat-Ázsia",
		"150": "Európa",
		"151": "Kelet-Európa",
		"154": "Észak-Európa",
		"155": "Nyugat-Európa",
		"419": "Latin-Amerika",
		"001": "Világ",
		"002": "Afrika",
		"003": "Észak-Amerika",
		"005": "Dél-Amerika",
		"009": "Óceánia",
		"011": "Nyugat-Afrika",
		"013": "Közép-Amerika",
		"014": "Kelet-Afrika",
		"015": "Észak-Afrika",
		"017": "Közép-Afrika",
		"018": "Afrika déli része",
		"019": "Amerika",
		"021": "Amerika északi része",
		"029": "Karib-térség",
		"030": "Kelet-Ázsia",
		"034": "Dél-Ázsia",
		"035": "Délkelet-Ázsia",
		"039": "Dél-Európa",
		"053": "Ausztrálázsia",
		"054": "Melanézia",
		"057": "Mikronéziai régió",
		"061": "Polinézia",
		"AC": "Ascension-sziget",
		"AD": "Andorra",
		"AE": "Egyesült Arab Emírségek",
		"AF": "Afganisztán",
		"AG": "Antigua és Barbuda",
		"AI": "Anguilla",
		"AL": "Albánia",
		"AM": "Örményország",
		"AO": "Angola",
		"AQ": "Antarktisz",
		"AR": "Argentína",
		"AS": "Amerikai Szamoa",
		"AT": "Ausztria",
		"AU": "Ausztrália",
		"AW": "Aruba",
		"AX": "Åland-szigetek",
		"AZ": "Azerbajdzsán",
		"BA": "Bosznia-Hercegovina",
		"BB": "Barbados",
		"BD": "Banglades",
		"BE": "Belgium",
		"BF": "Burkina Faso",
		"BG": "Bulgária",
		"BH": "Bahrein",
		"BI": "Burundi",
		"BJ": "Benin",
		"BL": "Saint-Barthélemy",
		"BM": "Bermuda",
		"BN": "Brunei",
		"BO": "Bolívia",
		"BQ": "Holland Karib-térség",
		"BR": "Brazília",
		"BS": "Bahama-szigetek",
		"BT": "Bhután",
		"BV": "Bouvet-sziget",
		"BW": "Botswana",
		"BY": "Fehéroroszország",
		"BZ": "Belize",
		"CA": "Kanada",
		"CC": "Kókusz-szigetek",
		"CD": "Kongó - Kinshasa",
		"CD-alt-variant": "Kongó (KDK)",
		"CF": "Közép-afrikai Köztársaság",
		"CG": "Kongó - Brazzaville",
		"CG-alt-variant": "Kongó (Köztársaság)",
		"CH": "Svájc",
		"CI": "Elefántcsontpart",
		"CI-alt-variant": "CI",
		"CK": "Cook-szigetek",
		"CL": "Chile",
		"CM": "Kamerun",
		"CN": "Kína",
		"CO": "Kolumbia",
		"CP": "Clipperton-sziget",
		"CR": "Costa Rica",
		"CU": "Kuba",
		"CV": "Zöld-foki Köztársaság",
		"CW": "Curaçao",
		"CX": "Karácsony-sziget",
		"CY": "Ciprus",
		"CZ": "Csehország",
		"DE": "Németország",
		"DG": "Diego Garcia",
		"DJ": "Dzsibuti",
		"DK": "Dánia",
		"DM": "Dominika",
		"DO": "Dominikai Köztársaság",
		"DZ": "Algéria",
		"EA": "Ceuta és Melilla",
		"EC": "Ecuador",
		"EE": "Észtország",
		"EG": "Egyiptom",
		"EH": "Nyugat-Szahara",
		"ER": "Eritrea",
		"ES": "Spanyolország",
		"ET": "Etiópia",
		"EU": "Európai Unió",
		"FI": "Finnország",
		"FJ": "Fidzsi",
		"FK": "Falkland-szigetek",
		"FK-alt-variant": "Falkland-szigetek (Malvin-szigetek)",
		"FM": "Mikronézia",
		"FO": "Feröer-szigetek",
		"FR": "Franciaország",
		"GA": "Gabon",
		"GB": "Egyesült Királyság",
		"GB-alt-short": "UK",
		"GD": "Grenada",
		"GE": "Grúzia",
		"GF": "Francia Guyana",
		"GG": "Guernsey",
		"GH": "Ghána",
		"GI": "Gibraltár",
		"GL": "Grönland",
		"GM": "Gambia",
		"GN": "Guinea",
		"GP": "Guadeloupe",
		"GQ": "Egyenlítői-Guinea",
		"GR": "Görögország",
		"GS": "Déli-Georgia és Déli-Sandwich-szigetek",
		"GT": "Guatemala",
		"GU": "Guam",
		"GW": "Bissau-Guinea",
		"GY": "Guyana",
		"HK": "Hongkong SAR Kína",
		"HK-alt-short": "Hongkong",
		"HM": "Heard-sziget és McDonald-szigetek",
		"HN": "Honduras",
		"HR": "Horvátország",
		"HT": "Haiti",
		"HU": "Magyarország",
		"IC": "Kanári-szigetek",
		"ID": "Indonézia",
		"IE": "Írország",
		"IL": "Izrael",
		"IM": "Man-sziget",
		"IN": "India",
		"IO": "Brit Indiai-óceáni Terület",
		"IQ": "Irak",
		"IR": "Irán",
		"IS": "Izland",
		"IT": "Olaszország",
		"JE": "Jersey",
		"JM": "Jamaica",
		"JO": "Jordánia",
		"JP": "Japán",
		"KE": "Kenya",
		"KG": "Kirgizisztán",
		"KH": "Kambodzsa",
		"KI": "Kiribati",
		"KM": "Comore-szigetek",
		"KN": "Saint Kitts és Nevis",
		"KP": "Észak-Korea",
		"KR": "Dél-Korea",
		"KW": "Kuvait",
		"KY": "Kajmán-szigetek",
		"KZ": "Kazahsztán",
		"LA": "Laosz",
		"LB": "Libanon",
		"LC": "Santa Lucia",
		"LI": "Liechtenstein",
		"LK": "Srí Lanka",
		"LR": "Libéria",
		"LS": "Lesotho",
		"LT": "Litvánia",
		"LU": "Luxemburg",
		"LV": "Lettország",
		"LY": "Líbia",
		"MA": "Marokkó",
		"MC": "Monaco",
		"MD": "Moldova",
		"ME": "Montenegró",
		"MF": "Saint Martin",
		"MG": "Madagaszkár",
		"MH": "Marshall-szigetek",
		"MK": "Macedónia",
		"MK-alt-variant": "Macedónia (MVJK)",
		"ML": "Mali",
		"MM": "Mianmar (Burma)",
		"MN": "Mongólia",
		"MO": "Makaó SAR Kína",
		"MO-alt-short": "Makaó",
		"MP": "Északi Mariana-szigetek",
		"MQ": "Martinique",
		"MR": "Mauritánia",
		"MS": "Montserrat",
		"MT": "Málta",
		"MU": "Mauritius",
		"MV": "Maldív-szigetek",
		"MW": "Malawi",
		"MX": "Mexikó",
		"MY": "Malajzia",
		"MZ": "Mozambik",
		"NA": "Namíbia",
		"NC": "Új-Kaledónia",
		"NE": "Niger",
		"NF": "Norfolk-sziget",
		"NG": "Nigéria",
		"NI": "Nicaragua",
		"NL": "Hollandia",
		"NO": "Norvégia",
		"NP": "Nepál",
		"NR": "Nauru",
		"NU": "Niue",
		"NZ": "Új-Zéland",
		"OM": "Omán",
		"PA": "Panama",
		"PE": "Peru",
		"PF": "Francia Polinézia",
		"PG": "Pápua Új-Guinea",
		"PH": "Fülöp-szigetek",
		"PK": "Pakisztán",
		"PL": "Lengyelország",
		"PM": "Saint Pierre és Miquelon",
		"PN": "Pitcairn-szigetek",
		"PR": "Puerto Rico",
		"PS": "Palesztin Terület",
		"PS-alt-short": "Palesztina",
		"PT": "Portugália",
		"PW": "Palau",
		"PY": "Paraguay",
		"QA": "Katar",
		"QO": "Külső-Óceánia",
		"RE": "Reunion",
		"RO": "Románia",
		"RS": "Szerbia",
		"RU": "Oroszország",
		"RW": "Ruanda",
		"SA": "Szaúd-Arábia",
		"SB": "Salamon-szigetek",
		"SC": "Seychelle-szigetek",
		"SD": "Szudán",
		"SE": "Svédország",
		"SG": "Szingapúr",
		"SH": "Szent Ilona",
		"SI": "Szlovénia",
		"SJ": "Spitzbergák és Jan Mayen-szigetek",
		"SK": "Szlovákia",
		"SL": "Sierra Leone",
		"SM": "San Marino",
		"SN": "Szenegál",
		"SO": "Szomália",
		"SR": "Suriname",
		"SS": "Dél-Szudán",
		"ST": "Sao Tomé és Príncipe",
		"SV": "Salvador",
		"SX": "Sint Maarten",
		"SY": "Szíria",
		"SZ": "Szváziföld",
		"TA": "Tristan da Cunha",
		"TC": "Turks- és Caicos-szigetek",
		"TD": "Csád",
		"TF": "Francia Déli Területek",
		"TG": "Togo",
		"TH": "Thaiföld",
		"TJ": "Tádzsikisztán",
		"TK": "Tokelau",
		"TL": "Kelet-Timor",
		"TL-alt-variant": "TL",
		"TM": "Türkmenisztán",
		"TN": "Tunézia",
		"TO": "Tonga",
		"TR": "Törökország",
		"TT": "Trinidad és Tobago",
		"TV": "Tuvalu",
		"TW": "Tajvan",
		"TZ": "Tanzánia",
		"UA": "Ukrajna",
		"UG": "Uganda",
		"UM": "Amerikai Csendes-óceáni Szigetek",
		"US": "Egyesült Államok",
		"US-alt-short": "USA",
		"UY": "Uruguay",
		"UZ": "Üzbegisztán",
		"VA": "Vatikán",
		"VC": "Saint Vincent és a Grenadine-szigetek",
		"VE": "Venezuela",
		"VG": "Brit Virgin-szigetek",
		"VI": "Amerikai Virgin-szigetek",
		"VN": "Vietnam",
		"VU": "Vanuatu",
		"WF": "Wallis- és Futuna-szigetek",
		"WS": "Szamoa",
		"XK": "Koszovó",
		"YE": "Jemen",
		"YT": "Mayotte",
		"ZA": "Dél-afrikai Köztársaság",
		"ZM": "Zambia",
		"ZW": "Zimbabwe",
		"ZZ": "Ismeretlen körzet"
	},
	"orientation": "left-to-right",
	"ca-gregorian": {
		"dateFormats": {
			"full": "y. MMMM d., EEEE",
			"long": "y. MMMM d.",
			"medium": "y. MMM d.",
			"short": "y. MM. dd."
		},
		"timeFormats": {
			"full": "H:mm:ss zzzz",
			"long": "H:mm:ss z",
			"medium": "H:mm:ss",
			"short": "H:mm"
		},
		"dateTimeFormats": {
			"full": "{1} {0}",
			"long": "{1} {0}",
			"medium": "{1} {0}",
			"short": "{1} {0}",
			"availableFormats": {
				"d": "d",
				"E": "ccc",
				"Ed": "d., E",
				"Ehm": "E h:mm a",
				"EHm": "E HH:mm",
				"Ehms": "E h:mm:ss a",
				"EHms": "E HH:mm:ss",
				"Gy": "G y.",
				"GyMMM": "G y. MMM",
				"GyMMMd": "G y. MMM d.",
				"GyMMMEd": "G y. MMM d., E",
				"h": "a h",
				"H": "H",
				"hm": "a h:mm",
				"Hm": "H:mm",
				"hms": "a h:mm:ss",
				"Hms": "H:mm:ss",
				"hmsv": "h:mm:ss a v",
				"Hmsv": "HH:mm:ss v",
				"hmv": "h:mm a v",
				"Hmv": "HH:mm v",
				"M": "L",
				"Md": "M. d.",
				"MEd": "M. d., E",
				"MMM": "LLL",
				"MMMd": "MMM d.",
				"MMMEd": "MMM d., E",
				"MMMMd": "MMMM d.",
				"mmss": "mm:ss",
				"ms": "mm:ss",
				"y": "y.",
				"yM": "y. M.",
				"yMd": "y. MM. dd.",
				"yMEd": "y. MM. dd., E",
				"yMMM": "y. MMM",
				"yMMMd": "y. MMM d.",
				"yMMMEd": "y. MMM d., E",
				"yMMMM": "y. MMMM",
				"yQQQ": "y. QQQ",
				"yQQQQ": "y. QQQQ"
			},
			"appendItems": {
				"Day": "{0} ({2}: {1})",
				"Day-Of-Week": "{0} {1}",
				"Era": "{1} {0}",
				"Hour": "{0} ({2}: {1})",
				"Minute": "{0} ({2}: {1})",
				"Month": "{0} ({2}: {1})",
				"Quarter": "{0} ({2}: {1})",
				"Second": "{0} ({2}: {1})",
				"Timezone": "{0} {1}",
				"Week": "{0} ({2}: {1})",
				"Year": "{1} {0}"
			},
			"intervalFormats": {
				"intervalFormatFallback": "{0} – {1}",
				"d": {
					"d": "d–d."
				},
				"h": {
					"a": "a h – a h",
					"h": "a h–h"
				},
				"H": {
					"H": "H–H"
				},
				"hm": {
					"a": "a h:mm – a h:mm",
					"h": "a h:mm–h:mm",
					"m": "a h:mm–h:mm"
				},
				"Hm": {
					"H": "H:mm–H:mm",
					"m": "H:mm–H:mm"
				},
				"hmv": {
					"a": "a h:mm – a h:mm v",
					"h": "a h:mm–h:mm v",
					"m": "a h:mm–h:mm v"
				},
				"Hmv": {
					"H": "H:mm–H:mm v",
					"m": "H:mm–H:mm v"
				},
				"hv": {
					"a": "a h – a h v",
					"h": "a h–h v"
				},
				"Hv": {
					"H": "H–H v"
				},
				"M": {
					"M": "M–M."
				},
				"Md": {
					"d": "M. d–d.",
					"M": "M. d. – M. d."
				},
				"MEd": {
					"d": "M. dd., E – M. d., E",
					"M": "M. d., E – M. d., E"
				},
				"MMM": {
					"M": "MMM–MMM"
				},
				"MMMd": {
					"d": "MMM d–d.",
					"M": "MMM d. – MMM d."
				},
				"MMMEd": {
					"d": "MMM d., E – d., E",
					"M": "MMM d., E – MMM d., E"
				},
				"y": {
					"y": "y–y"
				},
				"yM": {
					"M": "y. MM–MM.",
					"y": "y. MM. – y. MM."
				},
				"yMd": {
					"d": "y. MM. dd–dd.",
					"M": "y. MM. dd. – MM. dd.",
					"y": "y. MM. dd. – y. MM. dd."
				},
				"yMEd": {
					"d": "y. MM. dd., E – dd., E",
					"M": "y. MM. dd., E – MM. dd., E",
					"y": "y. MM. dd., E – y. MM. dd., E"
				},
				"yMMM": {
					"M": "y. MMM–MMM",
					"y": "y. MMM – y. MMM"
				},
				"yMMMd": {
					"d": "y. MMM d–d.",
					"M": "y. MMM d. – MMM d.",
					"y": "y. MMM d. – y. MMM d."
				},
				"yMMMEd": {
					"d": "y. MMM d., E – d., E",
					"M": "y. MMM d., E – MMM d., E",
					"y": "y. MMM d., E – y. MMM d., E"
				},
				"yMMMM": {
					"M": "y. MMMM–MMMM",
					"y": "y. MMMM – y. MMMM"
				}
			}
		},
		"months": {
			"format": {
				"abbreviated": [
					"jan.",
					"febr.",
					"márc.",
					"ápr.",
					"máj.",
					"jún.",
					"júl.",
					"aug.",
					"szept.",
					"okt.",
					"nov.",
					"dec."
				],
				"narrow": [
					"J",
					"F",
					"M",
					"Á",
					"M",
					"J",
					"J",
					"A",
					"Sz",
					"O",
					"N",
					"D"
				],
				"wide": [
					"január",
					"február",
					"március",
					"április",
					"május",
					"június",
					"július",
					"augusztus",
					"szeptember",
					"október",
					"november",
					"december"
				]
			},
			"stand-alone": {
				"abbreviated": [
					"jan.",
					"febr.",
					"márc.",
					"ápr.",
					"máj.",
					"jún.",
					"júl.",
					"aug.",
					"szept.",
					"okt.",
					"nov.",
					"dec."
				],
				"narrow": [
					"J",
					"F",
					"M",
					"Á",
					"M",
					"J",
					"J",
					"A",
					"Sz",
					"O",
					"N",
					"D"
				],
				"wide": [
					"január",
					"február",
					"március",
					"április",
					"május",
					"június",
					"július",
					"augusztus",
					"szeptember",
					"október",
					"november",
					"december"
				]
			}
		},
		"days": {
			"format": {
				"abbreviated": [
					"V",
					"H",
					"K",
					"Sze",
					"Cs",
					"P",
					"Szo"
				],
				"narrow": [
					"V",
					"H",
					"K",
					"Sz",
					"Cs",
					"P",
					"Sz"
				],
				"short": [
					"V",
					"H",
					"K",
					"Sze",
					"Cs",
					"P",
					"Szo"
				],
				"wide": [
					"vasárnap",
					"hétfő",
					"kedd",
					"szerda",
					"csütörtök",
					"péntek",
					"szombat"
				]
			},
			"stand-alone": {
				"abbreviated": [
					"V",
					"H",
					"K",
					"Sze",
					"Cs",
					"P",
					"Szo"
				],
				"narrow": [
					"V",
					"H",
					"K",
					"Sz",
					"Cs",
					"P",
					"Sz"
				],
				"short": [
					"V",
					"H",
					"K",
					"Sze",
					"Cs",
					"P",
					"Szo"
				],
				"wide": [
					"vasárnap",
					"hétfő",
					"kedd",
					"szerda",
					"csütörtök",
					"péntek",
					"szombat"
				]
			}
		},
		"quarters": {
			"format": {
				"abbreviated": [
					"N1",
					"N2",
					"N3",
					"N4"
				],
				"narrow": [
					"1.",
					"2.",
					"3.",
					"4."
				],
				"wide": [
					"I. negyedév",
					"II. negyedév",
					"III. negyedév",
					"IV. negyedév"
				]
			},
			"stand-alone": {
				"abbreviated": [
					"N1",
					"N2",
					"N3",
					"N4"
				],
				"narrow": [
					"1.",
					"2.",
					"3.",
					"4."
				],
				"wide": [
					"1. negyedév",
					"2. negyedév",
					"3. negyedév",
					"4. negyedév"
				]
			}
		},
		"dayPeriods": {
			"format": {
				"abbreviated": [
					"de.",
					"du."
				],
				"narrow": [
					"de.",
					"du."
				],
				"wide": [
					"de.",
					"du."
				]
			},
			"stand-alone": {
				"abbreviated": [
					"de.",
					"du."
				],
				"narrow": [
					"de.",
					"du."
				],
				"wide": [
					"de.",
					"du."
				]
			}
		},
		"era-wide": {
			"0": "időszámításunk előtt",
			"1": "időszámításunk szerint"
		},
		"era-abbreviated": {
			"0": "i. e.",
			"1": "i. sz."
		},
		"era-narrow": {
			"0": "ie.",
			"1": "isz."
		}
	},
	"ca-islamic": {
		"dateFormats": {
			"full": "G y. MMMM d., EEEE",
			"long": "G y. MMMM d.",
			"medium": "G y. MMM d.",
			"short": "GGGGG y. M. d."
		},
		"timeFormats": {
			"full": "H:mm:ss zzzz",
			"long": "H:mm:ss z",
			"medium": "H:mm:ss",
			"short": "H:mm"
		},
		"dateTimeFormats": {
			"full": "{1} {0}",
			"long": "{1} {0}",
			"medium": "{1} {0}",
			"short": "{1} {0}",
			"availableFormats": {
				"d": "d",
				"E": "ccc",
				"Ed": "d., E",
				"Ehm": "E h:mm a",
				"EHm": "E HH:mm",
				"Ehms": "E h:mm:ss a",
				"EHms": "E HH:mm:ss",
				"Gy": "G y.",
				"GyMMM": "G y. MMM",
				"GyMMMd": "G y. MMM d.",
				"GyMMMEd": "G y. MMM d., E",
				"h": "a h",
				"H": "H",
				"hm": "a h:mm",
				"Hm": "H:mm",
				"hms": "a h:mm:ss",
				"Hms": "H:mm:ss",
				"M": "L",
				"Md": "M. d.",
				"MEd": "M. d., E",
				"MMM": "LLL",
				"MMMd": "MMM d.",
				"MMMEd": "MMM d., E",
				"MMMMd": "MMMM d.",
				"ms": "mm:ss",
				"y": "G y.",
				"yyyy": "G y.",
				"yyyyM": "G y. MM.",
				"yyyyMd": "G y. MM. dd.",
				"yyyyMEd": "G y. MM. dd., E",
				"yyyyMMM": "G y. MMM",
				"yyyyMMMd": "G y. MMM d.",
				"yyyyMMMEd": "G y. MMM d., E",
				"yyyyMMMM": "G y. MMMM",
				"yyyyQQQ": "G y. QQQ",
				"yyyyQQQQ": "G y. QQQQ"
			},
			"appendItems": {
				"Day": "{0} ({2}: {1})",
				"Day-Of-Week": "{0} {1}",
				"Era": "{1} {0}",
				"Hour": "{0} ({2}: {1})",
				"Minute": "{0} ({2}: {1})",
				"Month": "{0} ({2}: {1})",
				"Quarter": "{0} ({2}: {1})",
				"Second": "{0} ({2}: {1})",
				"Timezone": "{0} {1}",
				"Week": "{0} ({2}: {1})",
				"Year": "{1} {0}"
			},
			"intervalFormats": {
				"intervalFormatFallback": "{0} – {1}",
				"d": {
					"d": "d–d."
				},
				"h": {
					"a": "a h – a h",
					"h": "a h–h"
				},
				"H": {
					"H": "H–H"
				},
				"hm": {
					"a": "a h:mm – a h:mm",
					"h": "a h:mm–h:mm",
					"m": "a h:mm–h:mm"
				},
				"Hm": {
					"H": "H:mm–H:mm",
					"m": "H:mm–H:mm"
				},
				"hmv": {
					"a": "a h:mm – a h:mm v",
					"h": "a h:mm–h:mm v",
					"m": "a h:mm–h:mm v"
				},
				"Hmv": {
					"H": "H:mm–H:mm v",
					"m": "H:mm–H:mm v"
				},
				"hv": {
					"a": "a h – a h v",
					"h": "a h–h v"
				},
				"Hv": {
					"H": "H–H v"
				},
				"M": {
					"M": "M–M."
				},
				"Md": {
					"d": "MM. dd–dd.",
					"M": "MM. dd. – MM. dd."
				},
				"MEd": {
					"d": "MM. dd., E – MM. dd., E",
					"M": "MM. dd., E – MM. dd., E"
				},
				"MMM": {
					"M": "MMM–MMM"
				},
				"MMMd": {
					"d": "MMM d–d.",
					"M": "MMM d. – MMM d."
				},
				"MMMEd": {
					"d": "MMM d., E – d., E",
					"M": "MMM d., E – MMM d., E"
				},
				"y": {
					"y": "G y–y."
				},
				"yM": {
					"M": "G y. MM–MM.",
					"y": "G y. MM. – y. MM."
				},
				"yMd": {
					"d": "G y. MM. dd–dd.",
					"M": "G y. MM. dd. – MM. dd.",
					"y": "G y. MM. dd. – y. MM. dd."
				},
				"yMEd": {
					"d": "G y. MM. dd., E – dd., E",
					"M": "G y. MM. dd., E – MM. dd., E",
					"y": "G y. MM. dd., E – y. MM. dd., E"
				},
				"yMMM": {
					"M": "G y. MMM–MMM",
					"y": "G y. MMM – y. MMM"
				},
				"yMMMd": {
					"d": "G y. MMM d–d.",
					"M": "G y. MMM d. – MMM d.",
					"y": "G y. MMM d. – y. MMM d."
				},
				"yMMMEd": {
					"d": "G y. MMM d., E – MMM d., E",
					"M": "G y. MMM d., E – MMM d., E",
					"y": "G y. MMM d., E – y. MMM d., E"
				},
				"yMMMM": {
					"M": "G y. MMMM–MMMM",
					"y": "G y. MMMM – y. MMMM"
				}
			}
		},
		"months": {
			"format": {
				"abbreviated": [
					"Moh.",
					"Saf.",
					"Réb. 1",
					"Réb. 2",
					"Dsem. I",
					"Dsem. II",
					"Red.",
					"Sab.",
					"Ram.",
					"Sev.",
					"Dsül k.",
					"Dsül h."
				],
				"narrow": [
					"1",
					"2",
					"3",
					"4",
					"5",
					"6",
					"7",
					"8",
					"9",
					"10",
					"11",
					"12"
				],
				"wide": [
					"Moharrem",
					"Safar",
					"Rébi el avvel",
					"Rébi el accher",
					"Dsemádi el avvel",
					"Dsemádi el accher",
					"Redseb",
					"Sabán",
					"Ramadán",
					"Sevvál",
					"Dsül kade",
					"Dsül hedse"
				]
			},
			"stand-alone": {
				"abbreviated": [
					"Moh.",
					"Saf.",
					"Réb. 1",
					"Réb. 2",
					"Dsem. I",
					"Dsem. II",
					"Red.",
					"Sab.",
					"Ram.",
					"Sev.",
					"Dsül k.",
					"Dsül h."
				],
				"narrow": [
					"1",
					"2",
					"3",
					"4",
					"5",
					"6",
					"7",
					"8",
					"9",
					"10",
					"11",
					"12"
				],
				"wide": [
					"Moharrem",
					"Safar",
					"Rébi I",
					"Rébi II",
					"Dsemádi I",
					"Dsemádi II",
					"Redseb",
					"Sabán",
					"Ramadán",
					"Sevvál",
					"Dsül kade",
					"Dsül hedse"
				]
			}
		},
		"days": {
			"format": {
				"abbreviated": [
					"V",
					"H",
					"K",
					"Sze",
					"Cs",
					"P",
					"Szo"
				],
				"narrow": [
					"V",
					"H",
					"K",
					"Sz",
					"Cs",
					"P",
					"Sz"
				],
				"short": [
					"V",
					"H",
					"K",
					"Sze",
					"Cs",
					"P",
					"Szo"
				],
				"wide": [
					"vasárnap",
					"hétfő",
					"kedd",
					"szerda",
					"csütörtök",
					"péntek",
					"szombat"
				]
			},
			"stand-alone": {
				"abbreviated": [
					"V",
					"H",
					"K",
					"Sze",
					"Cs",
					"P",
					"Szo"
				],
				"narrow": [
					"V",
					"H",
					"K",
					"Sz",
					"Cs",
					"P",
					"Sz"
				],
				"short": [
					"V",
					"H",
					"K",
					"Sze",
					"Cs",
					"P",
					"Szo"
				],
				"wide": [
					"vasárnap",
					"hétfő",
					"kedd",
					"szerda",
					"csütörtök",
					"péntek",
					"szombat"
				]
			}
		},
		"quarters": {
			"format": {
				"abbreviated": [
					"N1",
					"N2",
					"N3",
					"N4"
				],
				"narrow": [
					"1.",
					"2.",
					"3.",
					"4."
				],
				"wide": [
					"I. negyedév",
					"II. negyedév",
					"III. negyedév",
					"IV. negyedév"
				]
			},
			"stand-alone": {
				"abbreviated": [
					"N1",
					"N2",
					"N3",
					"N4"
				],
				"narrow": [
					"1.",
					"2.",
					"3.",
					"4."
				],
				"wide": [
					"1. negyedév",
					"2. negyedév",
					"3. negyedév",
					"4. negyedév"
				]
			}
		},
		"dayPeriods": {
			"format": {
				"abbreviated": [
					"de.",
					"du."
				],
				"narrow": [
					"de.",
					"du."
				],
				"wide": [
					"de.",
					"du."
				]
			},
			"stand-alone": {
				"abbreviated": [
					"de.",
					"du."
				],
				"narrow": [
					"de.",
					"du."
				],
				"wide": [
					"de.",
					"du."
				]
			}
		},
		"era-wide": {
			"0": "MF"
		},
		"era-abbreviated": {
			"0": "MF"
		},
		"era-narrow": {
			"0": "MF"
		}
	},
	"ca-japanese": {
		"dateFormats": {
			"full": "G y. MMMM d., EEEE",
			"long": "G y. MMMM d.",
			"medium": "G y.MM.dd.",
			"short": "GGGGG y.MM.dd."
		},
		"timeFormats": {
			"full": "H:mm:ss zzzz",
			"long": "H:mm:ss z",
			"medium": "H:mm:ss",
			"short": "H:mm"
		},
		"dateTimeFormats": {
			"full": "{1} {0}",
			"long": "{1} {0}",
			"medium": "{1} {0}",
			"short": "{1} {0}",
			"availableFormats": {
				"d": "d",
				"E": "ccc",
				"Ed": "d., E",
				"Ehm": "E h:mm a",
				"EHm": "E HH:mm",
				"Ehms": "E h:mm:ss a",
				"EHms": "E HH:mm:ss",
				"Gy": "G y.",
				"GyMMM": "G y. MMM",
				"GyMMMd": "G y. MMM d.",
				"GyMMMEd": "G y. MMM d., E",
				"h": "a h",
				"H": "H",
				"hm": "a h:mm",
				"Hm": "H:mm",
				"hms": "a h:mm:ss",
				"Hms": "H:mm:ss",
				"M": "L",
				"Md": "M. d.",
				"MEd": "M. d., E",
				"MMM": "LLL",
				"MMMd": "MMM d.",
				"MMMEd": "MMM d., E",
				"MMMMd": "MMMM d.",
				"ms": "mm:ss",
				"y": "G y.",
				"yyyy": "G y.",
				"yyyyM": "G y. MM.",
				"yyyyMd": "G y. MM. dd.",
				"yyyyMEd": "G y. MM. dd., E",
				"yyyyMMM": "G y. MMM",
				"yyyyMMMd": "G y. MMM d.",
				"yyyyMMMEd": "G y. MMM d., E",
				"yyyyMMMM": "G y. MMMM",
				"yyyyQQQ": "G y. QQQ",
				"yyyyQQQQ": "G y. QQQQ"
			},
			"appendItems": {
				"Day": "{0} ({2}: {1})",
				"Day-Of-Week": "{0} {1}",
				"Era": "{1} {0}",
				"Hour": "{0} ({2}: {1})",
				"Minute": "{0} ({2}: {1})",
				"Month": "{0} ({2}: {1})",
				"Quarter": "{0} ({2}: {1})",
				"Second": "{0} ({2}: {1})",
				"Timezone": "{0} {1}",
				"Week": "{0} ({2}: {1})",
				"Year": "{1} {0}"
			},
			"intervalFormats": {
				"intervalFormatFallback": "{0} – {1}",
				"d": {
					"d": "d–d."
				},
				"h": {
					"a": "a h – a h",
					"h": "a h–h"
				},
				"H": {
					"H": "H–H"
				},
				"hm": {
					"a": "a h:mm – a h:mm",
					"h": "a h:mm–h:mm",
					"m": "a h:mm–h:mm"
				},
				"Hm": {
					"H": "H:mm–H:mm",
					"m": "H:mm–H:mm"
				},
				"hmv": {
					"a": "a h:mm – a h:mm v",
					"h": "a h:mm–h:mm v",
					"m": "a h:mm–h:mm v"
				},
				"Hmv": {
					"H": "H:mm–H:mm v",
					"m": "H:mm–H:mm v"
				},
				"hv": {
					"a": "a h – a h v",
					"h": "a h–h v"
				},
				"Hv": {
					"H": "H–H v"
				},
				"M": {
					"M": "M–M."
				},
				"Md": {
					"d": "MM. dd–dd.",
					"M": "MM. dd. – MM. dd."
				},
				"MEd": {
					"d": "MM. dd., E – MM. dd., E",
					"M": "MM. dd., E – MM. dd., E"
				},
				"MMM": {
					"M": "MMM–MMM"
				},
				"MMMd": {
					"d": "MMM d–d.",
					"M": "MMM d. – MMM d."
				},
				"MMMEd": {
					"d": "MMM d., E – d., E",
					"M": "MMM d., E – MMM d., E"
				},
				"y": {
					"y": "G y–y."
				},
				"yM": {
					"M": "G y. MM–MM.",
					"y": "G y. MM. – y. MM."
				},
				"yMd": {
					"d": "G y. MM. dd–dd.",
					"M": "G y. MM. dd. – MM. dd.",
					"y": "G y. MM. dd. – y. MM. dd."
				},
				"yMEd": {
					"d": "G y. MM. dd., E – dd., E",
					"M": "G y. MM. dd., E – MM. dd., E",
					"y": "G y. MM. dd., E – y. MM. dd., E"
				},
				"yMMM": {
					"M": "G y. MMM–MMM",
					"y": "G y. MMM – y. MMM"
				},
				"yMMMd": {
					"d": "G y. MMM d–d.",
					"M": "G y. MMM d. – MMM d.",
					"y": "G y. MMM d. – y. MMM d."
				},
				"yMMMEd": {
					"d": "G y. MMM d., E – MMM d., E",
					"M": "G y. MMM d., E – MMM d., E",
					"y": "G y. MMM d., E – y. MMM d., E"
				},
				"yMMMM": {
					"M": "G y. MMMM–MMMM",
					"y": "G y. MMMM – y. MMMM"
				}
			}
		},
		"months": {
			"format": {
				"abbreviated": [
					"jan.",
					"febr.",
					"márc.",
					"ápr.",
					"máj.",
					"jún.",
					"júl.",
					"aug.",
					"szept.",
					"okt.",
					"nov.",
					"dec."
				],
				"narrow": [
					"J",
					"F",
					"M",
					"Á",
					"M",
					"J",
					"J",
					"A",
					"Sz",
					"O",
					"N",
					"D"
				],
				"wide": [
					"január",
					"február",
					"március",
					"április",
					"május",
					"június",
					"július",
					"augusztus",
					"szeptember",
					"október",
					"november",
					"december"
				]
			},
			"stand-alone": {
				"abbreviated": [
					"jan.",
					"febr.",
					"márc.",
					"ápr.",
					"máj.",
					"jún.",
					"júl.",
					"aug.",
					"szept.",
					"okt.",
					"nov.",
					"dec."
				],
				"narrow": [
					"J",
					"F",
					"M",
					"Á",
					"M",
					"J",
					"J",
					"A",
					"Sz",
					"O",
					"N",
					"D"
				],
				"wide": [
					"január",
					"február",
					"március",
					"április",
					"május",
					"június",
					"július",
					"augusztus",
					"szeptember",
					"október",
					"november",
					"december"
				]
			}
		},
		"days": {
			"format": {
				"abbreviated": [
					"V",
					"H",
					"K",
					"Sze",
					"Cs",
					"P",
					"Szo"
				],
				"narrow": [
					"V",
					"H",
					"K",
					"Sz",
					"Cs",
					"P",
					"Sz"
				],
				"short": [
					"V",
					"H",
					"K",
					"Sze",
					"Cs",
					"P",
					"Szo"
				],
				"wide": [
					"vasárnap",
					"hétfő",
					"kedd",
					"szerda",
					"csütörtök",
					"péntek",
					"szombat"
				]
			},
			"stand-alone": {
				"abbreviated": [
					"V",
					"H",
					"K",
					"Sze",
					"Cs",
					"P",
					"Szo"
				],
				"narrow": [
					"V",
					"H",
					"K",
					"Sz",
					"Cs",
					"P",
					"Sz"
				],
				"short": [
					"V",
					"H",
					"K",
					"Sze",
					"Cs",
					"P",
					"Szo"
				],
				"wide": [
					"vasárnap",
					"hétfő",
					"kedd",
					"szerda",
					"csütörtök",
					"péntek",
					"szombat"
				]
			}
		},
		"quarters": {
			"format": {
				"abbreviated": [
					"N1",
					"N2",
					"N3",
					"N4"
				],
				"narrow": [
					"1.",
					"2.",
					"3.",
					"4."
				],
				"wide": [
					"I. negyedév",
					"II. negyedév",
					"III. negyedév",
					"IV. negyedév"
				]
			},
			"stand-alone": {
				"abbreviated": [
					"N1",
					"N2",
					"N3",
					"N4"
				],
				"narrow": [
					"1.",
					"2.",
					"3.",
					"4."
				],
				"wide": [
					"1. negyedév",
					"2. negyedév",
					"3. negyedév",
					"4. negyedév"
				]
			}
		},
		"dayPeriods": {
			"format": {
				"abbreviated": [
					"de.",
					"du."
				],
				"narrow": [
					"de.",
					"du."
				],
				"wide": [
					"de.",
					"du."
				]
			},
			"stand-alone": {
				"abbreviated": [
					"de.",
					"du."
				],
				"narrow": [
					"de.",
					"du."
				],
				"wide": [
					"de.",
					"du."
				]
			}
		},
		"era-wide": {
			"232": "Meiji",
			"233": "Taishō",
			"234": "Shōwa",
			"235": "Heisei"
		},
		"era-abbreviated": {
			"232": "Meiji",
			"233": "Taishō",
			"234": "Shōwa",
			"235": "Heisei"
		},
		"era-narrow": {
			"232": "M",
			"233": "T",
			"234": "S",
			"235": "H"
		}
	},
	"ca-persian": {
		"dateFormats": {
			"full": "G y. MMMM d., EEEE",
			"long": "G y. MMMM d.",
			"medium": "G y. MMM d.",
			"short": "GGGGG y. M. d."
		},
		"timeFormats": {
			"full": "H:mm:ss zzzz",
			"long": "H:mm:ss z",
			"medium": "H:mm:ss",
			"short": "H:mm"
		},
		"dateTimeFormats": {
			"full": "{1} {0}",
			"long": "{1} {0}",
			"medium": "{1} {0}",
			"short": "{1} {0}",
			"availableFormats": {
				"d": "d",
				"E": "ccc",
				"Ed": "d., E",
				"Ehm": "E h:mm a",
				"EHm": "E HH:mm",
				"Ehms": "E h:mm:ss a",
				"EHms": "E HH:mm:ss",
				"Gy": "G y.",
				"GyMMM": "G y. MMM",
				"GyMMMd": "G y. MMM d.",
				"GyMMMEd": "G y. MMM d., E",
				"h": "a h",
				"H": "H",
				"hm": "a h:mm",
				"Hm": "H:mm",
				"hms": "a h:mm:ss",
				"Hms": "H:mm:ss",
				"M": "L",
				"Md": "M. d.",
				"MEd": "M. d., E",
				"MMM": "LLL",
				"MMMd": "MMM d.",
				"MMMEd": "MMM d., E",
				"MMMMd": "MMMM d.",
				"ms": "mm:ss",
				"y": "G y.",
				"yyyy": "G y.",
				"yyyyM": "G y. MM.",
				"yyyyMd": "G y. MM. dd.",
				"yyyyMEd": "G y. MM. dd., E",
				"yyyyMMM": "G y. MMM",
				"yyyyMMMd": "G y. MMM d.",
				"yyyyMMMEd": "G y. MMM d., E",
				"yyyyMMMM": "G y. MMMM",
				"yyyyQQQ": "G y. QQQ",
				"yyyyQQQQ": "G y. QQQQ"
			},
			"appendItems": {
				"Day": "{0} ({2}: {1})",
				"Day-Of-Week": "{0} {1}",
				"Era": "{1} {0}",
				"Hour": "{0} ({2}: {1})",
				"Minute": "{0} ({2}: {1})",
				"Month": "{0} ({2}: {1})",
				"Quarter": "{0} ({2}: {1})",
				"Second": "{0} ({2}: {1})",
				"Timezone": "{0} {1}",
				"Week": "{0} ({2}: {1})",
				"Year": "{1} {0}"
			},
			"intervalFormats": {
				"intervalFormatFallback": "{0} – {1}",
				"d": {
					"d": "d–d."
				},
				"h": {
					"a": "a h – a h",
					"h": "a h–h"
				},
				"H": {
					"H": "H–H"
				},
				"hm": {
					"a": "a h:mm – a h:mm",
					"h": "a h:mm–h:mm",
					"m": "a h:mm–h:mm"
				},
				"Hm": {
					"H": "H:mm–H:mm",
					"m": "H:mm–H:mm"
				},
				"hmv": {
					"a": "a h:mm – a h:mm v",
					"h": "a h:mm–h:mm v",
					"m": "a h:mm–h:mm v"
				},
				"Hmv": {
					"H": "H:mm–H:mm v",
					"m": "H:mm–H:mm v"
				},
				"hv": {
					"a": "a h – a h v",
					"h": "a h–h v"
				},
				"Hv": {
					"H": "H–H v"
				},
				"M": {
					"M": "M–M."
				},
				"Md": {
					"d": "MM. dd–dd.",
					"M": "MM. dd. – MM. dd."
				},
				"MEd": {
					"d": "MM. dd., E – MM. dd., E",
					"M": "MM. dd., E – MM. dd., E"
				},
				"MMM": {
					"M": "MMM–MMM"
				},
				"MMMd": {
					"d": "MMM d–d.",
					"M": "MMM d. – MMM d."
				},
				"MMMEd": {
					"d": "MMM d., E – d., E",
					"M": "MMM d., E – MMM d., E"
				},
				"y": {
					"y": "G y–y."
				},
				"yM": {
					"M": "G y. MM–MM.",
					"y": "G y. MM. – y. MM."
				},
				"yMd": {
					"d": "G y. MM. dd–dd.",
					"M": "G y. MM. dd. – MM. dd.",
					"y": "G y. MM. dd. – y. MM. dd."
				},
				"yMEd": {
					"d": "G y. MM. dd., E – dd., E",
					"M": "G y. MM. dd., E – MM. dd., E",
					"y": "G y. MM. dd., E – y. MM. dd., E"
				},
				"yMMM": {
					"M": "G y. MMM–MMM",
					"y": "G y. MMM – y. MMM"
				},
				"yMMMd": {
					"d": "G y. MMM d–d.",
					"M": "G y. MMM d. – MMM d.",
					"y": "G y. MMM d. – y. MMM d."
				},
				"yMMMEd": {
					"d": "G y. MMM d., E – MMM d., E",
					"M": "G y. MMM d., E – MMM d., E",
					"y": "G y. MMM d., E – y. MMM d., E"
				},
				"yMMMM": {
					"M": "G y. MMMM–MMMM",
					"y": "G y. MMMM – y. MMMM"
				}
			}
		},
		"months": {
			"format": {
				"abbreviated": [
					"Farvardin",
					"Ordibehesht",
					"Khordad",
					"Tir",
					"Mordad",
					"Shahrivar",
					"Mehr",
					"Aban",
					"Azar",
					"Dey",
					"Bahman",
					"Esfand"
				],
				"narrow": [
					"1",
					"2",
					"3",
					"4",
					"5",
					"6",
					"7",
					"8",
					"9",
					"10",
					"11",
					"12"
				],
				"wide": [
					"Farvardin",
					"Ordibehesht",
					"Khordad",
					"Tir",
					"Mordad",
					"Shahrivar",
					"Mehr",
					"Aban",
					"Azar",
					"Dey",
					"Bahman",
					"Esfand"
				]
			},
			"stand-alone": {
				"abbreviated": [
					"Farvardin",
					"Ordibehesht",
					"Khordad",
					"Tir",
					"Mordad",
					"Shahrivar",
					"Mehr",
					"Aban",
					"Azar",
					"Dey",
					"Bahman",
					"Esfand"
				],
				"narrow": [
					"1",
					"2",
					"3",
					"4",
					"5",
					"6",
					"7",
					"8",
					"9",
					"10",
					"11",
					"12"
				],
				"wide": [
					"Farvardin",
					"Ordibehesht",
					"Khordad",
					"Tir",
					"Mordad",
					"Shahrivar",
					"Mehr",
					"Aban",
					"Azar",
					"Dey",
					"Bahman",
					"Esfand"
				]
			}
		},
		"days": {
			"format": {
				"abbreviated": [
					"V",
					"H",
					"K",
					"Sze",
					"Cs",
					"P",
					"Szo"
				],
				"narrow": [
					"V",
					"H",
					"K",
					"Sz",
					"Cs",
					"P",
					"Sz"
				],
				"short": [
					"V",
					"H",
					"K",
					"Sze",
					"Cs",
					"P",
					"Szo"
				],
				"wide": [
					"vasárnap",
					"hétfő",
					"kedd",
					"szerda",
					"csütörtök",
					"péntek",
					"szombat"
				]
			},
			"stand-alone": {
				"abbreviated": [
					"V",
					"H",
					"K",
					"Sze",
					"Cs",
					"P",
					"Szo"
				],
				"narrow": [
					"V",
					"H",
					"K",
					"Sz",
					"Cs",
					"P",
					"Sz"
				],
				"short": [
					"V",
					"H",
					"K",
					"Sze",
					"Cs",
					"P",
					"Szo"
				],
				"wide": [
					"vasárnap",
					"hétfő",
					"kedd",
					"szerda",
					"csütörtök",
					"péntek",
					"szombat"
				]
			}
		},
		"quarters": {
			"format": {
				"abbreviated": [
					"N1",
					"N2",
					"N3",
					"N4"
				],
				"narrow": [
					"1.",
					"2.",
					"3.",
					"4."
				],
				"wide": [
					"I. negyedév",
					"II. negyedév",
					"III. negyedév",
					"IV. negyedév"
				]
			},
			"stand-alone": {
				"abbreviated": [
					"N1",
					"N2",
					"N3",
					"N4"
				],
				"narrow": [
					"1.",
					"2.",
					"3.",
					"4."
				],
				"wide": [
					"1. negyedév",
					"2. negyedév",
					"3. negyedév",
					"4. negyedév"
				]
			}
		},
		"dayPeriods": {
			"format": {
				"abbreviated": [
					"de.",
					"du."
				],
				"narrow": [
					"de.",
					"du."
				],
				"wide": [
					"de.",
					"du."
				]
			},
			"stand-alone": {
				"abbreviated": [
					"de.",
					"du."
				],
				"narrow": [
					"de.",
					"du."
				],
				"wide": [
					"de.",
					"du."
				]
			}
		},
		"era-wide": {
			"0": "AP"
		},
		"era-abbreviated": {
			"0": "AP"
		},
		"era-narrow": {
			"0": "AP"
		}
	},
	"dateFields": {
		"era": {
			"displayName": "éra"
		},
		"year-wide": {
			"displayName": "év",
			"relative-type--1": "előző év",
			"relative-type-0": "ez az év",
			"relative-type-1": "következő év",
			"relativeTime-type-future": {
				"relativeTimePattern-count-one": "{0} év múlva",
				"relativeTimePattern-count-other": "{0} év múlva"
			},
			"relativeTime-type-past": {
				"relativeTimePattern-count-one": "{0} évvel ezelőtt",
				"relativeTimePattern-count-other": "{0} évvel ezelőtt"
			}
		},
		"year-short": {
			"displayName": "év",
			"relative-type--1": "előző év",
			"relative-type-0": "ez az év",
			"relative-type-1": "következő év",
			"relativeTime-type-future": {
				"relativeTimePattern-count-one": "{0} év múlva",
				"relativeTimePattern-count-other": "{0} év múlva"
			},
			"relativeTime-type-past": {
				"relativeTimePattern-count-one": "{0} évvel ezelőtt",
				"relativeTimePattern-count-other": "{0} évvel ezelőtt"
			}
		},
		"year-narrow": {
			"displayName": "év",
			"relative-type--1": "előző év",
			"relative-type-0": "ez az év",
			"relative-type-1": "következő év",
			"relativeTime-type-future": {
				"relativeTimePattern-count-one": "{0} év múlva",
				"relativeTimePattern-count-other": "{0} év múlva"
			},
			"relativeTime-type-past": {
				"relativeTimePattern-count-one": "{0} évvel ezelőtt",
				"relativeTimePattern-count-other": "{0} évvel ezelőtt"
			}
		},
		"quarter-wide": {
			"displayName": "negyedév",
			"relative-type--1": "előző negyedév",
			"relative-type-0": "ez a negyedév",
			"relative-type-1": "következő negyedév",
			"relativeTime-type-future": {
				"relativeTimePattern-count-one": "{0} negyedév múlva",
				"relativeTimePattern-count-other": "{0} negyedév múlva"
			},
			"relativeTime-type-past": {
				"relativeTimePattern-count-one": "{0} negyedévvel ezelőtt",
				"relativeTimePattern-count-other": "{0} negyedévvel ezelőtt"
			}
		},
		"quarter-short": {
			"displayName": "negyedév",
			"relative-type--1": "előző negyedév",
			"relative-type-0": "ez a negyedév",
			"relative-type-1": "következő negyedév",
			"relativeTime-type-future": {
				"relativeTimePattern-count-one": "{0} negyedév múlva",
				"relativeTimePattern-count-other": "{0} negyedév múlva"
			},
			"relativeTime-type-past": {
				"relativeTimePattern-count-one": "{0} negyedévvel ezelőtt",
				"relativeTimePattern-count-other": "{0} negyedévvel ezelőtt"
			}
		},
		"quarter-narrow": {
			"displayName": "negyedév",
			"relative-type--1": "előző negyedév",
			"relative-type-0": "ez a negyedév",
			"relative-type-1": "következő negyedév",
			"relativeTime-type-future": {
				"relativeTimePattern-count-one": "{0} negyedév múlva",
				"relativeTimePattern-count-other": "{0} negyedév múlva"
			},
			"relativeTime-type-past": {
				"relativeTimePattern-count-one": "{0} negyedévvel ezelőtt",
				"relativeTimePattern-count-other": "{0} negyedévvel ezelőtt"
			}
		},
		"month-wide": {
			"displayName": "hónap",
			"relative-type--1": "előző hónap",
			"relative-type-0": "ez a hónap",
			"relative-type-1": "következő hónap",
			"relativeTime-type-future": {
				"relativeTimePattern-count-one": "{0} hónap múlva",
				"relativeTimePattern-count-other": "{0} hónap múlva"
			},
			"relativeTime-type-past": {
				"relativeTimePattern-count-one": "{0} hónappal ezelőtt",
				"relativeTimePattern-count-other": "{0} hónappal ezelőtt"
			}
		},
		"month-short": {
			"displayName": "hónap",
			"relative-type--1": "előző hónap",
			"relative-type-0": "ez a hónap",
			"relative-type-1": "következő hónap",
			"relativeTime-type-future": {
				"relativeTimePattern-count-one": "{0} hónap múlva",
				"relativeTimePattern-count-other": "{0} hónap múlva"
			},
			"relativeTime-type-past": {
				"relativeTimePattern-count-one": "{0} hónappal ezelőtt",
				"relativeTimePattern-count-other": "{0} hónappal ezelőtt"
			}
		},
		"month-narrow": {
			"displayName": "hónap",
			"relative-type--1": "előző hónap",
			"relative-type-0": "ez a hónap",
			"relative-type-1": "következő hónap",
			"relativeTime-type-future": {
				"relativeTimePattern-count-one": "{0} hónap múlva",
				"relativeTimePattern-count-other": "{0} hónap múlva"
			},
			"relativeTime-type-past": {
				"relativeTimePattern-count-one": "{0} hónappal ezelőtt",
				"relativeTimePattern-count-other": "{0} hónappal ezelőtt"
			}
		},
		"week-wide": {
			"displayName": "hét",
			"relative-type--1": "előző hét",
			"relative-type-0": "ez a hét",
			"relative-type-1": "következő hét",
			"relativeTime-type-future": {
				"relativeTimePattern-count-one": "{0} hét múlva",
				"relativeTimePattern-count-other": "{0} hét múlva"
			},
			"relativeTime-type-past": {
				"relativeTimePattern-count-one": "{0} héttel ezelőtt",
				"relativeTimePattern-count-other": "{0} héttel ezelőtt"
			}
		},
		"week-short": {
			"displayName": "hét",
			"relative-type--1": "előző hét",
			"relative-type-0": "ez a hét",
			"relative-type-1": "következő hét",
			"relativeTime-type-future": {
				"relativeTimePattern-count-one": "{0} hét múlva",
				"relativeTimePattern-count-other": "{0} hét múlva"
			},
			"relativeTime-type-past": {
				"relativeTimePattern-count-one": "{0} héttel ezelőtt",
				"relativeTimePattern-count-other": "{0} héttel ezelőtt"
			}
		},
		"week-narrow": {
			"displayName": "hét",
			"relative-type--1": "előző hét",
			"relative-type-0": "ez a hét",
			"relative-type-1": "következő hét",
			"relativeTime-type-future": {
				"relativeTimePattern-count-one": "{0} hét múlva",
				"relativeTimePattern-count-other": "{0} hét múlva"
			},
			"relativeTime-type-past": {
				"relativeTimePattern-count-one": "{0} héttel ezelőtt",
				"relativeTimePattern-count-other": "{0} héttel ezelőtt"
			}
		},
		"day-wide": {
			"displayName": "nap",
			"relative-type--2": "tegnapelőtt",
			"relative-type--1": "tegnap",
			"relative-type-0": "ma",
			"relative-type-1": "holnap",
			"relative-type-2": "holnapután",
			"relativeTime-type-future": {
				"relativeTimePattern-count-one": "{0} nap múlva",
				"relativeTimePattern-count-other": "{0} nap múlva"
			},
			"relativeTime-type-past": {
				"relativeTimePattern-count-one": "{0} nappal ezelőtt",
				"relativeTimePattern-count-other": "{0} nappal ezelőtt"
			}
		},
		"day-short": {
			"displayName": "nap",
			"relative-type--2": "tegnapelőtt",
			"relative-type--1": "tegnap",
			"relative-type-0": "ma",
			"relative-type-1": "holnap",
			"relative-type-2": "holnapután",
			"relativeTime-type-future": {
				"relativeTimePattern-count-one": "{0} nap múlva",
				"relativeTimePattern-count-other": "{0} nap múlva"
			},
			"relativeTime-type-past": {
				"relativeTimePattern-count-one": "{0} napja",
				"relativeTimePattern-count-other": "{0} napja"
			}
		},
		"day-narrow": {
			"displayName": "nap",
			"relative-type--2": "tegnapelőtt",
			"relative-type--1": "tegnap",
			"relative-type-0": "ma",
			"relative-type-1": "holnap",
			"relative-type-2": "holnapután",
			"relativeTime-type-future": {
				"relativeTimePattern-count-one": "{0} nap múlva",
				"relativeTimePattern-count-other": "{0} nap múlva"
			},
			"relativeTime-type-past": {
				"relativeTimePattern-count-one": "{0} napja",
				"relativeTimePattern-count-other": "{0} napja"
			}
		},
		"weekday": {
			"displayName": "hét napja"
		},
		"hour-wide": {
			"displayName": "óra",
			"relativeTime-type-future": {
				"relativeTimePattern-count-one": "{0} óra múlva",
				"relativeTimePattern-count-other": "{0} óra múlva"
			},
			"relativeTime-type-past": {
				"relativeTimePattern-count-one": "{0} órával ezelőtt",
				"relativeTimePattern-count-other": "{0} órával ezelőtt"
			}
		},
		"hour-short": {
			"displayName": "óra",
			"relativeTime-type-future": {
				"relativeTimePattern-count-one": "{0} óra múlva",
				"relativeTimePattern-count-other": "{0} óra múlva"
			},
			"relativeTime-type-past": {
				"relativeTimePattern-count-one": "{0} órával ezelőtt",
				"relativeTimePattern-count-other": "{0} órával ezelőtt"
			}
		},
		"hour-narrow": {
			"displayName": "óra",
			"relativeTime-type-future": {
				"relativeTimePattern-count-one": "{0} óra múlva",
				"relativeTimePattern-count-other": "{0} óra múlva"
			},
			"relativeTime-type-past": {
				"relativeTimePattern-count-one": "{0} órával ezelőtt",
				"relativeTimePattern-count-other": "{0} órával ezelőtt"
			}
		},
		"minute-wide": {
			"displayName": "perc",
			"relativeTime-type-future": {
				"relativeTimePattern-count-one": "{0} perc múlva",
				"relativeTimePattern-count-other": "{0} perc múlva"
			},
			"relativeTime-type-past": {
				"relativeTimePattern-count-one": "{0} perccel ezelőtt",
				"relativeTimePattern-count-other": "{0} perccel ezelőtt"
			}
		},
		"minute-short": {
			"displayName": "perc",
			"relativeTime-type-future": {
				"relativeTimePattern-count-one": "{0} perc múlva",
				"relativeTimePattern-count-other": "{0} perc múlva"
			},
			"relativeTime-type-past": {
				"relativeTimePattern-count-one": "{0} perccel ezelőtt",
				"relativeTimePattern-count-other": "{0} perccel ezelőtt"
			}
		},
		"minute-narrow": {
			"displayName": "perc",
			"relativeTime-type-future": {
				"relativeTimePattern-count-one": "{0} perc múlva",
				"relativeTimePattern-count-other": "{0} perc múlva"
			},
			"relativeTime-type-past": {
				"relativeTimePattern-count-one": "{0} perccel ezelőtt",
				"relativeTimePattern-count-other": "{0} perccel ezelőtt"
			}
		},
		"second-wide": {
			"displayName": "másodperc",
			"relative-type-0": "most",
			"relativeTime-type-future": {
				"relativeTimePattern-count-one": "{0} másodperc múlva",
				"relativeTimePattern-count-other": "{0} másodperc múlva"
			},
			"relativeTime-type-past": {
				"relativeTimePattern-count-one": "{0} másodperccel ezelőtt",
				"relativeTimePattern-count-other": "{0} másodperccel ezelőtt"
			}
		},
		"second-short": {
			"displayName": "másodperc",
			"relative-type-0": "most",
			"relativeTime-type-future": {
				"relativeTimePattern-count-one": "{0} másodperc múlva",
				"relativeTimePattern-count-other": "{0} másodperc múlva"
			},
			"relativeTime-type-past": {
				"relativeTimePattern-count-one": "{0} másodperccel ezelőtt",
				"relativeTimePattern-count-other": "{0} másodperccel ezelőtt"
			}
		},
		"second-narrow": {
			"displayName": "másodperc",
			"relative-type-0": "most",
			"relativeTime-type-future": {
				"relativeTimePattern-count-one": "{0} másodperc múlva",
				"relativeTimePattern-count-other": "{0} másodperc múlva"
			},
			"relativeTime-type-past": {
				"relativeTimePattern-count-one": "{0} másodperccel ezelőtt",
				"relativeTimePattern-count-other": "{0} másodperccel ezelőtt"
			}
		},
		"zone": {
			"displayName": "időzóna"
		}
	},
	"decimalFormat": {
		"standard": "#,##0.###"
	},
	"decimalFormat-long": {
		"1000-one": "0 ezer",
		"1000-other": "0 ezer",
		"10000-one": "00 ezer",
		"10000-other": "00 ezer",
		"100000-one": "000 ezer",
		"100000-other": "000 ezer",
		"1000000-one": "0 millió",
		"1000000-other": "0 millió",
		"10000000-one": "00 millió",
		"10000000-other": "00 millió",
		"100000000-one": "000 millió",
		"100000000-other": "000 millió",
		"1000000000-one": "0 milliárd",
		"1000000000-other": "0 milliárd",
		"10000000000-one": "00 milliárd",
		"10000000000-other": "00 milliárd",
		"100000000000-one": "000 milliárd",
		"100000000000-other": "000 milliárd",
		"1000000000000-one": "0 billió",
		"1000000000000-other": "0 billió",
		"10000000000000-one": "00 billió",
		"10000000000000-other": "00 billió",
		"100000000000000-one": "000 billió",
		"100000000000000-other": "000 billió"
	},
	"decimalFormat-short": {
		"1000-one": "0 E",
		"1000-other": "0 E",
		"10000-one": "00 E",
		"10000-other": "00 E",
		"100000-one": "000 E",
		"100000-other": "000 E",
		"1000000-one": "0 M",
		"1000000-other": "0 M",
		"10000000-one": "00 M",
		"10000000-other": "00 M",
		"100000000-one": "000 M",
		"100000000-other": "000 M",
		"1000000000-one": "0 Mrd",
		"1000000000-other": "0 Mrd",
		"10000000000-one": "00 Mrd",
		"10000000000-other": "00 Mrd",
		"100000000000-one": "000 Mrd",
		"100000000000-other": "000 Mrd",
		"1000000000000-one": "0 B",
		"1000000000000-other": "0 B",
		"10000000000000-one": "00 B",
		"10000000000000-other": "00 B",
		"100000000000000-one": "000 B",
		"100000000000000-other": "000 B"
	},
	"scientificFormat": {
		"standard": "#E0"
	},
	"percentFormat": {
		"standard": "#,##0%"
	},
	"currencyFormat": {
		"standard": "#,##0.00 ¤",
		"accounting": "#,##0.00 ¤",
		"currencySpacing": {
			"beforeCurrency": {
				"currencyMatch": "[:^S:]",
				"surroundingMatch": "[:digit:]",
				"insertBetween": " "
			},
			"afterCurrency": {
				"currencyMatch": "[:^S:]",
				"surroundingMatch": "[:digit:]",
				"insertBetween": " "
			}
		}
	},
	"symbols-latn-decimal": ",",
	"symbols-latn-group": " ",
	"symbols-latn-list": ";",
	"symbols-latn-percentSign": "%",
	"symbols-latn-plusSign": "+",
	"symbols-latn-minusSign": "-",
	"symbols-latn-exponential": "E",
	"symbols-latn-superscriptingExponent": "×",
	"symbols-latn-perMille": "‰",
	"symbols-latn-infinity": "∞",
	"symbols-latn-nan": "NaN",
	"symbols-latn-timeSeparator": ":",
	"currencySymbols": {
		"HUF": "Ft",
		"JPY": "¥",
		"XAF": "FCFA",
		"XOF": "CFA",
		"XPF": "CFPF"
	},
	"currencyDigits": {
		"ADP": 0,
		"AFN": 0,
		"ALL": 0,
		"AMD": 0,
		"BHD": 3,
		"BIF": 0,
		"BYR": 0,
		"CAD": 2,
		"CHF": 2,
		"CLF": 4,
		"CLP": 0,
		"COP": 0,
		"CRC": 0,
		"CZK": 0,
		"DEFAULT": 2,
		"DJF": 0,
		"ESP": 0,
		"GNF": 0,
		"GYD": 0,
		"HUF": 0,
		"IDR": 0,
		"IQD": 0,
		"IRR": 0,
		"ISK": 0,
		"ITL": 0,
		"JOD": 3,
		"JPY": 0,
		"KMF": 0,
		"KPW": 0,
		"KRW": 0,
		"KWD": 3,
		"LAK": 0,
		"LBP": 0,
		"LUF": 0,
		"LYD": 3,
		"MGA": 0,
		"MGF": 0,
		"MMK": 0,
		"MNT": 0,
		"MRO": 0,
		"MUR": 0,
		"OMR": 3,
		"PKR": 0,
		"PYG": 0,
		"RSD": 0,
		"RWF": 0,
		"SLL": 0,
		"SOS": 0,
		"STD": 0,
		"SYP": 0,
		"TMM": 0,
		"TND": 3,
		"TRL": 0,
		"TWD": 0,
		"TZS": 0,
		"UGX": 0,
		"UYI": 0,
		"UZS": 0,
		"VND": 0,
		"VUV": 0,
		"XAF": 0,
		"XOF": 0,
		"XPF": 0,
		"YER": 0,
		"ZMK": 0,
		"ZWD": 0
	},
	"weekData-minDays": 4,
	"weekData-firstDay": 1,
	"weekData-weekendStart": 6,
	"weekData-weekendEnd": 0,
	"timeData": {
		"_allowed": "H h",
		"_preferred": "H"
	},
	"eras-gregorian": {
		"0": {
			"_end": "0-12-31"
		},
		"1": {
			"_start": "1-01-01"
		}
	},
	"eras-islamic": {
		"0": {
			"_start": "622-7-15"
		}
	},
	"eras-persian": {
		"0": {
			"_start": "622-01-01"
		}
	},
	"eras-japanese": {
		"232": {
			"_start": "1868-9-8"
		},
		"233": {
			"_start": "1912-7-30"
		},
		"234": {
			"_start": "1926-12-25"
		},
		"235": {
			"_start": "1989-1-8"
		}
	}
}