{
  "modules" : [
    {
      "name" : "sap/ui/unified/Calendar.js",
      "description" : "Provides control sap.ui.unified.Calendar.",
      "size" : 60322,
      "compressedSize" : 31338,
      "required" : ["jquery.sap.global.js", "sap/ui/core/Control.js", "sap/ui/core/LocaleData.js", "sap/ui/model/type/Date.js", "sap/ui/unified/calendar/CalendarUtils.js", "sap/ui/unified/calendar/Header.js", "sap/ui/unified/calendar/Month.js", "sap/ui/unified/calendar/MonthPicker.js", "sap/ui/unified/calendar/YearPicker.js", "sap/ui/core/date/UniversalDate.js", "sap/ui/unified/library.js"],
      "includes" : []
    },
    {
      "name" : "sap/ui/unified/CalendarAppointment.js",
      "description" : "Provides control sap.ui.unified.CalendarAppointment.",
      "size" : 2485,
      "compressedSize" : 804,
      "required" : ["jquery.sap.global.js", "sap/ui/unified/DateTypeRange.js", "sap/ui/unified/library.js"],
      "includes" : []
    },
    {
      "name" : "sap/ui/unified/CalendarDateInterval.js",
      "description" : "Provides control sap.ui.unified.Calendar.",
      "size" : 21726,
      "compressedSize" : 10813,
      "required" : ["jquery.sap.global.js", "sap/ui/core/Control.js", "sap/ui/core/LocaleData.js", "sap/ui/model/type/Date.js", "sap/ui/unified/calendar/CalendarUtils.js", "sap/ui/unified/Calendar.js", "sap/ui/unified/calendar/Header.js", "sap/ui/unified/calendar/Month.js", "sap/ui/unified/calendar/DatesRow.js", "sap/ui/unified/calendar/MonthPicker.js", "sap/ui/unified/calendar/YearPicker.js", "sap/ui/core/date/UniversalDate.js", "sap/ui/unified/library.js", "sap/ui/core/Popup.js"],
      "includes" : []
    },
    {
      "name" : "sap/ui/unified/CalendarDateIntervalRenderer.js",
      "description" : "! UI development toolkit for HTML5 (OpenUI5) (c) Copyright 2009-2016 SAP SE or an SAP affiliate company. Licensed under the Apache License, Version 2.0 - see LICENSE.txt.",
      "size" : 861,
      "compressedSize" : 549,
      "required" : ["jquery.sap.global.js", "sap/ui/core/Renderer.js", "sap/ui/unified/CalendarRenderer.js"],
      "includes" : []
    },
    {
      "name" : "sap/ui/unified/CalendarLegend.js",
      "description" : "Provides control sap.ui.unified.CalendarLegend.",
      "size" : 2851,
      "compressedSize" : 1527,
      "required" : ["jquery.sap.global.js", "sap/ui/core/Control.js", "sap/ui/unified/library.js"],
      "includes" : []
    },
    {
      "name" : "sap/ui/unified/CalendarLegendItem.js",
      "description" : "Provides control sap.ui.unified.CalendarLegendItem.",
      "size" : 1762,
      "compressedSize" : 571,
      "required" : ["jquery.sap.global.js", "sap/ui/core/Element.js", "sap/ui/unified/library.js"],
      "includes" : []
    },
    {
      "name" : "sap/ui/unified/CalendarLegendRenderer.js",
      "description" : "UI development toolkit for HTML5 (OpenUI5) (c) Copyright 2009-2016 SAP SE or an SAP affiliate company. Licensed under the Apache License, Version 2.0 - see LICENSE.txt.",
      "size" : 3916,
      "compressedSize" : 1812,
      "required" : ["jquery.sap.global.js"],
      "includes" : []
    },
    {
      "name" : "sap/ui/unified/CalendarMonthInterval.js",
      "description" : "Provides control sap.ui.unified.Calendar.",
      "size" : 37120,
      "compressedSize" : 19152,
      "required" : ["jquery.sap.global.js", "sap/ui/core/Control.js", "sap/ui/core/LocaleData.js", "sap/ui/model/type/Date.js", "sap/ui/unified/calendar/CalendarUtils.js", "sap/ui/unified/calendar/Header.js", "sap/ui/unified/calendar/MonthsRow.js", "sap/ui/unified/calendar/MonthPicker.js", "sap/ui/unified/calendar/YearPicker.js", "sap/ui/core/date/UniversalDate.js", "sap/ui/unified/library.js", "sap/ui/core/Popup.js"],
      "includes" : []
    },
    {
      "name" : "sap/ui/unified/CalendarMonthIntervalRenderer.js",
      "description" : "! UI development toolkit for HTML5 (OpenUI5) (c) Copyright 2009-2016 SAP SE or an SAP affiliate company. Licensed under the Apache License, Version 2.0 - see LICENSE.txt.",
      "size" : 2637,
      "compressedSize" : 1455,
      "required" : ["jquery.sap.global.js"],
      "includes" : []
    },
    {
      "name" : "sap/ui/unified/CalendarRenderer.js",
      "description" : "! UI development toolkit for HTML5 (OpenUI5) (c) Copyright 2009-2016 SAP SE or an SAP affiliate company. Licensed under the Apache License, Version 2.0 - see LICENSE.txt.",
      "size" : 2973,
      "compressedSize" : 1640,
      "required" : ["jquery.sap.global.js"],
      "includes" : []
    },
    {
      "name" : "sap/ui/unified/CalendarRow.js",
      "description" : "Provides control sap.ui.unified.Calendar.",
      "size" : 58295,
      "compressedSize" : 24088,
      "required" : ["jquery.sap.global.js", "sap/ui/core/Control.js", "sap/ui/core/LocaleData.js", "sap/ui/model/type/Date.js", "sap/ui/unified/calendar/CalendarUtils.js", "sap/ui/core/date/UniversalDate.js", "sap/ui/unified/library.js"],
      "includes" : []
    },
    {
      "name" : "sap/ui/unified/CalendarRowRenderer.js",
      "description" : "! UI development toolkit for HTML5 (OpenUI5) (c) Copyright 2009-2016 SAP SE or an SAP affiliate company. Licensed under the Apache License, Version 2.0 - see LICENSE.txt.",
      "size" : 14829,
      "compressedSize" : 8163,
      "required" : ["jquery.sap.global.js", "sap/ui/core/date/UniversalDate.js"],
      "includes" : []
    },
    {
      "name" : "sap/ui/unified/CalendarTimeInterval.js",
      "description" : "Provides control sap.ui.unified.Calendar.",
      "size" : 57511,
      "compressedSize" : 31178,
      "required" : ["jquery.sap.global.js", "sap/ui/core/Control.js", "sap/ui/core/LocaleData.js", "sap/ui/model/type/Date.js", "sap/ui/unified/calendar/CalendarUtils.js", "sap/ui/unified/calendar/Header.js", "sap/ui/unified/calendar/TimesRow.js", "sap/ui/unified/calendar/DatesRow.js", "sap/ui/unified/calendar/MonthPicker.js", "sap/ui/unified/calendar/YearPicker.js", "sap/ui/core/date/UniversalDate.js", "sap/ui/unified/library.js", "sap/ui/core/Popup.js"],
      "includes" : []
    },
    {
      "name" : "sap/ui/unified/CalendarTimeIntervalRenderer.js",
      "description" : "! UI development toolkit for HTML5 (OpenUI5) (c) Copyright 2009-2016 SAP SE or an SAP affiliate company. Licensed under the Apache License, Version 2.0 - see LICENSE.txt.",
      "size" : 2628,
      "compressedSize" : 1453,
      "required" : ["jquery.sap.global.js"],
      "includes" : []
    },
    {
      "name" : "sap/ui/unified/CalendarWeekInterval.js",
      "description" : "Provides control sap.ui.unified.CalendarWeekInterval.",
      "size" : 8775,
      "compressedSize" : 2218,
      "required" : ["jquery.sap.global.js", "sap/ui/unified/calendar/CalendarUtils.js", "sap/ui/core/date/UniversalDate.js", "sap/ui/unified/library.js", "sap/ui/unified/CalendarDateInterval.js", "sap/ui/unified/CalendarDateIntervalRenderer.js"],
      "includes" : []
    },
    {
      "name" : "sap/ui/unified/ContentSwitcher.js",
      "description" : "Provides control sap.ui.unified.ContentSwitcher.",
      "size" : 5950,
      "compressedSize" : 2044,
      "required" : ["jquery.sap.global.js", "sap/ui/core/Control.js", "sap/ui/unified/library.js"],
      "includes" : []
    },
    {
      "name" : "sap/ui/unified/ContentSwitcherRenderer.js",
      "description" : "! UI development toolkit for HTML5 (OpenUI5) (c) Copyright 2009-2016 SAP SE or an SAP affiliate company. Licensed under the Apache License, Version 2.0 - see LICENSE.txt.",
      "size" : 2040,
      "compressedSize" : 1141,
      "required" : ["jquery.sap.global.js"],
      "includes" : []
    },
    {
      "name" : "sap/ui/unified/Currency.js",
      "description" : "Provides control sap.ui.unified.Currency.",
      "size" : 8717,
      "compressedSize" : 3294,
      "required" : ["jquery.sap.global.js", "sap/ui/core/Control.js", "sap/ui/core/LocaleData.js", "sap/ui/core/format/NumberFormat.js"],
      "includes" : []
    },
    {
      "name" : "sap/ui/unified/CurrencyRenderer.js",
      "description" : "Provides default renderer for control sap.ui.unified.Menu",
      "size" : 1861,
      "compressedSize" : 958,
      "required" : ["jquery.sap.global.js"],
      "includes" : []
    },
    {
      "name" : "sap/ui/unified/DateRange.js",
      "description" : "Provides control sap.ui.unified.DateRange.",
      "size" : 2396,
      "compressedSize" : 1131,
      "required" : ["jquery.sap.global.js", "sap/ui/core/Element.js", "sap/ui/unified/library.js"],
      "includes" : []
    },
    {
      "name" : "sap/ui/unified/DateTypeRange.js",
      "description" : "Provides control sap.ui.unified.DateTypeRange.",
      "size" : 1539,
      "compressedSize" : 508,
      "required" : ["jquery.sap.global.js", "sap/ui/unified/DateRange.js", "sap/ui/unified/library.js"],
      "includes" : []
    },
    {
      "name" : "sap/ui/unified/FileUploader.js",
      "description" : "Provides control sap.ui.unified.FileUploader.",
      "size" : 48679,
      "compressedSize" : 20940,
      "required" : ["jquery.sap.global.js", "sap/ui/core/Control.js", "sap/ui/unified/library.js", "sap/ui/core/LabelEnablement.js"],
      "includes" : []
    },
    {
      "name" : "sap/ui/unified/FileUploaderParameter.js",
      "description" : "Provides control sap.ui.unified.FileUploaderParameter.",
      "size" : 1527,
      "compressedSize" : 514,
      "required" : ["jquery.sap.global.js", "sap/ui/core/Element.js", "sap/ui/unified/library.js"],
      "includes" : []
    },
    {
      "name" : "sap/ui/unified/FileUploaderRenderer.js",
      "description" : "Provides default renderer for control sap.ui.unified.FileUploader",
      "size" : 4048,
      "compressedSize" : 2333,
      "required" : ["jquery.sap.global.js"],
      "includes" : []
    },
    {
      "name" : "sap/ui/unified/Menu.js",
      "description" : "Provides control sap.ui.unified.Menu.",
      "size" : 37873,
      "compressedSize" : 17393,
      "required" : ["jquery.sap.global.js", "sap/ui/core/Control.js", "sap/ui/Device.js", "sap/ui/core/Popup.js", "sap/ui/unified/MenuItemBase.js", "sap/ui/unified/library.js", "jquery.sap.script.js"],
      "includes" : []
    },
    {
      "name" : "sap/ui/unified/MenuItem.js",
      "description" : "Provides control sap.ui.unified.MenuItem.",
      "size" : 3777,
      "compressedSize" : 1917,
      "required" : ["jquery.sap.global.js", "sap/ui/core/IconPool.js", "sap/ui/unified/MenuItemBase.js", "sap/ui/unified/library.js"],
      "includes" : []
    },
    {
      "name" : "sap/ui/unified/MenuItemBase.js",
      "description" : "Provides control sap.ui.unified.MenuItemBase.",
      "size" : 5202,
      "compressedSize" : 1580,
      "required" : ["jquery.sap.global.js", "sap/ui/core/Element.js", "sap/ui/unified/library.js"],
      "includes" : []
    },
    {
      "name" : "sap/ui/unified/MenuRenderer.js",
      "description" : "Provides default renderer for control sap.ui.unified.Menu",
      "size" : 3803,
      "compressedSize" : 2006,
      "required" : ["jquery.sap.global.js"],
      "includes" : []
    },
    {
      "name" : "sap/ui/unified/MenuTextFieldItem.js",
      "description" : "Provides control sap.ui.unified.MenuTextFieldItem.",
      "size" : 10042,
      "compressedSize" : 5058,
      "required" : ["jquery.sap.global.js", "sap/ui/core/ValueStateSupport.js", "sap/ui/unified/MenuItemBase.js", "sap/ui/unified/library.js"],
      "includes" : []
    },
    {
      "name" : "sap/ui/unified/Shell.js",
      "description" : "Provides control sap.ui.unified.Shell.",
      "size" : 7979,
      "compressedSize" : 3703,
      "required" : ["jquery.sap.global.js", "sap/ui/unified/ShellHeader.js", "sap/ui/unified/ShellLayout.js", "sap/ui/unified/library.js"],
      "includes" : []
    },
    {
      "name" : "sap/ui/unified/ShellHeadItem.js",
      "description" : "Provides control sap.ui.unified.ShellHeadItem.",
      "size" : 6252,
      "compressedSize" : 2810,
      "required" : ["jquery.sap.global.js", "sap/ui/core/Element.js", "sap/ui/core/IconPool.js", "sap/ui/unified/library.js"],
      "includes" : []
    },
    {
      "name" : "sap/ui/unified/ShellHeadUserItem.js",
      "description" : "Provides control sap.ui.unified.ShellHeadUserItem.",
      "size" : 4493,
      "compressedSize" : 1947,
      "required" : ["jquery.sap.global.js", "sap/ui/core/Element.js", "sap/ui/core/IconPool.js", "sap/ui/unified/library.js"],
      "includes" : []
    },
    {
      "name" : "sap/ui/unified/ShellHeader.js",
      "description" : "! UI development toolkit for HTML5 (OpenUI5) (c) Copyright 2009-2016 SAP SE or an SAP affiliate company. Licensed under the Apache License, Version 2.0 - see LICENSE.txt.",
      "size" : 7942,
      "compressedSize" : 5803,
      "required" : ["jquery.sap.global.js", "sap/ui/unified/library.js", "sap/ui/core/theming/Parameters.js"],
      "includes" : []
    },
    {
      "name" : "sap/ui/unified/ShellLayout.js",
      "description" : "Provides control sap.ui.unified.ShellLayout.",
      "size" : 18834,
      "compressedSize" : 11748,
      "required" : ["jquery.sap.global.js", "sap/ui/Device.js", "sap/ui/core/Control.js", "sap/ui/core/Popup.js", "sap/ui/core/theming/Parameters.js", "sap/ui/unified/SplitContainer.js", "sap/ui/unified/library.js", "jquery.sap.dom.js", "jquery.sap.script.js"],
      "includes" : []
    },
    {
      "name" : "sap/ui/unified/ShellLayoutRenderer.js",
      "description" : "Provides default renderer for control sap.ui.unified.ShellLayout",
      "size" : 2817,
      "compressedSize" : 1926,
      "required" : ["jquery.sap.global.js"],
      "includes" : []
    },
    {
      "name" : "sap/ui/unified/ShellOverlay.js",
      "description" : "Provides control sap.ui.unified.ShellOverlay.",
      "size" : 10586,
      "compressedSize" : 6470,
      "required" : ["jquery.sap.global.js", "sap/ui/Device.js", "sap/ui/core/Control.js", "sap/ui/core/Popup.js", "sap/ui/unified/Shell.js", "sap/ui/unified/library.js", "jquery.sap.script.js"],
      "includes" : []
    },
    {
      "name" : "sap/ui/unified/ShellOverlayRenderer.js",
      "description" : "Provides default renderer for control sap.ui.unified.ShellOverlay",
      "size" : 3342,
      "compressedSize" : 2122,
      "required" : ["jquery.sap.global.js"],
      "includes" : []
    },
    {
      "name" : "sap/ui/unified/ShellRenderer.js",
      "description" : "Provides default renderer for control sap.ui.unified.Shell",
      "size" : 618,
      "compressedSize" : 334,
      "required" : ["jquery.sap.global.js", "sap/ui/core/Renderer.js", "sap/ui/unified/ShellLayoutRenderer.js"],
      "includes" : []
    },
    {
      "name" : "sap/ui/unified/SplitContainer.js",
      "description" : "Provides control sap.ui.unified.SplitContainer.",
      "size" : 11966,
      "compressedSize" : 5340,
      "required" : ["jquery.sap.global.js", "sap/ui/core/Control.js", "sap/ui/core/theming/Parameters.js", "sap/ui/unified/library.js"],
      "includes" : []
    },
    {
      "name" : "sap/ui/unified/SplitContainerRenderer.js",
      "description" : "Provides default renderer for control sap.ui.unified.SplitContainer",
      "size" : 2559,
      "compressedSize" : 1455,
      "required" : ["jquery.sap.global.js"],
      "includes" : []
    },
    {
      "name" : "sap/ui/unified/calendar/CalendarUtils.js",
      "description" : "Provides class sap.ui.unified.caledar.CalendarUtils",
      "size" : 8448,
      "compressedSize" : 2614,
      "required" : ["jquery.sap.global.js", "sap/ui/core/date/UniversalDate.js"],
      "includes" : []
    },
    {
      "name" : "sap/ui/unified/calendar/DatesRow.js",
      "description" : "Provides control sap.ui.unified.Calendar.",
      "size" : 9060,
      "compressedSize" : 4096,
      "required" : ["jquery.sap.global.js", "sap/ui/core/Control.js", "sap/ui/core/LocaleData.js", "sap/ui/core/delegate/ItemNavigation.js", "sap/ui/model/type/Date.js", "sap/ui/unified/calendar/CalendarUtils.js", "sap/ui/core/date/UniversalDate.js", "sap/ui/unified/calendar/Month.js", "sap/ui/unified/library.js"],
      "includes" : []
    },
    {
      "name" : "sap/ui/unified/calendar/DatesRowRenderer.js",
      "description" : "! UI development toolkit for HTML5 (OpenUI5) (c) Copyright 2009-2016 SAP SE or an SAP affiliate company. Licensed under the Apache License, Version 2.0 - see LICENSE.txt.",
      "size" : 3435,
      "compressedSize" : 2001,
      "required" : ["jquery.sap.global.js", "sap/ui/core/Renderer.js", "sap/ui/unified/calendar/CalendarUtils.js", "sap/ui/core/date/UniversalDate.js", "sap/ui/unified/calendar/MonthRenderer.js"],
      "includes" : []
    },
    {
      "name" : "sap/ui/unified/calendar/Header.js",
      "description" : "Provides control sap.ui.unified.Calendar.",
      "size" : 7720,
      "compressedSize" : 3829,
      "required" : ["jquery.sap.global.js", "sap/ui/core/Control.js", "sap/ui/core/LocaleData.js", "sap/ui/unified/library.js"],
      "includes" : []
    },
    {
      "name" : "sap/ui/unified/calendar/HeaderRenderer.js",
      "description" : "! UI development toolkit for HTML5 (OpenUI5) (c) Copyright 2009-2016 SAP SE or an SAP affiliate company. Licensed under the Apache License, Version 2.0 - see LICENSE.txt.",
      "size" : 3594,
      "compressedSize" : 2192,
      "required" : ["jquery.sap.global.js"],
      "includes" : []
    },
    {
      "name" : "sap/ui/unified/calendar/Month.js",
      "description" : "Provides control sap.ui.unified.Calendar.",
      "size" : 53060,
      "compressedSize" : 24918,
      "required" : ["jquery.sap.global.js", "sap/ui/core/Control.js", "sap/ui/core/LocaleData.js", "sap/ui/core/delegate/ItemNavigation.js", "sap/ui/model/type/Date.js", "sap/ui/unified/calendar/CalendarUtils.js", "sap/ui/core/date/UniversalDate.js", "sap/ui/unified/library.js"],
      "includes" : []
    },
    {
      "name" : "sap/ui/unified/calendar/MonthPicker.js",
      "description" : "Provides control sap.ui.unified.Calendar.",
      "size" : 16272,
      "compressedSize" : 7623,
      "required" : ["jquery.sap.global.js", "sap/ui/core/Control.js", "sap/ui/core/LocaleData.js", "sap/ui/core/delegate/ItemNavigation.js", "sap/ui/unified/library.js"],
      "includes" : []
    },
    {
      "name" : "sap/ui/unified/calendar/MonthPickerRenderer.js",
      "description" : "! UI development toolkit for HTML5 (OpenUI5) (c) Copyright 2009-2016 SAP SE or an SAP affiliate company. Licensed under the Apache License, Version 2.0 - see LICENSE.txt.",
      "size" : 3468,
      "compressedSize" : 1680,
      "required" : ["jquery.sap.global.js"],
      "includes" : []
    },
    {
      "name" : "sap/ui/unified/calendar/MonthRenderer.js",
      "description" : "! UI development toolkit for HTML5 (OpenUI5) (c) Copyright 2009-2016 SAP SE or an SAP affiliate company. Licensed under the Apache License, Version 2.0 - see LICENSE.txt.",
      "size" : 13975,
      "compressedSize" : 8054,
      "required" : ["jquery.sap.global.js", "sap/ui/unified/calendar/CalendarUtils.js", "sap/ui/core/date/UniversalDate.js"],
      "includes" : []
    },
    {
      "name" : "sap/ui/unified/calendar/MonthsRow.js",
      "description" : "Provides control sap.ui.unified.CalendarMonthInterval.",
      "size" : 41497,
      "compressedSize" : 19667,
      "required" : ["jquery.sap.global.js", "sap/ui/core/Control.js", "sap/ui/core/LocaleData.js", "sap/ui/core/delegate/ItemNavigation.js", "sap/ui/model/type/Date.js", "sap/ui/unified/calendar/CalendarUtils.js", "sap/ui/core/date/UniversalDate.js", "sap/ui/unified/library.js"],
      "includes" : []
    },
    {
      "name" : "sap/ui/unified/calendar/MonthsRowRenderer.js",
      "description" : "! UI development toolkit for HTML5 (OpenUI5) (c) Copyright 2009-2016 SAP SE or an SAP affiliate company. Licensed under the Apache License, Version 2.0 - see LICENSE.txt.",
      "size" : 8551,
      "compressedSize" : 4877,
      "required" : ["jquery.sap.global.js", "sap/ui/unified/calendar/CalendarUtils.js", "sap/ui/core/date/UniversalDate.js"],
      "includes" : []
    },
    {
      "name" : "sap/ui/unified/calendar/TimesRow.js",
      "description" : "Provides control sap.ui.unified.CalendarTimeInterval.",
      "size" : 42402,
      "compressedSize" : 20758,
      "required" : ["jquery.sap.global.js", "sap/ui/core/Control.js", "sap/ui/core/LocaleData.js", "sap/ui/core/delegate/ItemNavigation.js", "sap/ui/model/type/Date.js", "sap/ui/unified/calendar/CalendarUtils.js", "sap/ui/core/date/UniversalDate.js", "sap/ui/unified/library.js"],
      "includes" : []
    },
    {
      "name" : "sap/ui/unified/calendar/TimesRowRenderer.js",
      "description" : "! UI development toolkit for HTML5 (OpenUI5) (c) Copyright 2009-2016 SAP SE or an SAP affiliate company. Licensed under the Apache License, Version 2.0 - see LICENSE.txt.",
      "size" : 8902,
      "compressedSize" : 4993,
      "required" : ["jquery.sap.global.js", "sap/ui/unified/calendar/CalendarUtils.js", "sap/ui/core/date/UniversalDate.js"],
      "includes" : []
    },
    {
      "name" : "sap/ui/unified/calendar/YearPicker.js",
      "description" : "Provides control sap.ui.unified.Calendar.",
      "size" : 17702,
      "compressedSize" : 9043,
      "required" : ["jquery.sap.global.js", "sap/ui/core/Control.js", "sap/ui/core/delegate/ItemNavigation.js", "sap/ui/model/type/Date.js", "sap/ui/unified/calendar/CalendarUtils.js", "sap/ui/core/date/UniversalDate.js", "sap/ui/unified/library.js"],
      "includes" : []
    },
    {
      "name" : "sap/ui/unified/calendar/YearPickerRenderer.js",
      "description" : "! UI development toolkit for HTML5 (OpenUI5) (c) Copyright 2009-2016 SAP SE or an SAP affiliate company. Licensed under the Apache License, Version 2.0 - see LICENSE.txt.",
      "size" : 3275,
      "compressedSize" : 1701,
      "required" : ["jquery.sap.global.js", "sap/ui/core/date/UniversalDate.js"],
      "includes" : []
    },
    {
      "name" : "sap/ui/unified/library.js",
      "description" : "Initialization Code and shared classes of library sap.ui.unified.",
      "size" : 8588,
      "compressedSize" : 3500,
      "required" : ["jquery.sap.global.js", "sap/ui/core/library.js"],
      "includes" : []
    },
    {
      "name" : "sap/ui/unified/manifest.json",
      "size" : 774,
      "required" : [],
      "includes" : []
    },
    {
      "name" : "sap/ui/unified/messagebundle.properties",
      "size" : 1778,
      "required" : [],
      "includes" : []
    },
    {
      "name" : "sap/ui/unified/messagebundle_ar.properties",
      "size" : 2558,
      "required" : [],
      "includes" : []
    },
    {
      "name" : "sap/ui/unified/messagebundle_bg.properties",
      "size" : 2705,
      "required" : [],
      "includes" : []
    },
    {
      "name" : "sap/ui/unified/messagebundle_ca.properties",
      "size" : 1691,
      "required" : [],
      "includes" : []
    },
    {
      "name" : "sap/ui/unified/messagebundle_cs.properties",
      "size" : 1895,
      "required" : [],
      "includes" : []
    },
    {
      "name" : "sap/ui/unified/messagebundle_da.properties",
      "size" : 1673,
      "required" : [],
      "includes" : []
    },
    {
      "name" : "sap/ui/unified/messagebundle_de.properties",
      "size" : 1706,
      "required" : [],
      "includes" : []
    },
    {
      "name" : "sap/ui/unified/messagebundle_el.properties",
      "size" : 2861,
      "required" : [],
      "includes" : []
    },
    {
      "name" : "sap/ui/unified/messagebundle_en.properties",
      "size" : 1655,
      "required" : [],
      "includes" : []
    },
    {
      "name" : "sap/ui/unified/messagebundle_en_US_sappsd.properties",
      "size" : 3448,
      "required" : [],
      "includes" : []
    },
    {
      "name" : "sap/ui/unified/messagebundle_en_US_saptrc.properties",
      "size" : 2161,
      "required" : [],
      "includes" : []
    },
    {
      "name" : "sap/ui/unified/messagebundle_es.properties",
      "size" : 1718,
      "required" : [],
      "includes" : []
    },
    {
      "name" : "sap/ui/unified/messagebundle_et.properties",
      "size" : 1724,
      "required" : [],
      "includes" : []
    },
    {
      "name" : "sap/ui/unified/messagebundle_fi.properties",
      "size" : 1773,
      "required" : [],
      "includes" : []
    },
    {
      "name" : "sap/ui/unified/messagebundle_fr.properties",
      "size" : 1763,
      "required" : [],
      "includes" : []
    },
    {
      "name" : "sap/ui/unified/messagebundle_hi.properties",
      "size" : 2741,
      "required" : [],
      "includes" : []
    },
    {
      "name" : "sap/ui/unified/messagebundle_hr.properties",
      "size" : 1749,
      "required" : [],
      "includes" : []
    },
    {
      "name" : "sap/ui/unified/messagebundle_hu.properties",
      "size" : 1861,
      "required" : [],
      "includes" : []
    },
    {
      "name" : "sap/ui/unified/messagebundle_it.properties",
      "size" : 1706,
      "required" : [],
      "includes" : []
    },
    {
      "name" : "sap/ui/unified/messagebundle_iw.properties",
      "size" : 2466,
      "required" : [],
      "includes" : []
    },
    {
      "name" : "sap/ui/unified/messagebundle_ja.properties",
      "size" : 1927,
      "required" : [],
      "includes" : []
    },
    {
      "name" : "sap/ui/unified/messagebundle_kk.properties",
      "size" : 2739,
      "required" : [],
      "includes" : []
    },
    {
      "name" : "sap/ui/unified/messagebundle_ko.properties",
      "size" : 1856,
      "required" : [],
      "includes" : []
    },
    {
      "name" : "sap/ui/unified/messagebundle_lt.properties",
      "size" : 1795,
      "required" : [],
      "includes" : []
    },
    {
      "name" : "sap/ui/unified/messagebundle_lv.properties",
      "size" : 1840,
      "required" : [],
      "includes" : []
    },
    {
      "name" : "sap/ui/unified/messagebundle_ms.properties",
      "size" : 1673,
      "required" : [],
      "includes" : []
    },
    {
      "name" : "sap/ui/unified/messagebundle_nl.properties",
      "size" : 1670,
      "required" : [],
      "includes" : []
    },
    {
      "name" : "sap/ui/unified/messagebundle_no.properties",
      "size" : 1679,
      "required" : [],
      "includes" : []
    },
    {
      "name" : "sap/ui/unified/messagebundle_pl.properties",
      "size" : 1821,
      "required" : [],
      "includes" : []
    },
    {
      "name" : "sap/ui/unified/messagebundle_pt.properties",
      "size" : 1709,
      "required" : [],
      "includes" : []
    },
    {
      "name" : "sap/ui/unified/messagebundle_ro.properties",
      "size" : 1880,
      "required" : [],
      "includes" : []
    },
    {
      "name" : "sap/ui/unified/messagebundle_ru.properties",
      "size" : 2818,
      "required" : [],
      "includes" : []
    },
    {
      "name" : "sap/ui/unified/messagebundle_sh.properties",
      "size" : 1727,
      "required" : [],
      "includes" : []
    },
    {
      "name" : "sap/ui/unified/messagebundle_sk.properties",
      "size" : 1856,
      "required" : [],
      "includes" : []
    },
    {
      "name" : "sap/ui/unified/messagebundle_sl.properties",
      "size" : 1714,
      "required" : [],
      "includes" : []
    },
    {
      "name" : "sap/ui/unified/messagebundle_sv.properties",
      "size" : 1694,
      "required" : [],
      "includes" : []
    },
    {
      "name" : "sap/ui/unified/messagebundle_th.properties",
      "size" : 2803,
      "required" : [],
      "includes" : []
    },
    {
      "name" : "sap/ui/unified/messagebundle_tr.properties",
      "size" : 1859,
      "required" : [],
      "includes" : []
    },
    {
      "name" : "sap/ui/unified/messagebundle_uk.properties",
      "size" : 2840,
      "required" : [],
      "includes" : []
    },
    {
      "name" : "sap/ui/unified/messagebundle_vi.properties",
      "size" : 2127,
      "required" : [],
      "includes" : []
    },
    {
      "name" : "sap/ui/unified/messagebundle_zh_CN.properties",
      "size" : 1837,
      "required" : [],
      "includes" : []
    },
    {
      "name" : "sap/ui/unified/messagebundle_zh_TW.properties",
      "size" : 1855,
      "required" : [],
      "includes" : []
    }
  ]
}
