{
  "name": "vscode-extension",
  "$schema": "../../node_modules/nx/schemas/project-schema.json",
  "sourceRoot": "apps/vscode-extension/src",
  "projectType": "application",
  "targets": {
    "build": {
      "executor": "@nx/esbuild:esbuild",
      "outputs": ["{options.outputPath}"],
      "defaultConfiguration": "production",
      "options": {
        "platform": "node",
        "outputPath": "dist/apps/vscode-extension",
        "format": ["cjs"],
        "bundle": true,
        "main": "apps/vscode-extension/src/main.ts",
        "tsConfig": "apps/vscode-extension/tsconfig.app.json",
        "additionalEntryPoints": [
          "apps/vscode-extension/src/main-browser.ts"
        ],
        "external": ["vscode"],
        "assets": [{
          "input": "apps/vscode-extension/src/assets",
          "output": "/",
          "glob": "**/*.json"
        }],
        "generatePackageJson": false,
        "esbuildOptions": {
          "sourcemap": true,
          "outExtension": {
            ".js": ".js"
          }
        }
      },
      "configurations": {
        "development": {},
        "production": {
          "esbuildOptions": {
            "sourcemap": false,
            "outExtension": {
              ".js": ".js"
            }
          }
        }
      }
    },
    "serve": {
      "executor": "@nx/js:node",
      "defaultConfiguration": "development",
      "options": {
        "buildTarget": "vscode-extension:build"
      },
      "configurations": {
        "development": {
          "buildTarget": "vscode-extension:build:development"
        },
        "production": {
          "buildTarget": "vscode-extension:build:production"
        }
      }
    },
    "lint": {
      "executor": "@nx/linter:eslint",
      "outputs": ["{options.outputFile}"],
      "options": {
        "lintFilePatterns": ["apps/vscode-extension/**/*.ts"]
      }
    },
    "compile-syntax": {
      "executor": "nx:run-commands",
      "options": {
        "commands": [
          {
            "command": "npx js-yaml assets/syntax/wgsl.tmLanguage.yaml > assets/syntax/wgsl.tmLanguage.json"
          }
        ],
        "cwd": "apps/vscode-extension/src"
      }
    }
  },
  "tags": []
}
