{
  "$schema": "https://raw.githubusercontent.com/martinring/tmlanguage/master/tmlanguage.json",
  "name": "WGSL",
  "scopeName": "source.wgsl",
  "patterns": [
    {
      "include": "#line_comments"
    },
    {
      "include": "#block_comments"
    },
    {
      "include": "#space"
    },
    {
      "include": "#punctuation"
    },
    {
      "include": "#attributes"
    },
    {
      "include": "#keywords"
    },
    {
      "include": "#types"
    },
    {
      "include": "#literal"
    },
    {
      "include": "#identifier"
    }
  ],
  "repository": {
    "space": {
      "name": "space.wgsl",
      "match": "\\s+"
    },
    "line_comments": {
      "comment": "single line comment",
      "name": "comment.line.double-slash.wgsl",
      "match": "\\s*//.*"
    },
    "block_comments": {
      "patterns": [
        {
          "comment": "empty block comments",
          "name": "comment.block.wgsl",
          "match": "/\\*\\*/"
        },
        {
          "comment": "block documentation comments",
          "name": "comment.block.documentation.wgsl",
          "begin": "/\\*\\*",
          "end": "\\*/",
          "patterns": [
            {
              "include": "#block_comments"
            }
          ]
        },
        {
          "comment": "block comments",
          "name": "comment.block.wgsl",
          "begin": "/\\*(?!\\*)",
          "end": "\\*/",
          "patterns": [
            {
              "include": "#block_comments"
            }
          ]
        }
      ]
    },
    "literal": {
      "patterns": [
        {
          "include": "#float_literal"
        },
        {
          "include": "#int_literal"
        },
        {
          "include": "#bool_literal"
        }
      ]
    },
    "bool_literal": {
      "name": "constant.language.boolean.wgsl",
      "match": "\\b(true|false)\\b"
    },
    "int_literal": {
      "patterns": [
        {
          "include": "#hex_int_literal"
        },
        {
          "include": "#decimal_int_literal"
        }
      ]
    },
    "float_literal": {
      "patterns": [
        {
          "include": "#hex_float_literal"
        },
        {
          "include": "#decimal_float_literal"
        }
      ]
    },
    "decimal_int_literal": {
      "patterns": [
        {
          "name": "constant.numeric.decimal.wgsl",
          "match": "0[iu]?"
        },
        {
          "name": "constant.numeric.hex.wgsl",
          "match": "[1-9][0-9]*[iu]?"
        }
      ]
    },
    "hex_int_literal": {
      "patterns": [
        {
          "name": "constant.numeric.hex.wgsl",
          "match": "0[xX][0-9a-fA-F]+[iu]?"
        }
      ]
    },
    "decimal_float_literal": {
      "patterns": [
        {
          "name": "constant.numeric.decimal.wgsl",
          "match": "0[fh]"
        },
        {
          "name": "constant.numeric.decimal.wgsl",
          "match": "[1-9][0-9]*[fh]"
        },
        {
          "name": "constant.numeric.decimal.wgsl",
          "match": "[0-9]*\\.[0-9]+([eE][+-]?[0-9]+)?[fh]?"
        },
        {
          "name": "constant.numeric.decimal.wgsl",
          "match": "[0-9]+\\.[0-9]*([eE][+-]?[0-9]+)?[fh]?"
        },
        {
          "name": "constant.numeric.decimal.wgsl",
          "match": "[0-9]+[eE][+-]?[0-9]+[fh]?"
        }
      ]
    },
    "hex_float_literal": {
      "patterns": [
        {
          "name": "constant.numeric.hex.wgsl",
          "match": "0[xX][0-9a-fA-F]*\\.[0-9a-fA-F]+([pP][+-]?[0-9]+[fh]?)?"
        },
        {
          "name": "constant.numeric.hex.wgsl",
          "match": "0[xX][0-9a-fA-F]+\\.[0-9a-fA-F]*([pP][+-]?[0-9]+[fh]?)?"
        },
        {
          "name": "constant.numeric.hex.wgsl",
          "match": "0[xX][0-9a-fA-F]+[pP][+-]?[0-9]+[fh]?"
        }
      ]
    },
    "identifier": {
      "patterns": [
        {
          "name": "variable.wgsl",
          "match": "([_\\p{XID_Start}][\\p{XID_Continue}]+)|([\\p{XID_Start}])"
        }
      ]
    },
    "keywords": {
      "patterns": [
        {
          "name": "keyword.control.wgsl",
          "match": "\\b(alias|break|case|const|const_assert|continue|continuing|default|diagnostic|discard|else|enable|for|if|loop|override|requires|return|switch|while)\\b"
        },
        {
          "name": "keyword.reserved.wgsl error",
          "match": "\\b(NULL|Self|abstract|active|alignas|alignof|as|asm|asm_fragment|async|attribute|auto|await|become|binding_array|cast|catch|class|co_await|co_return|co_yield|coherent|column_major|common|compile|compile_fragment|concept|const_cast|consteval|constexpr|constinit|crate|debugger|decltype|delete|demote|demote_to_helper|do|dynamic_cast|enum|explicit|export|extends|extern|external|fallthrough|filter|final|finally|friend|from|fxgroup|get|goto|groupshared|highp|impl|implements|import|inline|instanceof|interface|layout|lowp|macro|macro_rules|match|mediump|meta|mod|module|move|mut|mutable|namespace|new|nil|noexcept|noinline|nointerpolation|noperspective|null|nullptr|of|operator|package|packoffset|partition|pass|patch|pixelfragment|precise|precision|premerge|priv|protected|pub|public|readonly|ref|regardless|register|reinterpret_cast|require|resource|restrict|self|set|shared|sizeof|smooth|snorm|static|static_assert|static_cast|std|subroutine|super|target|template|this|thread_local|throw|trait|try|type|typedef|typeid|typename|typeof|union|unless|unorm|unsafe|unsized|use|using|varying|virtual|volatile|wgsl|where|with|writeonly|yield)\\b"
        },
        {
          "name": "keyword.declaration.type.wgsl storage.type.wgsl",
          "match": "\\b(type)\\b"
        },
        {
          "name": "keyword.other.wgsl",
          "match": "\\b(let|var)\\b"
        },
        {
          "name": "keyword.declaration.struct.wgsl",
          "match": "\\b(struct)\\b"
        },
        {
          "name": "keyword.other.fn.wgsl",
          "match": "\\bfn\\b"
        },
        {
          "name": "keyword.operator.logical.wgsl",
          "match": "(\\^|\\||\\|\\||&&|<<|>>|!)(?!=)"
        },
        {
          "name": "keyword.operator.borrow.and.wgsl",
          "match": "&(?![&=])"
        },
        {
          "name": "keyword.operator.assignment.wgsl",
          "match": "(\\+=|-=|\\*=|/=|%=|\\^=|&=|\\|=|<<=|>>=)"
        },
        {
          "name": "keyword.operator.assignment.equal.wgsl",
          "match": "(?<![<>])=(?!=|>)"
        },
        {
          "name": "keyword.operator.comparison.wgsl",
          "match": "(=(=)?(?!>)|!=|<=|(?<!=)>=)"
        },
        {
          "name": "keyword.operator.math.wgsl",
          "match": "(([+%]|(\\*(?!\\w)))(?!=))|(-(?!>))|(/(?!/))"
        },
        {
          "name": "keyword.operator.access.dot.wgsl",
          "match": "\\.(?!\\.)"
        },
        {
          "name": "keyword.operator.arrow.skinny.wgsl",
          "match": "->"
        }
      ]
    },
    "punctuation": {
      "patterns": [
        {
          "name": "punctuation.comma.wgsl",
          "match": ","
        },
        {
          "name": "punctuation.brackets.curly.wgsl",
          "match": "[{}]"
        },
        {
          "name": "punctuation.brackets.round.wgsl",
          "match": "[()]"
        },
        {
          "name": "punctuation.semi.wgsl",
          "match": ";"
        },
        {
          "name": "punctuation.brackets.square.wgsl",
          "match": "[\\[\\]]"
        },
        {
          "name": "punctuation.brackets.angle.wgsl",
          "match": "(?<!=)[<>]"
        }
      ]
    },
    "attributes": {
      "patterns": [
        {
          "name": "meta.attribute.wgsl",
          "match": "@(align|binding|builtin|compute|const|diagnostic|fragment|group|id|interpolate|invariant|location|must_use|size|vertex|workgroup_size)\\b"
        }
      ]
    },
    "types": {
      "name": "storage.type.wgsl",
      "patterns": [
        {
          "name": "storage.type.wgsl",
          "comment": "boolean",
          "match": "\\bbool\\b"
        },
        {
          "name": "storage.type.wgsl",
          "comment": "integer",
          "match": "\\b[iu]32\\b"
        },
        {
          "name": "storage.type.wgsl",
          "comment": "float",
          "match": "\\bf(32|16)\\b"
        },
        {
          "name": "storage.type.wgsl",
          "comment": "vector",
          "match": "\\bvec[2-4][iufh]?\\b"
        },
        {
          "name": "storage.type.wgsl",
          "comment": "matrix",
          "match": "\\bmat[2-4]x[2-4][fh]?\\b"
        },
        {
          "name": "storage.type.wgsl",
          "comment": "atomic",
          "match": "\\batomic\\b"
        },
        {
          "name": "storage.type.wgsl",
          "comment": "array",
          "match": "\\barray\\b"
        }
      ]
    }
  }
}
