{
	"info": {
		"_postman_id": "8ed4ee72-03c7-4752-bb4a-dcdd4603d89e",
		"name": "Exercise",
		"schema": "https://schema.getpostman.com/json/collection/v2.1.0/collection.json"
	},
	"item": [
		{
			"name": "Save Topics A - success",
			"request": {
				"method": "POST",
				"header": [],
				"body": {
					"mode": "raw",
					"raw": "{\r\n    \"topic\": \"B\",\r\n    \"name\": \"a\",\r\n    \"description\": \"something\"\r\n}",
					"options": {
						"raw": {
							"language": "json"
						}
					}
				},
				"url": {
					"raw": "http://localhost:9090/topic",
					"protocol": "http",
					"host": [
						"localhost"
					],
					"port": "9090",
					"path": [
						"topic"
					]
				}
			},
			"response": []
		},
		{
			"name": "Save Topics B - success",
			"request": {
				"method": "POST",
				"header": [],
				"body": {
					"mode": "raw",
					"raw": "{\r\n    \"topic\": \"B\",\r\n    \"name\": \"x\",\r\n    \"description\": \"success\"\r\n}",
					"options": {
						"raw": {
							"language": "json"
						}
					}
				},
				"url": {
					"raw": "http://localhost:9090/topic",
					"protocol": "http",
					"host": [
						"localhost"
					],
					"port": "9090",
					"path": [
						"topic"
					]
				}
			},
			"response": []
		},
		{
			"name": "Save Topics A - Validation Error for Name & Length",
			"request": {
				"method": "POST",
				"header": [],
				"body": {
					"mode": "raw",
					"raw": "{\r\n    \"topic\": \"A\",\r\n    \"name\": \"aaa\",\r\n    \"description\": \"something\"\r\n}",
					"options": {
						"raw": {
							"language": "json"
						}
					}
				},
				"url": {
					"raw": "http://localhost:9090/topic",
					"protocol": "http",
					"host": [
						"localhost"
					],
					"port": "9090",
					"path": [
						"topic"
					]
				}
			},
			"response": []
		},
		{
			"name": "Get Topic",
			"request": {
				"method": "GET",
				"header": [],
				"url": {
					"raw": "http://localhost:9090/topic?topic=A",
					"protocol": "http",
					"host": [
						"localhost"
					],
					"port": "9090",
					"path": [
						"topic"
					],
					"query": [
						{
							"key": "topic",
							"value": "A"
						}
					]
				}
			},
			"response": []
		},
		{
			"name": "Get All Topics",
			"request": {
				"method": "GET",
				"header": [],
				"url": {
					"raw": "http://localhost:9090/topics",
					"protocol": "http",
					"host": [
						"localhost"
					],
					"port": "9090",
					"path": [
						"topics"
					]
				}
			},
			"response": []
		}
	]
}