Id,Label
1,1
2,0
3,0
4,0
5,1
6,1
7,0
8,0
9,0
10,1
11,0
12,0
13,0
14,0
15,0
16,0
17,0
18,1
19,0
20,0
21,1
22,0
23,1
24,1
25,0
26,0
27,0
28,0
29,0
30,1
31,0
32,0
33,0
34,0
35,1
36,0
37,0
38,0
39,0
40,0
41,0
42,0
43,0
44,1
45,0
46,0
47,0
48,0
49,1
50,0
51,0
52,0
53,0
54,0
55,0
56,0
57,0
58,0
59,0
60,1
61,0
62,0
63,0
64,0
65,1
66,0
67,1
68,0
69,0
70,0
71,0
72,0
73,0
74,1
75,0
76,0
77,0
78,0
79,0
80,0
81,0
82,0
83,0
84,1
85,0
86,0
87,1
88,0
89,0
90,0
91,0
92,0
93,1
94,1
95,0
96,0
97,0
98,0
99,1
100,0
101,0
102,0
103,0
104,0
105,0
106,0
107,0
108,0
109,0
110,0
111,0
112,1
113,0
114,0
115,0
116,1
117,1
118,0
119,1
120,0
121,0
122,0
123,0
124,1
125,0
126,0
127,0
128,1
129,0
130,0
131,1
132,0
133,0
134,0
135,1
136,0
137,0
138,0
139,0
140,0
141,0
142,0
143,1
144,1
145,1
146,0
147,1
148,0
149,1
150,0
151,0
152,1
153,0
154,0
155,0
156,1
157,0
158,0
159,1
160,0
161,0
162,0
163,0
164,0
165,0
166,0
167,0
168,0
169,0
170,0
171,0
172,0
173,0
174,0
175,0
176,0
177,0
178,0
179,0
180,1
181,1
182,1
183,1
184,1
185,0
186,0
187,0
188,1
189,1
190,0
191,0
192,0
193,0
194,0
195,0
196,0
197,0
198,0
199,1
200,0
201,0
202,0
203,0
204,0
205,1
206,0
207,0
208,0
209,0
210,0
211,0
212,0
213,0
214,0
215,1
216,0
217,0
218,1
219,1
220,0
221,1
222,0
223,0
224,1
225,0
226,0
227,0
228,0
229,0
230,0
231,0
232,1
233,0
234,0
235,0
236,0
237,1
238,0
239,1
240,0
241,0
242,0
243,0
244,0
245,0
246,0
247,0
248,0
249,0
250,0
251,0
252,0
253,0
254,0
255,0
256,0
257,0
258,0
259,0
260,1
261,0
262,0
263,0
264,1
265,0
266,0
267,0
268,0
269,0
270,0
271,0
272,1
273,0
274,0
275,0
276,0
277,0
278,0
279,0
280,0
281,0
282,0
283,0
284,0
285,1
286,1
287,1
288,1
289,1
290,1
291,0
292,0
293,0
294,1
295,1
296,0
297,1
298,0
299,0
300,1
301,0
302,1
303,1
304,0
305,0
306,1
307,1
308,1
309,0
310,0
311,0
312,1
313,0
314,1
315,0
316,0
317,1
318,0
319,0
320,0
321,0
322,0
323,1
324,0
325,0
326,0
327,0
328,1
329,0
330,0
331,0
332,1
333,1
334,0
335,0
336,0
337,0
338,0
339,0
340,1
341,1
342,0
343,0
344,1
345,0
346,0
347,0
348,0
349,0
350,0
351,1
352,1
353,0
354,1
355,0
356,0
357,1
358,0
359,0
360,0
361,0
362,0
363,0
364,0
365,1
366,0
367,0
368,0
369,0
370,1
371,1
372,0
373,1
374,1
375,1
376,0
377,0
378,0
379,1
380,0
381,0
382,0
383,0
384,1
385,1
386,1
387,0
388,0
389,0
390,0
391,0
392,0
393,1
394,0
395,1
396,0
397,1
398,1
399,0
400,0
401,1
402,1
403,0
404,0
405,0
406,1
407,0
408,0
409,1
410,0
411,0
412,0
413,0
414,0
415,0
416,0
417,0
418,0
419,0
420,0
421,0
422,0
423,0
424,0
425,0
426,1
427,0
428,0
429,1
430,1
431,0
432,0
433,0
434,1
435,1
436,1
437,0
438,0
439,0
440,0
441,0
442,0
443,0
444,0
445,0
446,0
447,0
448,1
449,1
450,0
451,1
452,0
453,0
454,0
455,0
456,0
457,0
458,0
459,0
460,0
461,0
462,0
463,0
464,0
465,1
466,1
467,0
468,0
469,0
470,1
471,0
472,1
473,0
474,0
475,0
476,0
477,0
478,0
479,1
480,0
481,1
482,0
483,1
484,1
485,1
486,0
487,0
488,1
489,0
490,0
491,0
492,0
493,0
494,1
495,0
496,0
497,0
498,0
499,1
500,0
501,0
502,0
503,0
504,1
505,0
506,0
507,0
508,1
509,1
510,0
511,0
512,1
513,1
514,0
515,1
516,0
517,1
518,0
519,0
520,1
521,1
522,1
523,0
524,0
525,1
526,1
527,0
528,0
529,1
530,0
531,0
532,0
533,1
534,0
535,0
536,0
537,0
538,0
539,0
540,1
541,0
542,0
543,0
544,0
545,0
546,1
547,0
548,0
549,1
550,0
551,0
552,1
553,0
554,0
555,0
556,0
557,1
558,0
559,1
560,0
561,0
562,0
563,1
564,0
565,1
566,0
567,0
568,0
569,1
570,0
571,1
572,0
573,0
574,0
575,0
576,1
577,0
578,0
579,0
580,0
581,0
582,0
583,0
584,0
585,0
586,0
587,0
588,0
589,0
590,1
591,1
592,0
593,0
594,0
595,0
596,0
597,0
598,0
599,0
600,0
601,1
602,0
603,0
604,0
605,0
606,0
607,0
608,0
609,0
610,1
611,0
612,1
613,1
614,0
615,0
616,1
617,1
618,0
619,1
620,0
621,0
622,0
623,1
624,0
625,0
626,1
627,0
628,0
629,1
630,0
631,0
632,0
633,0
634,0
635,0
636,0
637,1
638,1
639,0
640,0
641,0
642,1
643,0
644,0
645,1
646,1
647,1
648,0
649,0
650,0
651,0
652,0
653,0
654,0
655,1
656,1
657,1
658,1
659,0
660,1
661,0
662,0
663,1
664,1
665,1
666,0
667,0
668,1
669,0
670,0
671,0
672,0
673,0
674,0
675,0
676,0
677,1
678,1
679,0
680,0
681,0
682,0
683,0
684,1
685,0
686,0
687,0
688,0
689,1
690,0
691,0
692,1
693,1
694,1
695,0
696,0
697,0
698,1
699,0
700,0
701,0
702,0
703,0
704,0
705,1
706,0
707,0
708,0
709,0
710,0
711,0
712,0
713,0
714,0
715,0
716,0
717,0
718,1
719,0
720,0
721,1
722,0
723,1
724,1
725,1
726,0
727,0
728,1
729,1
730,0
731,0
732,0
733,0
734,0
735,0
736,1
737,1
738,1
739,0
740,0
741,0
742,1
743,1
744,0
745,1
746,1
747,0
748,0
749,0
750,0
751,0
752,1
753,0
754,0
755,0
756,0
757,1
758,0
759,1
760,0
761,0
762,0
763,0
764,0
765,0
766,1
767,0
768,0
769,1
770,1
771,0
772,0
773,0
774,0
775,0
776,1
777,0
778,0
779,0
780,0
781,1
782,0
783,1
784,1
785,0
786,0
787,0
788,0
789,0
790,1
791,0
792,0
793,0
794,1
795,0
796,1
797,0
798,0
799,0
800,0
801,0
802,0
803,1
804,0
805,1
806,0
807,0
808,1
809,0
810,0
811,0
812,0
813,0
814,0
815,1
816,0
817,0
818,0
819,0
820,0
821,0
822,0
823,1
824,0
825,0
826,0
827,1
828,1
829,0
830,0
831,0
832,1
833,0
834,0
835,0
836,0
837,0
838,0
839,0
840,0
841,0
842,1
843,1
844,0
845,1
846,0
847,0
848,0
849,0
850,0
851,1
852,0
853,1
854,0
855,1
856,0
857,1
858,0
859,1
860,0
861,0
862,0
863,0
864,0
865,0
866,0
867,0
868,0
869,1
870,0
871,0
872,0
873,0
874,1
875,0
876,0
877,0
878,0
879,0
880,0
881,0
882,0
883,1
884,0
885,0
886,0
887,0
888,0
889,1
890,0
891,0
892,1
893,0
894,1
895,0
896,0
897,0
898,0
899,0
900,0
901,0
902,0
903,1
904,0
905,1
906,0
907,0
908,1
909,0
910,0
911,0
912,0
913,0
914,0
915,0
916,0
917,0
918,1
919,1
920,1
921,0
922,1
923,0
924,0
925,0
926,0
927,0
928,0
929,1
930,0
931,0
932,0
933,1
934,0
935,1
936,0
937,0
938,0
939,0
940,0
941,0
942,0
943,0
944,0
945,1
946,1
947,0
948,0
949,0
950,0
951,0
952,0
953,0
954,0
955,1
956,0
957,1
958,0
959,0
960,0
961,1
962,0
963,0
964,0
965,0
966,0
967,0
968,1
969,0
970,1
971,0
972,0
973,1
974,0
975,0
976,0
977,1
978,0
979,0
980,0
981,0
982,0
983,0
984,1
985,0
986,1
987,1
988,0
989,0
990,0
991,0
992,0
993,0
994,0
995,0
996,0
997,0
998,0
999,0
1000,0
1001,1
1002,0
1003,0
1004,1
1005,0
1006,1
1007,0
1008,1
1009,0
1010,0
1011,0
1012,0
1013,0
1014,1
1015,0
1016,0
1017,0
1018,0
1019,0
1020,0
1021,1
1022,1
1023,0
1024,1
1025,0
1026,0
1027,0
1028,0
1029,0
1030,0
1031,0
1032,1
1033,1
1034,0
1035,0
1036,0
1037,0
1038,1
1039,0
1040,0
1041,0
1042,1
1043,0
1044,0
1045,0
1046,0
1047,0
1048,0
1049,0
1050,1
1051,0
1052,1
1053,1
1054,0
1055,0
1056,0
1057,0
1058,1
1059,0
1060,0
1061,0
1062,1
1063,0
1064,0
1065,0
1066,1
1067,1
1068,0
1069,0
1070,1
1071,0
1072,0
1073,1
1074,0
1075,0
1076,1
1077,0
1078,1
1079,0
1080,0
1081,0
1082,0
1083,0
1084,1
1085,0
1086,1
1087,0
1088,0
1089,0
1090,0
1091,0
1092,0
1093,0
1094,0
1095,1
1096,0
1097,0
1098,0
1099,0
1100,0
1101,1
1102,0
1103,0
1104,1
1105,1
1106,0
1107,0
1108,0
1109,0
1110,0
1111,0
1112,1
1113,0
1114,0
1115,1
1116,0
1117,0
1118,0
1119,0
1120,1
1121,0
1122,0
1123,0
1124,0
1125,0
1126,0
1127,0
1128,0
1129,0
1130,0
1131,0
1132,0
1133,1
1134,0
1135,1
1136,1
1137,0
1138,0
1139,1
1140,0
1141,0
1142,1
1143,0
1144,0
1145,1
1146,0
1147,1
1148,0
1149,1
1150,1
1151,1
1152,0
1153,0
1154,0
1155,1
1156,0
1157,0
1158,0
1159,0
1160,1
1161,0
1162,0
1163,0
1164,0
1165,0
1166,0
1167,0
1168,0
1169,1
1170,1
1171,1
1172,0
1173,0
1174,0
1175,1
1176,0
1177,0
1178,1
1179,0
1180,1
1181,1
1182,1
1183,0
1184,1
1185,1
1186,0
1187,0
1188,0
1189,1
1190,0
1191,1
1192,1
1193,1
1194,0
1195,0
1196,0
1197,1
1198,0
1199,0
1200,0
1201,0
1202,1
1203,0
1204,0
1205,1
1206,1
1207,1
1208,0
1209,0
1210,0
1211,0
1212,0
1213,0
1214,0
1215,0
1216,0
1217,1
1218,1
1219,0
1220,1
1221,0
1222,1
1223,0
1224,0
1225,1
1226,0
1227,0
1228,0
1229,0
1230,0
1231,0
1232,0
1233,0
1234,0
1235,0
1236,0
1237,1
1238,0
1239,1
1240,0
1241,0
1242,0
1243,0
1244,0
1245,0
1246,1
1247,1
1248,0
1249,0
1250,0
1251,1
1252,0
1253,0
1254,1
1255,1
1256,0
1257,0
1258,0
1259,1
1260,1
1261,0
1262,0
1263,1
1264,1
1265,1
1266,0
1267,1
1268,0
1269,0
1270,0
1271,0
1272,0
1273,0
1274,0
1275,0
1276,0
1277,1
1278,0
1279,1
1280,1
1281,0
1282,0
1283,1
1284,0
1285,0
1286,0
1287,0
1288,1
1289,0
1290,0
1291,1
1292,1
1293,1
1294,0
1295,1
1296,0
1297,1
1298,0
1299,0
1300,0
1301,0
1302,0
1303,0
1304,0
1305,0
1306,0
1307,1
1308,0
1309,0
1310,0
1311,0
1312,0
1313,0
1314,0
1315,0
1316,0
1317,0
1318,1
1319,0
1320,0
1321,0
1322,0
1323,0
1324,0
1325,0
1326,0
1327,0
1328,0
1329,0
1330,1
1331,0
1332,1
1333,0
1334,0
1335,0
1336,0
1337,0
1338,0
1339,0
1340,0
1341,1
1342,0
1343,0
1344,0
1345,0
1346,0
1347,1
1348,0
1349,0
1350,1
1351,0
1352,0
1353,0
1354,0
1355,0
1356,0
1357,1
1358,1
1359,0
1360,0
1361,0
1362,0
1363,0
1364,1
1365,0
1366,0
1367,0
1368,0
1369,0
1370,0
1371,0
1372,1
1373,0
1374,0
1375,0
1376,0
1377,1
1378,1
1379,0
1380,0
1381,0
1382,0
1383,1
1384,0
1385,1
1386,0
1387,1
1388,0
1389,0
1390,0
1391,0
1392,0
1393,0
1394,1
1395,0
1396,0
1397,0
1398,1
1399,0
1400,0
1401,0
1402,1
1403,0
1404,0
1405,0
1406,0
1407,0
1408,0
1409,1
1410,0
1411,0
1412,1
1413,1
1414,0
1415,0
1416,0
1417,1
1418,0
1419,1
1420,0
1421,1
1422,1
1423,1
1424,0
1425,0
1426,0
1427,0
1428,0
1429,0
1430,0
1431,1
1432,0
1433,0
1434,1
1435,0
1436,1
1437,0
1438,0
1439,0
1440,0
1441,0
1442,0
1443,0
1444,0
1445,0
1446,1
1447,1
1448,1
1449,0
1450,0
1451,0
1452,0
1453,0
1454,1
1455,0
1456,1
1457,0
1458,0
1459,0
1460,0
1461,0
1462,0
1463,0
1464,0
1465,1
1466,0
1467,0
1468,0
1469,0
1470,0
1471,0
1472,0
1473,1
1474,1
1475,0
1476,0
1477,1
1478,1
1479,0
1480,1
1481,0
1482,0
1483,0
1484,0
1485,0
1486,0
1487,0
1488,0
1489,1
1490,1
1491,1
1492,1
1493,0
1494,0
1495,0
1496,0
1497,0
1498,0
1499,0
1500,0
1501,1
1502,0
1503,0
1504,0
1505,1
1506,0
1507,0
1508,1
1509,0
1510,1
1511,0
1512,0
1513,0
1514,1
1515,0
1516,1
1517,0
1518,1
1519,1
1520,0
1521,1
1522,1
1523,0
1524,1
1525,1
1526,0
1527,0
1528,1
1529,1
1530,1
1531,0
1532,0
1533,0
1534,0
1535,1
1536,0
1537,0
1538,0
1539,0
1540,0
1541,0
1542,1
1543,0
1544,0
1545,1
1546,1
1547,1
1548,0
1549,0
1550,0
1551,0
1552,0
1553,1
1554,0
1555,0
1556,1
1557,0
1558,0
1559,0
1560,0
1561,0
1562,0
1563,0
1564,0
1565,0
1566,0
1567,1
1568,0
1569,0
1570,0
1571,1
1572,0
1573,1
1574,1
1575,1
1576,1
1577,0
1578,0
1579,0
1580,0
1581,1
1582,0
1583,0
1584,0
1585,1
1586,1
1587,0
1588,0
1589,0
1590,0
1591,0
1592,1
1593,0
1594,0
1595,1
1596,0
1597,0
1598,1
1599,0
1600,1
1601,1
1602,0
1603,0
1604,1
1605,0
1606,1
1607,0
1608,0
1609,0
1610,0
1611,1
1612,0
1613,0
1614,1
1615,0
1616,0
1617,0
1618,0
1619,1
1620,0
1621,0
1622,0
1623,0
1624,1
1625,1
1626,0
1627,0
1628,0
1629,0
1630,1
1631,1
1632,1
1633,0
1634,1
1635,0
1636,0
1637,0
1638,0
1639,1
1640,0
1641,1
1642,0
1643,0
1644,0
1645,0
1646,0
1647,0
1648,0
1649,0
1650,0
1651,0
1652,0
1653,0
1654,0
1655,0
1656,0
1657,1
1658,0
1659,1
1660,1
1661,0
1662,1
1663,0
1664,1
1665,0
1666,1
1667,1
1668,0
1669,1
1670,0
1671,0
1672,0
1673,1
1674,0
1675,1
1676,0
1677,0
1678,0
1679,1
1680,0
1681,0
1682,1
1683,0
1684,1
1685,1
1686,0
1687,1
1688,0
1689,0
1690,0
1691,0
1692,1
1693,0
1694,0
1695,1
1696,0
1697,0
1698,0
1699,0
1700,1
1701,0
1702,0
1703,0
1704,1
1705,0
1706,0
1707,1
1708,0
1709,0
1710,0
1711,0
1712,1
1713,1
1714,1
1715,0
1716,1
1717,0
1718,0
1719,0
1720,1
1721,0
1722,1
1723,0
1724,0
1725,0
1726,0
1727,1
1728,0
1729,0
1730,0
1731,0
1732,0
1733,0
1734,0
1735,0
1736,1
1737,0
1738,1
1739,0
1740,0
1741,0
1742,0
1743,0
1744,0
1745,0
1746,0
1747,0
1748,0
1749,1
1750,1
1751,1
1752,1
1753,0
1754,1
1755,0
1756,0
1757,1
1758,0
1759,0
1760,0
1761,1
1762,0
1763,1
1764,0
1765,0
1766,0
1767,1
1768,0
1769,0
1770,0
1771,0
1772,0
1773,0
1774,1
1775,0
1776,0
1777,0
1778,0
1779,0
1780,0
1781,1
1782,1
1783,0
1784,1
1785,0
1786,1
1787,1
1788,0
1789,0
1790,0
1791,0
1792,0
1793,0
1794,0
1795,0
1796,0
1797,0
1798,0
1799,0
1800,0
1801,1
1802,0
1803,0
1804,0
1805,0
1806,0
1807,1
1808,0
1809,0
1810,0
1811,0
1812,0
1813,1
1814,0
1815,0
1816,0
1817,0
1818,0
1819,0
1820,0
1821,1
1822,1
1823,0
1824,1
1825,0
1826,0
1827,1
1828,0
1829,1
1830,0
1831,0
1832,1
1833,0
1834,0
1835,1
1836,1
1837,0
1838,1
1839,0
1840,1
1841,0
1842,0
1843,0
1844,0
1845,0
1846,0
1847,1
1848,0
1849,0
1850,1
1851,0
1852,0
1853,1
1854,0
1855,0
1856,0
1857,0
1858,1
1859,0
1860,0
1861,1
1862,0
1863,0
1864,0
1865,0
1866,0
1867,1
1868,0
1869,0
1870,0
1871,0
1872,1
1873,0
1874,0
1875,0
1876,0
1877,0
1878,1
1879,0
1880,1
1881,0
1882,0
1883,0
1884,0
1885,1
1886,0
1887,1
1888,0
1889,1
1890,0
1891,0
1892,0
1893,0
1894,1
1895,0
1896,1
1897,0
1898,0
1899,0
1900,0
1901,0
1902,0
1903,0
1904,0
1905,0
1906,0
1907,0
1908,0
1909,0
1910,1
1911,0
1912,0
1913,0
1914,0
1915,1
1916,0
1917,0
1918,0
1919,0
1920,0
1921,0
1922,0
1923,0
1924,1
1925,0
1926,0
1927,1
1928,0
1929,1
1930,1
1931,0
1932,0
1933,0
1934,1
1935,0
1936,0
1937,0
1938,1
1939,0
1940,0
1941,0
1942,0
1943,0
1944,0
1945,0
1946,0
1947,0
1948,0
1949,0
1950,0
1951,0
1952,0
1953,0
1954,0
1955,0
1956,0
1957,1
1958,0
1959,1
1960,0
1961,1
1962,1
1963,0
1964,1
1965,0
1966,1
1967,0
1968,0
1969,0
1970,0
1971,0
1972,0
1973,1
1974,0
1975,0
1976,0
1977,1
1978,0
1979,0
1980,0
1981,1
1982,1
1983,0
1984,0
1985,0
1986,0
1987,0
1988,0
1989,0
1990,0
1991,0
1992,0
1993,0
1994,1
1995,0
1996,0
1997,0
1998,0
1999,0
2000,0
2001,0
2002,0
2003,0
2004,0
2005,1
2006,1
2007,1
2008,0
2009,0
2010,0
2011,1
2012,0
2013,0
2014,1
2015,0
2016,0
2017,0
2018,1
2019,0
2020,0
2021,0
2022,0
2023,0
2024,0
2025,0
2026,0
2027,0
2028,0
2029,1
2030,0
2031,0
2032,0
2033,1
2034,0
2035,1
2036,0
2037,0
2038,0
2039,0
2040,1
2041,0
2042,1
2043,1
2044,1
2045,0
2046,0
2047,0
2048,0
2049,0
2050,0
2051,1
2052,1
2053,0
2054,0
2055,1
2056,1
2057,0
2058,1
2059,0
2060,1
2061,0
2062,1
2063,0
2064,0
2065,0
2066,0
2067,1
2068,0
2069,1
2070,0
2071,0
2072,1
2073,0
2074,0
2075,0
2076,0
2077,0
2078,0
2079,0
2080,0
2081,0
2082,0
2083,0
2084,0
2085,1
2086,0
2087,0
2088,0
2089,0
2090,0
2091,0
2092,0
2093,1
2094,0
2095,1
2096,0
2097,0
2098,0
2099,0
2100,0
2101,0
2102,0
2103,0
2104,1
2105,0
2106,0
2107,0
2108,0
2109,0
2110,0
2111,0
2112,1
2113,0
2114,0
2115,0
2116,1
2117,0
2118,0
2119,0
2120,1
2121,0
2122,1
2123,0
2124,0
2125,0
2126,0
2127,0
2128,0
2129,0
2130,1
2131,0
2132,1
2133,0
2134,0
2135,0
2136,1
2137,0
2138,0
2139,0
2140,0
2141,0
2142,0
2143,0
2144,1
2145,0
2146,0
2147,0
2148,1
2149,0
2150,0
2151,0
2152,1
2153,1
2154,0
2155,0
2156,1
2157,0
2158,0
2159,0
2160,0
2161,0
2162,1
2163,1
2164,1
2165,0
2166,0
2167,1
2168,1
2169,1
2170,0
2171,0
2172,0
2173,1
2174,1
2175,1
2176,0
2177,1
2178,0
2179,1
2180,0
2181,0
2182,0
2183,0
2184,0
2185,1
2186,1
2187,0
2188,0
2189,0
2190,1
2191,0
2192,0
2193,0
2194,0
2195,0
2196,1
2197,0
2198,0
2199,0
2200,0
2201,0
2202,0
2203,0
2204,0
2205,0
2206,0
2207,0
2208,1
2209,0
2210,0
2211,0
2212,0
2213,1
2214,1
2215,0
2216,0
2217,0
2218,0
2219,0
2220,0
2221,0
2222,0
2223,0
2224,0
2225,0
2226,0
2227,1
2228,0
2229,0
2230,0
2231,0
2232,1
2233,1
2234,0
2235,0
2236,0
2237,1
2238,0
2239,0
2240,0
2241,0
2242,0
2243,0
2244,1
2245,0
2246,0
2247,1
2248,1
2249,1
2250,0
2251,1
2252,0
2253,1
2254,0
2255,0
2256,0
2257,0
2258,0
2259,1
2260,0
2261,0
2262,0
2263,0
2264,1
2265,1
2266,0
2267,0
2268,0
2269,0
2270,1
2271,0
2272,1
2273,0
2274,1
2275,0
2276,1
2277,0
2278,0
2279,1
2280,0
2281,0
2282,0
2283,0
2284,1
2285,0
2286,0
2287,0
2288,0
2289,1
2290,0
2291,1
2292,0
2293,0
2294,0
2295,0
2296,1
2297,0
2298,0
2299,0
2300,0
2301,0
2302,0
2303,0
2304,1
2305,0
2306,0
2307,1
2308,1
2309,1
2310,0
2311,1
2312,0
2313,0
2314,0
2315,0
2316,0
2317,0
2318,0
2319,0
2320,0
2321,0
2322,0
2323,0
2324,0
2325,0
2326,0
2327,0
2328,0
2329,0
2330,0
2331,0
2332,0
2333,0
2334,0
2335,1
2336,1
2337,0
2338,1
2339,0
2340,1
2341,0
2342,1
2343,0
2344,0
2345,0
2346,0
2347,0
2348,0
2349,0
2350,1
2351,0
2352,0
2353,1
2354,1
2355,0
2356,0
2357,0
2358,0
2359,1
2360,0
2361,0
2362,0
2363,0
2364,0
2365,0
2366,1
2367,1
2368,0
2369,1
2370,0
2371,0
2372,0
2373,0
2374,0
2375,1
2376,0
2377,0
2378,0
2379,0
2380,0
2381,0
2382,0
2383,1
2384,1
2385,0
2386,0
2387,1
2388,0
2389,1
2390,1
2391,0
2392,0
2393,0
2394,0
2395,1
2396,0
2397,0
2398,1
2399,0
2400,1
2401,0
2402,0
2403,0
2404,0
2405,0
2406,0
2407,0
2408,0
2409,0
2410,1
2411,0
2412,0
2413,0
2414,0
2415,0
2416,0
2417,0
2418,0
2419,1
2420,0
2421,1
2422,1
2423,1
2424,0
2425,1
2426,1
2427,0
2428,0
2429,1
2430,0
2431,0
2432,0
2433,0
2434,0
2435,0
2436,0
2437,0
2438,0
2439,1
2440,0
2441,0
2442,0
2443,0
2444,0
2445,1
2446,0
2447,0
2448,0
2449,0
2450,0
2451,0
2452,0
2453,0
2454,0
2455,0
2456,0
2457,0
2458,1
2459,0
2460,0
2461,0
2462,0
2463,0
2464,0
2465,1
2466,0
2467,0
2468,1
2469,0
2470,0
2471,1
2472,0
2473,0
2474,0
2475,0
2476,1
2477,1
2478,0
2479,0
2480,1
2481,0
2482,0
2483,0
2484,0
2485,0
2486,0
2487,0
2488,0
2489,0
2490,0
2491,1
2492,0
2493,0
2494,1
2495,0
2496,0
2497,0
2498,0
2499,1
2500,0
2501,0
2502,0
2503,0
2504,0
2505,0
2506,0
2507,1
2508,0
2509,1
2510,1
2511,0
2512,1
2513,0
2514,0
2515,1
2516,0
2517,1
2518,0
2519,0
2520,0
2521,0
2522,0
2523,0
2524,0
2525,1
2526,0
2527,0
2528,0
2529,0
2530,0
2531,0
2532,0
2533,0
2534,0
2535,0
2536,0
2537,1
2538,0
2539,0
2540,0
2541,0
2542,0
2543,0
2544,0
2545,0
2546,0
2547,0
2548,0
2549,0
2550,1
2551,0
2552,0
2553,0
2554,0
2555,0
2556,1
2557,0
2558,1
2559,0
2560,1
2561,0
2562,0
2563,0
2564,0
2565,0
2566,1
2567,0
2568,0
2569,0
2570,0
2571,0
2572,0
2573,0
2574,1
2575,0
2576,0
2577,0
2578,0
2579,0
2580,1
2581,0
2582,0
2583,0
2584,0
2585,0
2586,0
2587,0
2588,0
2589,0
2590,1
2591,1
2592,0
2593,0
2594,0
2595,0
2596,0
2597,0
2598,0
2599,1
2600,0
2601,0
2602,0
2603,0
2604,0
2605,0
2606,1
2607,0
2608,1
2609,0
2610,0
2611,0
2612,1
2613,0
2614,1
2615,0
2616,0
2617,0
2618,0
2619,0
2620,0
2621,0
2622,0
2623,0
2624,1
2625,0
2626,0
2627,0
2628,0
2629,1
2630,0
2631,1
2632,0
2633,1
2634,0
2635,0
2636,1
2637,0
2638,0
2639,0
2640,1
2641,0
2642,0
2643,0
2644,1
2645,1
2646,0
2647,0
2648,0
2649,1
2650,0
2651,0
2652,1
2653,1
2654,0
2655,0
2656,1
2657,0
2658,0
2659,0
2660,0
2661,0
2662,0
2663,1
2664,0
2665,1
2666,0
2667,0
2668,1
2669,1
2670,1
2671,0
2672,0
2673,0
2674,0
2675,1
2676,0
2677,0
2678,1
2679,0
2680,0
2681,1
2682,1
2683,0
2684,0
2685,0
2686,0
2687,0
2688,0
2689,1
2690,0
2691,1
2692,0
2693,0
2694,0
2695,0
2696,0
2697,0
2698,1
2699,1
2700,1
2701,0
2702,0
2703,1
2704,0
2705,0
2706,1
2707,0
2708,0
2709,0
2710,0
2711,1
2712,0
2713,0
2714,0
2715,0
2716,0
2717,0
2718,0
2719,1
2720,0
2721,1
2722,0
2723,0
2724,1
2725,0
2726,0
2727,0
2728,0
2729,0
2730,0
2731,0
2732,0
2733,0
2734,0
2735,0
2736,0
2737,0
2738,0
2739,0
2740,0
2741,0
2742,0
2743,1
2744,0
2745,0
2746,1
2747,1
2748,0
2749,0
2750,0
2751,0
2752,1
2753,0
2754,0
2755,1
2756,0
2757,0
2758,0
2759,0
2760,0
2761,1
2762,0
2763,1
2764,0
2765,0
2766,1
2767,0
2768,0
2769,0
2770,0
2771,0
2772,1
2773,0
2774,1
2775,0
2776,0
2777,0
2778,1
2779,0
2780,1
2781,1
2782,0
2783,0
2784,0
2785,0
2786,0
2787,0
2788,0
2789,0
2790,0
2791,0
2792,0
2793,0
2794,1
2795,0
2796,0
2797,0
2798,1
2799,1
2800,1
2801,0
2802,0
2803,0
2804,1
2805,0
2806,1
2807,0
2808,1
2809,0
2810,0
2811,1
2812,0
2813,1
2814,0
2815,0
2816,0
2817,0
2818,1
2819,0
2820,0
2821,0
2822,0
2823,0
2824,0
2825,1
2826,0
2827,1
2828,0
2829,1
2830,0
2831,1
2832,0
2833,0
2834,0
2835,1
2836,0
2837,0
2838,1
2839,0
2840,0
2841,0
2842,0
2843,0
2844,0
2845,1
2846,0
2847,0
2848,0
2849,0
2850,0
2851,0
2852,0
2853,1
2854,0
2855,0
2856,1
2857,1
2858,0
2859,0
2860,0
2861,0
2862,0
2863,0
2864,0
2865,0
2866,1
2867,0
2868,0
2869,0
2870,1
2871,0
2872,0
2873,0
2874,1
2875,1
2876,0
2877,0
2878,0
2879,0
2880,0
2881,1
2882,0
2883,0
2884,0
2885,0
2886,1
2887,0
2888,1
2889,0
2890,0
2891,0
2892,0
2893,0
2894,1
2895,0
2896,0
2897,0
2898,0
2899,0
2900,0
2901,0
2902,0
2903,0
2904,1
2905,0
2906,0
2907,0
2908,0
2909,0
2910,0
2911,1
2912,0
2913,0
2914,0
2915,0
2916,1
2917,1
2918,0
2919,0
2920,0
2921,0
2922,0
2923,0
2924,1
2925,0
2926,0
2927,1
2928,0
2929,0
2930,1
2931,0
2932,0
2933,0
2934,0
2935,0
2936,0
2937,0
2938,1
2939,1
2940,1
2941,0
2942,0
2943,0
2944,0
2945,0
2946,0
2947,1
2948,0
2949,0
2950,0
2951,0
2952,1
2953,0
2954,1
2955,0
2956,0
2957,1
2958,0
2959,0
2960,1
2961,0
2962,0
2963,0
2964,0
2965,0
2966,0
2967,0
2968,1
2969,0
2970,1
2971,0
2972,0
2973,0
2974,1
2975,0
2976,0
2977,0
2978,0
2979,0
2980,0
2981,0
2982,1
2983,1
2984,0
2985,0
2986,0
2987,0
2988,0
2989,0
2990,0
2991,0
2992,1
2993,0
2994,0
2995,0
2996,0
2997,0
2998,0
2999,1
3000,0
3001,0
3002,0
3003,0
3004,1
3005,0
3006,1
3007,0
3008,0
3009,0
3010,0
3011,0
3012,1
3013,0
3014,1
3015,1
3016,0
3017,0
3018,0
3019,1
3020,1
3021,0
3022,1
3023,0
3024,0
3025,0
3026,1
3027,0
3028,0
3029,0
3030,1
3031,0
3032,0
3033,1
3034,0
3035,1
3036,1
3037,0
3038,0
3039,1
3040,0
3041,0
3042,0
3043,1
3044,1
3045,0
3046,0
3047,0
3048,0
3049,0
3050,0
3051,0
3052,1
3053,0
3054,0
3055,0
3056,0
3057,0
3058,0
3059,0
3060,0
3061,0
3062,1
3063,0
3064,0
3065,1
3066,0
3067,0
3068,1
3069,0
3070,0
3071,1
3072,1
3073,1
3074,0
3075,0
3076,0
3077,1
3078,0
3079,0
3080,1
3081,0
3082,0
3083,1
3084,1
3085,0
3086,0
3087,1
3088,1
3089,1
3090,0
3091,0
3092,0
3093,1
3094,0
3095,0
3096,0
3097,1
3098,0
3099,1
3100,0
3101,0
3102,0
3103,0
3104,0
3105,0
3106,0
3107,0
3108,1
3109,0
3110,1
3111,1
3112,0
3113,0
3114,1
3115,1
3116,1
3117,0
3118,1
3119,1
3120,0
3121,0
3122,0
3123,0
3124,0
3125,0
3126,0
3127,0
3128,0
3129,0
3130,1
3131,0
3132,0
3133,0
3134,0
3135,0
3136,0
3137,0
3138,0
3139,0
3140,0
3141,0
3142,1
3143,0
3144,0
3145,0
3146,0
3147,1
3148,0
3149,0
3150,0
3151,0
3152,0
3153,0
3154,0
3155,1
3156,1
3157,0
3158,0
3159,0
3160,0
3161,0
3162,0
3163,0
3164,0
3165,0
3166,0
3167,0
3168,1
3169,0
3170,0
3171,1
3172,1
3173,0
3174,1
3175,0
3176,0
3177,0
3178,1
3179,1
3180,0
3181,0
3182,0
3183,0
3184,0
3185,0
3186,0
3187,1
3188,0
3189,0
3190,0
3191,0
3192,0
3193,0
3194,1
3195,0
3196,0
3197,0
3198,0
3199,0
3200,0
3201,0
3202,0
3203,0
3204,0
3205,0
3206,0
3207,0
3208,1
3209,0
3210,0
3211,0
3212,0
3213,0
3214,0
3215,0
3216,1
3217,0
3218,1
3219,1
3220,0
3221,0
3222,0
3223,0
3224,0
3225,0
3226,0
3227,1
3228,0
3229,0
3230,1
3231,0
3232,1
3233,0
3234,0
3235,1
3236,0
3237,0
3238,0
3239,0
3240,0
3241,0
3242,0
3243,1
3244,1
3245,1
3246,1
3247,0
3248,0
3249,1
3250,1
3251,0
3252,0
3253,0
3254,0
3255,0
3256,0
3257,1
3258,1
3259,1
3260,0
3261,0
3262,1
3263,1
3264,0
3265,0
3266,1
3267,1
3268,0
3269,0
3270,0
3271,0
3272,0
3273,0
3274,1
3275,0
3276,1
3277,0
3278,0
3279,1
3280,0
3281,1
3282,0
3283,1
3284,1
3285,0
3286,0
3287,0
3288,1
3289,1
3290,0
3291,0
3292,0
3293,1
3294,0
3295,0
3296,1
3297,0
3298,0
3299,0
3300,1
3301,0
3302,0
3303,0
3304,0
3305,0
3306,0
3307,0
3308,0
3309,0
3310,1
3311,1
3312,0
3313,0
3314,1
3315,1
3316,0
3317,0
3318,0
3319,0
3320,0
3321,0
3322,0
3323,0
3324,1
3325,0
3326,0
3327,1
3328,0
3329,1
3330,0
3331,0
3332,0
3333,1
3334,0
3335,0
3336,0
3337,0
3338,1
3339,0
3340,0
3341,1
3342,0
3343,0
3344,0
3345,0
3346,0
3347,0
3348,1
3349,1
3350,1
3351,0
3352,0
3353,1
3354,0
3355,0
3356,0
3357,0
3358,0
3359,0
3360,1
3361,0
3362,0
3363,0
3364,1
3365,0
3366,0
3367,0
3368,0
3369,0
3370,0
3371,1
3372,1
3373,0
3374,1
3375,0
3376,0
3377,0
3378,0
3379,0
3380,0
3381,1
3382,0
3383,0
3384,0
3385,0
3386,1
3387,0
3388,0
3389,0
3390,0
3391,0
3392,0
3393,0
3394,1
3395,1
3396,0
3397,1
3398,1
3399,1
3400,1
3401,0
3402,0
3403,0
3404,0
3405,1
3406,1
3407,0
3408,0
3409,0
3410,0
3411,0
3412,0
3413,1
3414,1
3415,0
3416,0
3417,0
3418,1
3419,0
3420,0
3421,0
3422,1
3423,0
3424,1
3425,0
3426,0
3427,0
3428,0
3429,0
3430,0
3431,0
3432,1
3433,0
3434,1
3435,0
3436,0
3437,0
3438,0
3439,0
3440,0
3441,0
3442,1
3443,0
3444,0
3445,0
3446,0
3447,0
3448,0
3449,1
3450,0
3451,0
3452,1
3453,0
3454,0
3455,1
3456,0
3457,0
3458,0
3459,0
3460,0
3461,0
3462,0
3463,0
3464,0
3465,1
3466,0
3467,0
3468,1
3469,0
3470,0
3471,0
3472,0
3473,0
3474,0
3475,0
3476,0
3477,0
3478,1
3479,0
3480,0
3481,0
3482,0
3483,0
3484,0
3485,1
3486,0
3487,0
3488,0
3489,0
3490,0
3491,0
3492,0
3493,0
3494,0
3495,0
3496,0
3497,0
3498,0
3499,0
3500,1
3501,0
3502,1
3503,1
3504,1
3505,1
3506,0
3507,0
3508,0
3509,1
3510,0
3511,0
3512,0
3513,0
3514,0
3515,1
3516,0
3517,0
3518,0
3519,0
3520,0
3521,1
3522,0
3523,0
3524,0
3525,0
3526,0
3527,0
3528,1
3529,1
3530,0
3531,0
3532,0
3533,0
3534,0
3535,0
3536,1
3537,0
3538,0
3539,0
3540,0
3541,0
3542,0
3543,1
3544,0
3545,0
3546,0
3547,0
3548,1
3549,0
3550,1
3551,0
3552,1
3553,1
3554,0
3555,1
3556,0
3557,1
3558,0
3559,0
3560,0
3561,0
3562,0
3563,1
3564,1
3565,1
3566,1
3567,0
3568,1
3569,0
3570,0
3571,0
3572,0
3573,0
3574,0
3575,1
3576,1
3577,0
3578,1
3579,0
3580,0
3581,0
3582,0
3583,0
3584,1
3585,1
3586,0
3587,0
3588,1
3589,0
3590,0
3591,0
3592,0
3593,0
3594,0
3595,1
3596,0
3597,0
3598,0
3599,0
3600,0
3601,0
3602,0
3603,1
3604,0
3605,0
3606,0
3607,0
3608,1
3609,1
3610,1
3611,1
3612,1
3613,1
3614,1
3615,0
3616,0
3617,0
3618,0
3619,1
3620,1
3621,0
3622,0
3623,0
3624,0
3625,0
3626,0
3627,0
3628,0
3629,0
3630,0
3631,0
3632,0
3633,1
3634,1
3635,0
3636,0
3637,0
3638,0
3639,0
3640,0
3641,1
3642,0
3643,0
3644,1
3645,0
3646,0
3647,1
3648,1
3649,0
3650,0
3651,0
3652,1
3653,1
3654,0
3655,1
3656,0
3657,0
3658,1
3659,0
3660,0
3661,1
3662,0
3663,0
3664,0
3665,1
3666,0
3667,0
3668,0
3669,0
3670,0
3671,0
3672,0
3673,1
3674,0
3675,0
3676,1
3677,0
3678,0
3679,0
3680,0
3681,0
3682,0
3683,0
3684,0
3685,0
3686,0
3687,0
3688,0
3689,0
3690,1
3691,0
3692,1
3693,0
3694,1
3695,0
3696,1
3697,0
3698,0
3699,0
3700,0
3701,0
3702,0
3703,0
3704,0
3705,0
3706,0
3707,1
3708,1
3709,0
3710,0
3711,0
3712,0
3713,0
3714,0
3715,0
3716,0
3717,0
3718,0
3719,0
3720,0
3721,1
3722,0
3723,1
3724,1
3725,1
3726,0
3727,0
3728,1
3729,1
3730,1
3731,1
3732,1
3733,1
3734,1
3735,1
3736,0
3737,1
3738,1
3739,0
3740,0
3741,0
3742,0
3743,0
3744,1
3745,0
3746,0
3747,0
3748,1
3749,0
3750,0
3751,1
3752,1
3753,0
3754,0
3755,0
3756,0
3757,0
3758,0
3759,0
3760,0
3761,0
3762,1
3763,0
3764,0
3765,1
3766,0
3767,0
3768,1
3769,0
3770,1
3771,1
3772,1
3773,1
3774,0
3775,0
3776,0
3777,0
3778,0
3779,0
3780,1
3781,1
3782,0
3783,0
3784,1
3785,0
3786,1
3787,1
3788,1
3789,1
3790,1
3791,1
3792,0
3793,0
3794,0
3795,1
3796,1
3797,0
3798,0
3799,0
3800,0
3801,1
3802,1
3803,0
3804,1
3805,0
3806,0
3807,0
3808,1
3809,1
3810,0
3811,0
3812,0
3813,0
3814,0
3815,0
3816,0
3817,1
3818,0
3819,1
3820,0
3821,0
3822,1
3823,1
3824,0
3825,0
3826,0
3827,0
3828,0
3829,0
3830,1
3831,0
3832,1
3833,1
3834,0
3835,0
3836,1
3837,0
3838,0
3839,0
3840,1
3841,0
3842,0
3843,0
3844,0
3845,0
3846,0
3847,0
3848,1
3849,1
3850,0
3851,0
3852,0
3853,1
3854,1
3855,0
3856,0
3857,0
3858,1
3859,0
3860,1
3861,0
3862,0
3863,1
3864,0
3865,0
3866,0
3867,1
3868,0
3869,0
3870,0
3871,1
3872,1
3873,0
3874,1
3875,0
3876,0
3877,0
3878,1
3879,1
3880,1
3881,0
3882,0
3883,0
3884,0
3885,0
3886,0
3887,0
3888,0
3889,0
3890,0
3891,0
3892,0
3893,1
3894,0
3895,0
3896,0
3897,1
3898,1
3899,1
3900,0
3901,0
3902,0
3903,0
3904,0
3905,0
3906,0
3907,0
3908,0
3909,0
3910,0
3911,1
3912,0
3913,1
3914,0
3915,1
3916,1
3917,0
3918,0
3919,1
3920,0
3921,1
3922,0
3923,0
3924,0
3925,0
3926,1
3927,1
3928,1
3929,0
3930,0
3931,0
3932,0
3933,0
3934,1
3935,1
3936,1
3937,1
3938,0
3939,0
3940,0
3941,0
3942,1
3943,1
3944,1
3945,1
3946,1
3947,0
3948,0
3949,1
3950,0
3951,1
3952,0
3953,1
3954,0
3955,0
3956,1
3957,1
3958,0
3959,1
3960,0
3961,0
3962,1
3963,1
3964,0
3965,0
3966,1
3967,0
3968,0
3969,1
3970,1
3971,0
3972,1
3973,1
3974,1
3975,0
3976,0
3977,0
3978,0
3979,0
3980,1
3981,1
3982,1
3983,0
3984,1
3985,0
3986,0
3987,1
3988,1
3989,0
3990,0
3991,0
3992,1
3993,0
3994,1
3995,1
3996,0
3997,0
3998,0
3999,1
4000,0
4001,1
4002,0
4003,0
4004,1
4005,0
4006,1
4007,0
4008,0
4009,0
4010,0
4011,1
4012,0
4013,0
4014,0
4015,0
4016,0
4017,0
4018,1
4019,0
4020,0
4021,0
4022,0
4023,0
4024,0
4025,0
4026,0
4027,1
4028,0
4029,1
4030,1
4031,0
4032,0
4033,1
4034,0
4035,1
4036,1
4037,0
4038,0
4039,0
4040,0
4041,0
4042,0
4043,0
4044,0
4045,0
4046,0
4047,0
4048,1
4049,0
4050,0
4051,0
4052,1
4053,1
4054,0
4055,0
4056,0
4057,0
4058,1
4059,1
4060,0
4061,0
4062,0
4063,0
4064,0
4065,0
4066,0
4067,0
4068,0
4069,0
4070,0
4071,0
4072,0
4073,0
4074,1
4075,0
4076,1
4077,1
4078,0
4079,0
4080,0
4081,0
4082,0
4083,1
4084,0
4085,0
4086,0
4087,1
4088,0
4089,0
4090,0
4091,1
4092,0
4093,1
4094,0
4095,0
4096,0
4097,0
4098,0
4099,0
4100,0
4101,0
4102,0
4103,0
4104,0
4105,0
4106,1
4107,0
4108,0
4109,0
4110,0
4111,1
4112,1
4113,0
4114,0
4115,0
4116,1
4117,0
4118,0
4119,0
4120,0
4121,0
4122,0
4123,0
4124,0
4125,0
4126,0
4127,1
4128,0
4129,0
4130,0
4131,1
4132,0
4133,0
4134,1
4135,1
4136,0
4137,0
4138,1
4139,0
4140,0
4141,0
4142,0
4143,0
4144,0
4145,0
4146,0
4147,0
4148,0
4149,0
4150,0
4151,0
4152,1
4153,1
4154,0
4155,0
4156,1
4157,0
4158,0
4159,0
4160,0
4161,0
4162,0
4163,1
4164,0
4165,0
4166,0
4167,0
4168,0
4169,0
4170,0
4171,0
4172,0
4173,0
4174,0
4175,1
4176,0
4177,0
4178,0
4179,0
4180,0
4181,1
4182,0
4183,1
4184,0
4185,1
4186,0
4187,0
4188,1
4189,1
4190,1
4191,0
4192,0
4193,1
4194,0
4195,1
4196,0
4197,0
4198,1
4199,1
4200,0
4201,1
4202,1
4203,0
4204,1
4205,0
4206,0
4207,0
4208,0
4209,1
4210,0
4211,0
4212,0
4213,0
4214,0
4215,1
4216,1
4217,0
4218,0
4219,0
4220,0
4221,0
4222,1
4223,0
4224,1
4225,0
4226,0
4227,0
4228,1
4229,1
4230,0
4231,0
4232,1
4233,0
4234,1
4235,0
4236,0
4237,1
4238,0
4239,1
4240,1
4241,1
4242,0
4243,0
4244,0
4245,0
4246,0
4247,1
4248,0
4249,1
4250,0
4251,0
4252,0
4253,0
4254,0
4255,1
4256,0
4257,0
4258,0
4259,0
4260,0
4261,0
4262,0
4263,0
4264,1
4265,0
4266,0
4267,0
4268,0
4269,0
4270,0
4271,0
4272,0
4273,0
4274,1
4275,0
4276,1
4277,1
4278,0
4279,0
4280,0
4281,0
4282,1
4283,1
4284,0
4285,0
4286,0
4287,0
4288,0
4289,1
4290,0
4291,0
4292,0
4293,0
4294,0
4295,0
4296,1
4297,0
4298,0
4299,0
4300,0
4301,0
4302,1
4303,1
4304,0
4305,1
4306,1
4307,0
4308,1
4309,0
4310,0
4311,0
4312,0
4313,1
4314,0
4315,0
4316,0
4317,1
4318,0
4319,0
4320,0
4321,0
4322,1
4323,1
4324,0
4325,0
4326,1
4327,0
4328,0
4329,0
4330,0
4331,0
4332,0
4333,0
4334,1
4335,0
4336,0
4337,0
4338,0
4339,0
4340,0
4341,0
4342,1
4343,0
4344,0
4345,0
4346,0
4347,0
4348,0
4349,0
4350,0
4351,0
4352,0
4353,0
4354,0
4355,0
4356,0
4357,0
4358,0
4359,0
4360,0
4361,0
4362,1
4363,1
4364,1
4365,0
4366,0
4367,0
4368,1
4369,0
4370,0
4371,1
4372,0
4373,0
4374,0
4375,0
4376,0
4377,0
4378,1
4379,0
4380,1
4381,1
4382,1
4383,1
4384,1
4385,1
4386,0
4387,0
4388,0
4389,1
4390,0
4391,0
4392,0
4393,0
4394,1
4395,0
4396,0
4397,1
4398,1
4399,0
4400,1
4401,0
4402,0
4403,0
4404,1
4405,0
4406,0
4407,0
4408,0
4409,1
4410,0
4411,0
4412,0
4413,0
4414,0
4415,1
4416,0
4417,0
4418,1
4419,0
4420,0
4421,1
4422,0
4423,0
4424,0
4425,0
4426,0
4427,1
4428,0
4429,1
4430,0
4431,0
4432,0
4433,0
4434,0
4435,0
4436,1
4437,0
4438,0
4439,1
4440,0
4441,0
4442,0
4443,1
4444,0
4445,1
4446,0
4447,0
4448,0
4449,0
4450,0
4451,0
4452,0
4453,1
4454,0
4455,0
4456,0
4457,0
4458,0
4459,0
4460,0
4461,1
4462,0
4463,0
4464,0
4465,1
4466,0
4467,0
4468,0
4469,0
4470,1
4471,0
4472,0
4473,0
4474,0
4475,1
4476,1
4477,0
4478,0
4479,0
4480,1
4481,1
4482,0
4483,1
4484,0
4485,1
4486,0
4487,0
4488,0
4489,0
4490,1
4491,0
4492,0
4493,0
4494,0
4495,1
4496,0
4497,0
4498,0
4499,0
4500,0
4501,0
4502,0
4503,0
4504,1
4505,0
4506,0
4507,1
4508,0
4509,0
4510,1
4511,0
4512,0
4513,0
4514,0
4515,1
4516,0
4517,0
4518,0
4519,0
4520,0
4521,0
4522,0
4523,1
4524,1
4525,0
4526,0
4527,1
4528,1
4529,0
4530,1
4531,0
4532,1
4533,0
4534,1
4535,0
4536,0
4537,0
4538,0
4539,0
4540,0
4541,0
4542,0
4543,0
4544,0
4545,0
4546,0
4547,0
4548,0
4549,0
4550,0
4551,1
4552,0
4553,0
4554,0
4555,0
4556,1
4557,0
4558,0
4559,0
4560,0
4561,0
4562,0
4563,0
4564,0
4565,0
4566,0
4567,1
4568,0
4569,0
4570,1
4571,0
4572,0
4573,1
4574,0
4575,0
4576,0
4577,0
4578,1
4579,0
4580,0
4581,1
4582,0
4583,1
4584,1
4585,1
4586,0
4587,1
4588,1
4589,0
4590,1
4591,0
4592,0
4593,0
4594,0
4595,0
4596,0
4597,1
4598,0
4599,1
4600,0
4601,1
4602,0
4603,0
4604,1
4605,1
4606,0
4607,0
4608,1
4609,0
4610,1
4611,0
4612,0
4613,0
4614,0
4615,1
4616,0
4617,0
4618,0
4619,1
4620,1
4621,1
4622,0
4623,1
4624,0
4625,0
4626,0
4627,0
4628,0
4629,0
4630,0
4631,1
4632,1
4633,0
4634,0
4635,1
4636,0
4637,1
4638,0
4639,1
4640,1
4641,1
4642,0
4643,1
4644,0
4645,0
4646,0
4647,0
4648,0
4649,1
4650,0
4651,1
4652,1
4653,1
4654,0
4655,0
4656,1
4657,1
4658,1
4659,0
4660,1
4661,0
4662,0
4663,0
4664,0
4665,0
4666,0
4667,0
4668,0
4669,0
4670,1
4671,0
4672,1
4673,0
4674,0
4675,1
4676,1
4677,0
4678,1
4679,0
4680,0
4681,1
4682,0
4683,0
4684,1
4685,0
4686,0
4687,0
4688,1
4689,0
4690,0
4691,0
4692,0
4693,1
4694,0
4695,0
4696,0
4697,0
4698,1
4699,0
4700,1
4701,0
4702,0
4703,0
4704,1
4705,1
4706,0
4707,1
4708,0
4709,1
4710,1
4711,0
4712,1
4713,0
4714,0
4715,0
4716,0
4717,0
4718,1
4719,1
4720,0
4721,0
4722,1
4723,0
4724,0
4725,0
4726,1
4727,1
4728,0
4729,1
4730,1
4731,0
4732,1
4733,1
4734,0
4735,0
4736,0
4737,0
4738,0
4739,0
4740,0
4741,0
4742,0
4743,0
4744,0
4745,0
4746,1
4747,0
4748,1
4749,0
4750,0
4751,1
4752,0
4753,1
4754,0
4755,0
4756,0
4757,0
4758,1
4759,1
4760,0
4761,1
4762,0
4763,1
4764,0
4765,0
4766,0
4767,1
4768,0
4769,0
4770,0
4771,0
4772,0
4773,0
4774,0
4775,0
4776,0
4777,0
4778,1
4779,1
4780,0
4781,0
4782,0
4783,1
4784,0
4785,0
4786,0
4787,0
4788,0
4789,0
4790,1
4791,0
4792,0
4793,1
4794,0
4795,1
4796,1
4797,0
4798,0
4799,1
4800,0
4801,1
4802,1
4803,0
4804,0
4805,1
4806,1
4807,0
4808,0
4809,0
4810,1
4811,0
4812,0
4813,0
4814,0
4815,0
4816,1
4817,0
4818,0
4819,1
4820,1
4821,0
4822,0
4823,0
4824,0
4825,0
4826,0
4827,0
4828,0
4829,0
4830,1
4831,0
4832,0
4833,1
4834,0
4835,0
4836,0
4837,0
4838,0
4839,1
4840,1
4841,0
4842,1
4843,0
4844,0
4845,0
4846,0
4847,0
4848,1
4849,1
4850,0
4851,1
4852,1
4853,1
4854,0
4855,0
4856,0
4857,0
4858,0
4859,0
4860,0
4861,0
4862,0
4863,0
4864,0
4865,0
4866,0
4867,1
4868,0
4869,0
4870,0
4871,0
4872,1
4873,0
4874,1
4875,0
4876,1
4877,1
4878,0
4879,1
4880,1
4881,0
4882,0
4883,0
4884,0
4885,0
4886,1
4887,0
4888,0
4889,0
4890,0
4891,0
4892,1
4893,0
4894,0
4895,0
4896,0
4897,0
4898,0
4899,0
4900,1
4901,0
4902,0
4903,0
4904,0
4905,0
4906,0
4907,0
4908,0
4909,1
4910,0
4911,0
4912,0
4913,0
4914,0
4915,0
4916,0
4917,0
4918,0
4919,0
4920,1
4921,0
4922,0
4923,0
4924,0
4925,0
4926,0
4927,1
4928,0
4929,0
4930,1
4931,1
4932,1
4933,1
4934,1
4935,1
4936,0
4937,0
4938,1
4939,0
4940,1
4941,0
4942,0
4943,0
4944,0
4945,1
4946,1
4947,0
4948,0
4949,1
4950,0
4951,0
4952,0
4953,0
4954,0
4955,1
4956,0
4957,0
4958,0
4959,0
4960,1
4961,0
4962,0
4963,0
4964,0
4965,0
4966,0
4967,0
4968,0
4969,1
4970,1
4971,0
4972,1
4973,0
4974,0
4975,1
4976,1
4977,0
4978,1
4979,0
4980,0
4981,0
4982,0
4983,0
4984,0
4985,1
4986,0
4987,0
4988,0
4989,0
4990,1
4991,0
4992,0
4993,0
4994,0
4995,1
4996,1
4997,0
4998,0
4999,0
5000,0
5001,1
5002,0
5003,0
5004,0
5005,0
5006,0
5007,1
5008,0
5009,0
5010,0
5011,0
5012,0
5013,0
5014,0
5015,0
5016,0
5017,0
5018,0
5019,0
5020,0
5021,0
5022,0
5023,0
5024,0
5025,0
5026,0
5027,1
5028,0
5029,1
5030,0
5031,0
5032,0
5033,1
5034,0
5035,1
5036,0
5037,1
5038,0
5039,0
5040,0
5041,1
5042,0
5043,1
5044,1
5045,0
5046,0
5047,0
5048,0
5049,1
5050,1
5051,0
5052,1
5053,1
5054,1
5055,1
5056,0
5057,0
5058,1
5059,0
5060,0
5061,1
5062,0
5063,0
5064,0
5065,1
5066,1
5067,0
5068,0
5069,0
5070,0
5071,0
5072,0
5073,0
5074,0
5075,0
5076,0
5077,0
5078,1
5079,0
5080,0
5081,1
5082,0
5083,0
5084,0
5085,1
5086,1
5087,0
5088,1
5089,0
5090,0
5091,0
5092,1
5093,1
5094,0
5095,0
5096,1
5097,0
5098,0
5099,1
5100,0
5101,0
5102,1
5103,1
5104,1
5105,1
5106,0
5107,1
5108,0
5109,1
5110,0
5111,0
5112,0
5113,0
5114,0
5115,0
5116,1
5117,0
5118,1
5119,1
5120,0
5121,0
5122,0
5123,1
5124,0
5125,0
5126,0
5127,1
5128,0
5129,1
5130,0
5131,0
5132,0
5133,1
5134,0
5135,1
5136,1
5137,0
5138,0
5139,0
5140,0
5141,0
5142,1
5143,1
5144,1
5145,0
5146,0
5147,1
5148,0
5149,1
5150,0
5151,0
5152,0
5153,1
5154,0
5155,0
5156,0
5157,1
5158,1
5159,0
5160,1
5161,0
5162,0
5163,0
5164,0
5165,0
5166,0
5167,0
5168,0
5169,0
5170,1
5171,0
5172,0
5173,1
5174,0
5175,0
5176,0
5177,0
5178,0
5179,0
5180,0
5181,1
5182,0
5183,0
5184,1
5185,0
5186,0
5187,0
5188,0
5189,0
5190,0
5191,0
5192,0
5193,0
5194,0
5195,0
5196,1
5197,1
5198,1
5199,0
5200,1
5201,0
5202,1
5203,1
5204,0
5205,0
5206,0
5207,0
5208,0
5209,0
5210,0
5211,0
5212,0
5213,1
5214,0
5215,0
5216,0
5217,1
5218,0
5219,0
5220,1
5221,0
5222,0
5223,0
5224,1
5225,0
5226,0
5227,0
5228,0
5229,0
5230,0
5231,1
5232,0
5233,0
5234,0
5235,0
5236,0
5237,0
5238,0
5239,0
5240,0
5241,0
5242,0
5243,1
5244,0
5245,1
5246,1
5247,0
5248,0
5249,0
5250,0
5251,0
5252,1
5253,0
5254,0
5255,0
5256,0
5257,0
5258,0
5259,1
5260,0
5261,0
5262,0
5263,0
5264,1
5265,0
5266,0
5267,0
5268,0
5269,0
5270,1
5271,0
5272,0
5273,0
5274,0
5275,1
5276,1
5277,1
5278,0
5279,0
5280,1
5281,1
5282,0
5283,0
5284,0
5285,1
5286,0
5287,1
5288,1
5289,0
5290,1
5291,0
5292,0
5293,0
5294,0
5295,0
5296,0
5297,0
5298,1
5299,0
5300,0
5301,0
5302,1
5303,0
5304,0
5305,0
5306,0
5307,0
5308,0
5309,0
5310,1
5311,0
5312,0
5313,1
5314,0
5315,0
5316,0
5317,0
5318,0
5319,0
5320,0
5321,0
5322,0
5323,1
5324,0
5325,0
5326,0
5327,1
5328,0
5329,1
5330,0
5331,0
5332,0
5333,0
5334,0
5335,0
5336,0
5337,1
5338,0
5339,1
5340,0
5341,0
5342,0
5343,0
5344,0
5345,1
5346,0
5347,1
5348,0
5349,0
5350,0
5351,1
5352,0
5353,0
5354,0
5355,0
5356,0
5357,0
5358,1
5359,1
5360,1
5361,0
5362,0
5363,0
5364,0
5365,0
5366,0
5367,0
5368,1
5369,1
5370,0
5371,0
5372,0
5373,0
5374,0
5375,1
5376,0
5377,0
5378,1
5379,0
5380,1
5381,0
5382,0
5383,0
5384,1
5385,0
5386,0
5387,0
5388,0
5389,1
5390,1
5391,0
5392,0
5393,0
5394,1
5395,0
5396,1
5397,1
5398,0
5399,0
5400,0
5401,0
5402,0
5403,0
5404,1
5405,1
5406,0
5407,0
5408,0
5409,0
5410,0
5411,0
5412,0
5413,0
5414,1
5415,0
5416,1
5417,1
5418,0
5419,0
5420,0
5421,0
5422,0
5423,0
5424,0
5425,0
5426,1
5427,0
5428,0
5429,0
5430,0
5431,0
5432,1
5433,0
5434,0
5435,0
5436,0
5437,0
5438,0
5439,0
5440,0
5441,0
5442,1
5443,1
5444,0
5445,0
5446,0
5447,0
5448,1
5449,0
5450,0
5451,0
5452,0
5453,1
5454,0
5455,0
5456,0
5457,1
5458,0
5459,1
5460,0
5461,0
5462,1
5463,0
5464,0
5465,0
5466,0
5467,0
5468,0
5469,0
5470,0
5471,0
5472,0
5473,0
5474,0
5475,0
5476,1
5477,0
5478,1
5479,0
5480,0
5481,0
5482,0
5483,1
5484,0
5485,1
5486,0
5487,0
5488,0
5489,0
5490,1
5491,0
5492,0
5493,0
5494,0
5495,0
5496,0
5497,0
5498,0
5499,0
5500,1
5501,0
5502,0
5503,1
5504,0
5505,0
5506,1
5507,1
5508,0
5509,0
5510,0
5511,0
5512,0
5513,0
5514,1
5515,0
5516,0
5517,0
5518,0
5519,0
5520,0
5521,0
5522,1
5523,1
5524,0
5525,0
5526,1
5527,0
5528,0
5529,0
5530,0
5531,0
5532,0
5533,1
5534,0
5535,0
5536,0
5537,0
5538,0
5539,1
5540,0
5541,0
5542,0
5543,1
5544,1
5545,0
5546,1
5547,0
5548,1
5549,0
5550,0
5551,0
5552,1
5553,1
5554,1
5555,0
5556,0
5557,0
5558,0
5559,0
5560,1
5561,1
5562,1
5563,0
5564,0
5565,1
5566,0
5567,1
5568,0
5569,0
5570,0
5571,1
5572,0
5573,0
5574,0
5575,1
5576,1
5577,0
5578,0
5579,0
5580,0
5581,0
5582,0
5583,1
5584,0
5585,0
5586,0
5587,1
5588,0
5589,1
5590,1
5591,0
5592,1
5593,0
5594,0
5595,0
5596,0
5597,1
5598,0
5599,1
5600,1
5601,1
5602,1
5603,1
5604,0
5605,1
5606,0
5607,0
5608,0
5609,0
5610,1
5611,0
5612,0
5613,0
5614,0
5615,0
5616,0
5617,0
5618,0
5619,0
5620,0
5621,0
5622,0
5623,1
5624,0
5625,0
5626,0
5627,1
5628,0
5629,0
5630,0
5631,1
5632,0
5633,0
5634,0
5635,1
5636,0
5637,1
5638,1
5639,1
5640,0
5641,0
5642,0
5643,0
5644,1
5645,0
5646,0
5647,0
5648,0
5649,0
5650,1
5651,0
5652,0
5653,1
5654,0
5655,0
5656,0
5657,0
5658,0
5659,0
5660,0
5661,1
5662,0
5663,0
5664,1
5665,0
5666,0
5667,0
5668,0
5669,0
5670,0
5671,0
5672,1
5673,0
5674,0
5675,1
5676,0
5677,0
5678,0
5679,0
5680,0
5681,0
5682,0
5683,0
5684,1
5685,1
5686,0
5687,1
5688,0
5689,0
5690,0
5691,0
5692,0
5693,1
5694,1
5695,0
5696,0
5697,0
5698,0
5699,0
5700,0
5701,0
5702,0
5703,0
5704,0
5705,0
5706,0
5707,1
5708,0
5709,1
5710,1
5711,0
5712,0
5713,0
5714,1
5715,0
5716,0
5717,1
5718,1
5719,0
5720,0
5721,1
5722,0
5723,0
5724,0
5725,0
5726,0
5727,1
5728,0
5729,0
5730,0
5731,0
5732,0
5733,0
5734,1
5735,1
5736,0
5737,0
5738,0
5739,0
5740,0
5741,0
5742,0
5743,1
5744,0
5745,0
5746,0
5747,1
5748,1
5749,0
5750,0
5751,0
5752,0
5753,0
5754,1
5755,1
5756,0
5757,1
5758,1
5759,0
5760,0
5761,1
5762,0
5763,1
5764,0
5765,0
5766,1
5767,0
5768,0
5769,0
5770,1
5771,0
5772,0
5773,0
5774,0
5775,0
5776,0
5777,1
5778,0
5779,0
5780,1
5781,0
5782,0
5783,0
5784,1
5785,0
5786,0
5787,0
5788,0
5789,1
5790,0
5791,0
5792,0
5793,0
5794,0
5795,0
5796,0
5797,0
5798,0
5799,0
5800,0
5801,0
5802,0
5803,1
5804,1
5805,0
5806,1
5807,0
5808,1
5809,0
5810,1
5811,0
5812,1
5813,1
5814,0
5815,0
5816,0
5817,0
5818,0
5819,0
5820,1
5821,1
5822,0
5823,1
5824,0
5825,0
5826,0
5827,0
5828,0
5829,1
5830,0
5831,1
5832,1
5833,0
5834,0
5835,0
5836,1
5837,1
5838,0
5839,0
5840,0
5841,0
5842,0
5843,0
5844,0
5845,1
5846,0
5847,0
5848,1
5849,1
5850,1
5851,0
5852,1
5853,0
5854,0
5855,0
5856,0
5857,0
5858,0
5859,1
5860,1
5861,0
5862,0
5863,1
5864,1
5865,0
5866,0
5867,0
5868,0
5869,0
5870,0
5871,0
5872,0
5873,0
5874,0
5875,0
5876,0
5877,0
5878,0
5879,1
5880,0
5881,0
5882,0
5883,0
5884,0
5885,0
5886,0
5887,1
5888,1
5889,0
5890,0
5891,0
5892,0
5893,0
5894,0
5895,0
5896,0
5897,0
5898,0
5899,0
5900,0
5901,1
5902,1
5903,0
5904,0
5905,1
5906,0
5907,0
5908,1
5909,0
5910,1
5911,0
5912,0
5913,0
5914,1
5915,0
5916,0
5917,0
5918,0
5919,1
5920,1
5921,1
5922,0
5923,0
5924,0
5925,0
5926,0
5927,0
5928,1
5929,0
5930,0
5931,0
5932,0
5933,1
5934,0
5935,0
5936,0
5937,0
5938,1
5939,0
5940,0
5941,0
5942,1
5943,0
5944,0
5945,1
5946,0
5947,0
5948,0
5949,0
5950,0
5951,1
5952,1
5953,0
5954,0
5955,1
5956,1
5957,0
5958,0
5959,0
5960,0
5961,0
5962,1
5963,0
5964,0
5965,0
5966,0
5967,0
5968,0
5969,0
5970,0
5971,0
5972,0
5973,0
5974,0
5975,0
5976,1
5977,0
5978,0
5979,0
5980,0
5981,0
5982,1
5983,0
5984,0
5985,0
5986,0
5987,0
5988,0
5989,0
5990,1
5991,1
5992,0
5993,0
5994,1
5995,0
5996,1
5997,1
5998,0
5999,0
6000,0
6001,1
6002,0
6003,0
6004,0
6005,0
6006,0
6007,0
6008,0
6009,0
6010,1
6011,1
6012,0
6013,0
6014,0
6015,0
6016,0
6017,0
6018,0
6019,0
6020,0
6021,0
6022,0
6023,1
6024,0
6025,0
6026,0
6027,0
6028,0
6029,1
6030,0
6031,0
6032,0
6033,0
6034,1
6035,0
6036,0
6037,1
6038,1
6039,0
6040,1
6041,0
6042,1
6043,1
6044,1
6045,1
6046,0
6047,0
6048,1
6049,0
6050,0
6051,0
6052,0
6053,1
6054,0
6055,1
6056,0
6057,0
6058,0
6059,0
6060,0
6061,0
6062,0
6063,0
6064,1
6065,1
6066,0
6067,1
6068,0
6069,0
6070,1
6071,0
6072,0
6073,0
6074,0
6075,0
6076,1
6077,0
6078,0
6079,0
6080,0
6081,0
6082,0
6083,1
6084,0
6085,1
6086,0
6087,1
6088,0
6089,1
6090,0
6091,1
6092,0
6093,0
6094,0
6095,0
6096,0
6097,0
6098,0
6099,1
6100,0
6101,0
6102,0
6103,1
6104,0
6105,0
6106,0
6107,0
6108,0
6109,0
6110,0
6111,0
6112,1
6113,0
6114,0
6115,0
6116,0
6117,1
6118,0
6119,1
6120,0
6121,0
6122,1
6123,1
6124,1
6125,1
6126,0
6127,1
6128,1
6129,1
6130,0
6131,0
6132,0
6133,0
6134,0
6135,0
6136,0
6137,0
6138,1
6139,0
6140,0
6141,1
6142,0
6143,0
6144,0
6145,0
6146,0
6147,0
6148,1
6149,0
6150,0
6151,0
6152,1
6153,0
6154,1
6155,0
6156,0
6157,0
6158,0
6159,0
6160,0
6161,0
6162,1
6163,0
6164,0
6165,0
6166,0
6167,0
6168,0
6169,1
6170,0
6171,0
6172,1
6173,0
6174,0
6175,1
6176,0
6177,1
6178,0
6179,1
6180,1
6181,0
6182,0
6183,0
6184,0
6185,0
6186,1
6187,1
6188,0
6189,1
6190,0
6191,0
6192,0
6193,1
6194,0
6195,0
6196,1
6197,0
6198,1
6199,1
6200,0
6201,0
6202,0
6203,0
6204,0
6205,0
6206,0
6207,0
6208,0
6209,1
6210,0
6211,0
6212,1
6213,1
6214,1
6215,0
6216,1
6217,0
6218,1
6219,1
6220,0
6221,0
6222,0
6223,1
6224,0
6225,0
6226,0
6227,0
6228,0
6229,0
6230,0
6231,0
6232,1
6233,0
6234,0
6235,0
6236,0
6237,1
6238,0
6239,0
6240,1
6241,1
6242,0
6243,1
6244,0
6245,1
6246,0
6247,0
6248,0
6249,0
6250,0
6251,0
6252,0
6253,0
6254,0
6255,1
6256,0
6257,1
6258,0
6259,0
6260,0
6261,0
6262,0
6263,0
6264,0
6265,0
6266,1
6267,0
6268,0
6269,0
6270,0
6271,0
6272,1
6273,0
6274,1
6275,0
6276,0
6277,1
6278,0
6279,0
6280,0
6281,0
6282,1
6283,0
6284,0
6285,0
6286,1
6287,0
6288,0
6289,0
6290,0
6291,0
6292,0
6293,0
6294,0
6295,0
6296,1
6297,0
6298,0
6299,0
6300,0
6301,1
6302,0
6303,0
6304,0
6305,0
6306,0
6307,1
6308,1
6309,0
6310,0
6311,0
6312,0
6313,0
6314,0
6315,0
6316,0
6317,0
6318,1
6319,1
6320,0
6321,1
6322,1
6323,1
6324,0
6325,1
6326,0
6327,0
6328,0
6329,0
6330,0
6331,1
6332,0
6333,0
6334,0
6335,0
6336,0
6337,0
6338,1
6339,0
6340,0
6341,0
6342,0
6343,1
6344,0
6345,1
6346,0
6347,1
6348,0
6349,0
6350,0
6351,0
6352,0
6353,1
6354,0
6355,0
6356,1
6357,0
6358,0
6359,0
6360,1
6361,1
6362,0
6363,1
6364,0
6365,0
6366,0
6367,0
6368,0
6369,1
6370,1
6371,0
6372,1
6373,0
6374,0
6375,0
6376,0
6377,1
6378,0
6379,0
6380,0
6381,0
6382,0
6383,0
6384,1
6385,0
6386,0
6387,0
6388,0
6389,0
6390,0
6391,0
6392,0
6393,1
6394,0
6395,0
6396,0
6397,0
6398,0
6399,1
6400,0
6401,0
6402,0
6403,0
6404,1
6405,0
6406,0
6407,0
6408,0
6409,1
6410,0
6411,0
6412,0
6413,1
6414,0
6415,0
6416,1
6417,0
6418,0
6419,1
6420,0
6421,1
6422,0
6423,0
6424,1
6425,0
6426,0
6427,0
6428,0
6429,0
6430,1
6431,1
6432,0
6433,0
6434,0
6435,1
6436,1
6437,0
6438,0
6439,1
6440,0
6441,1
6442,0
6443,0
6444,0
6445,0
6446,0
6447,0
6448,1
6449,0
6450,1
6451,0
6452,0
6453,0
6454,0
6455,0
6456,0
6457,1
6458,0
6459,0
6460,0
6461,0
6462,0
6463,0
6464,1
6465,0
6466,1
6467,1
6468,0
6469,0
6470,0
6471,0
6472,0
6473,0
6474,0
6475,1
6476,0
6477,0
6478,0
6479,0
6480,0
6481,1
6482,1
6483,1
6484,0
6485,0
6486,0
6487,0
6488,0
6489,1
6490,0
6491,0
6492,1
6493,1
6494,1
6495,0
6496,0
6497,0
6498,0
6499,0
6500,0
6501,0
6502,0
6503,1
6504,0
6505,1
6506,1
6507,1
6508,0
6509,0
6510,0
6511,1
6512,0
6513,0
6514,0
6515,0
6516,0
6517,0
6518,0
6519,0
6520,0
6521,0
6522,1
6523,0
6524,0
6525,1
6526,1
6527,1
6528,0
6529,0
6530,0
6531,0
6532,0
6533,0
6534,0
6535,0
6536,1
6537,0
6538,1
6539,0
6540,1
6541,0
6542,1
6543,0
6544,0
6545,0
6546,0
6547,0
6548,0
6549,0
6550,0
6551,1
6552,0
6553,1
6554,1
6555,0
6556,0
6557,0
6558,0
6559,0
6560,0
6561,0
6562,0
6563,0
6564,0
6565,0
6566,0
6567,0
6568,0
6569,0
6570,0
6571,0
6572,0
6573,1
6574,0
6575,0
6576,0
6577,0
6578,1
6579,1
6580,0
6581,0
6582,0
6583,0
6584,1
6585,0
6586,0
6587,0
6588,1
6589,0
6590,0
6591,0
6592,1
6593,0
6594,0
6595,0
6596,0
6597,0
6598,0
6599,1
6600,1
6601,0
6602,1
6603,0
6604,0
6605,0
6606,0
6607,1
6608,0
6609,0
6610,1
6611,1
6612,0
6613,0
6614,0
6615,1
6616,0
6617,0
6618,1
6619,0
6620,1
6621,0
6622,0
6623,1
6624,0
6625,1
6626,0
6627,0
6628,1
6629,1
6630,1
6631,0
6632,0
6633,0
6634,1
6635,1
6636,1
6637,0
6638,0
6639,1
6640,0
6641,0
6642,0
6643,1
6644,1
6645,0
6646,0
6647,0
6648,0
6649,1
6650,0
6651,0
6652,1
6653,0
6654,0
6655,0
6656,0
6657,1
6658,0
6659,1
6660,1
6661,0
6662,0
6663,0
6664,0
6665,0
6666,0
6667,0
6668,0
6669,0
6670,0
6671,0
6672,0
6673,0
6674,0
6675,0
6676,1
6677,1
6678,1
6679,0
6680,0
6681,0
6682,1
6683,0
6684,0
6685,1
6686,0
6687,1
6688,0
6689,0
6690,0
6691,0
6692,0
6693,0
6694,0
6695,0
6696,0
6697,0
6698,0
6699,0
6700,1
6701,0
6702,0
6703,1
6704,1
6705,1
6706,1
6707,0
6708,0
6709,0
6710,1
6711,0
6712,0
6713,0
6714,1
6715,0
6716,1
6717,0
6718,0
6719,0
6720,0
6721,1
6722,0
6723,0
6724,0
6725,0
6726,0
6727,0
6728,0
6729,0
6730,0
6731,1
6732,1
6733,0
6734,0
6735,0
6736,0
6737,1
6738,0
6739,0
6740,1
6741,0
6742,0
6743,0
6744,0
6745,0
6746,1
6747,0
6748,0
6749,1
6750,0
6751,0
6752,0
6753,0
6754,0
6755,1
6756,0
6757,0
6758,0
6759,0
6760,0
6761,0
6762,0
6763,1
6764,1
6765,0
6766,0
6767,0
6768,0
6769,1
6770,0
6771,0
6772,0
6773,0
6774,1
6775,1
6776,0
6777,0
6778,1
6779,0
6780,0
6781,0
6782,0
6783,0
6784,0
6785,0
6786,0
6787,1
6788,1
6789,0
6790,1
6791,0
6792,0
6793,0
6794,0
6795,0
6796,1
6797,1
6798,0
6799,0
6800,0
6801,0
6802,0
6803,0
6804,1
6805,0
6806,1
6807,0
6808,0
6809,0
6810,0
6811,1
6812,0
6813,0
6814,0
6815,1
6816,0
6817,0
6818,0
6819,0
6820,0
6821,0
6822,1
6823,0
6824,0
6825,0
6826,0
6827,1
6828,0
6829,0
6830,1
6831,0
6832,0
6833,0
6834,0
6835,0
6836,0
6837,0
6838,0
6839,0
6840,0
6841,0
6842,0
6843,0
6844,0
6845,0
6846,0
6847,1
6848,0
6849,0
6850,0
6851,0
6852,0
6853,0
6854,0
6855,0
6856,1
6857,0
6858,0
6859,0
6860,0
6861,1
6862,0
6863,0
6864,0
6865,0
6866,0
6867,0
6868,1
6869,1
6870,0
6871,0
6872,0
6873,0
6874,0
6875,0
6876,0
6877,1
6878,1
6879,0
6880,0
6881,0
6882,0
6883,0
6884,0
6885,0
6886,0
6887,0
6888,0
6889,0
6890,0
6891,1
6892,0
6893,1
6894,1
6895,0
6896,1
6897,1
6898,0
6899,1
6900,0
6901,1
6902,1
6903,0
6904,1
6905,1
6906,0
6907,1
6908,0
6909,1
6910,0
6911,0
6912,0
6913,0
6914,0
6915,0
6916,0
6917,1
6918,0
6919,0
6920,0
6921,1
6922,0
6923,0
6924,0
6925,1
6926,0
6927,1
6928,0
6929,0
6930,0
6931,1
6932,0
6933,0
6934,0
6935,1
6936,0
6937,0
6938,0
6939,0
6940,0
6941,0
6942,1
6943,0
6944,0
6945,1
6946,0
6947,0
6948,0
6949,0
6950,0
6951,0
6952,0
6953,1
6954,1
6955,0
6956,0
6957,0
6958,1
6959,0
6960,0
6961,1
6962,0
6963,0
6964,0
6965,1
6966,0
6967,0
6968,0
6969,1
6970,0
6971,1
6972,0
6973,1
6974,0
6975,0
6976,0
6977,0
6978,0
6979,0
6980,0
6981,0
6982,0
6983,0
6984,0
6985,0
6986,0
6987,0
6988,0
6989,0
6990,0
6991,1
6992,0
6993,0
6994,1
6995,0
6996,1
6997,1
6998,1
6999,0
7000,0
7001,0
7002,0
7003,0
7004,0
7005,0
7006,1
7007,0
7008,0
7009,1
7010,0
7011,0
7012,0
7013,0
7014,0
7015,0
7016,1
7017,1
7018,0
7019,0
7020,0
7021,0
7022,0
7023,0
7024,0
7025,1
7026,0
7027,1
7028,0
7029,1
7030,0
7031,0
7032,1
7033,0
7034,0
7035,1
7036,0
7037,0
7038,0
7039,0
7040,0
7041,1
7042,1
7043,0
7044,0
7045,0
7046,1
7047,1
7048,1
7049,0
7050,1
7051,0
7052,0
7053,0
7054,0
7055,0
7056,0
7057,0
7058,0
7059,1
7060,0
7061,0
7062,0
7063,0
7064,1
7065,0
7066,0
7067,0
7068,0
7069,0
7070,1
7071,1
7072,0
7073,0
7074,1
7075,0
7076,0
7077,0
7078,0
7079,0
7080,0
7081,1
7082,0
7083,1
7084,1
7085,0
7086,0
7087,0
7088,0
7089,1
7090,0
7091,0
7092,1
7093,0
7094,0
7095,1
7096,0
7097,0
7098,0
7099,0
7100,0
7101,0
7102,1
7103,0
7104,0
7105,1
7106,1
7107,1
7108,0
7109,0
7110,0
7111,0
7112,1
7113,0
7114,0
7115,0
7116,0
7117,0
7118,0
7119,0
7120,0
7121,0
7122,0
7123,0
7124,0
7125,0
7126,0
7127,0
7128,0
7129,0
7130,1
7131,0
7132,0
7133,0
7134,0
7135,0
7136,0
7137,1
7138,0
7139,1
7140,0
7141,1
7142,0
7143,0
7144,0
7145,0
7146,1
7147,0
7148,0
7149,1
7150,0
7151,1
7152,0
7153,0
7154,0
7155,0
7156,0
7157,0
7158,0
7159,0
7160,0
7161,0
7162,0
7163,0
7164,0
7165,1
7166,0
7167,0
7168,1
7169,1
7170,0
7171,1
7172,1
7173,0
7174,0
7175,0
7176,0
7177,0
7178,0
7179,0
7180,1
7181,1
7182,1
7183,0
7184,0
7185,0
7186,0
7187,1
7188,0
7189,0
7190,0
7191,1
7192,0
7193,0
7194,1
7195,0
7196,0
7197,1
7198,0
7199,0
7200,0
7201,0
7202,0
7203,1
7204,0
7205,0
7206,0
7207,0
7208,1
7209,0
7210,0
7211,0
7212,0
7213,0
7214,1
7215,1
7216,1
7217,0
7218,0
7219,0
7220,0
7221,0
7222,1
7223,0
7224,0
7225,0
7226,1
7227,0
7228,0
7229,0
7230,0
7231,0
7232,0
7233,0
7234,0
7235,1
7236,1
7237,0
7238,0
7239,0
7240,0
7241,0
7242,1
7243,0
7244,0
7245,0
7246,0
7247,0
7248,0
7249,0
7250,0
7251,1
7252,0
7253,0
7254,0
7255,1
7256,0
7257,1
7258,0
7259,1
7260,0
7261,0
7262,0
7263,1
7264,1
7265,0
7266,0
7267,0
7268,0
7269,0
7270,0
7271,0
7272,1
7273,0
7274,0
7275,0
7276,0
7277,0
7278,0
7279,0
7280,0
7281,1
7282,1
7283,0
7284,0
7285,0
7286,1
7287,0
7288,0
7289,0
7290,0
7291,0
7292,0
7293,0
7294,0
7295,0
7296,0
7297,1
7298,0
7299,1
7300,0
7301,1
7302,0
7303,0
7304,0
7305,0
7306,0
7307,1
7308,1
7309,0
7310,0
7311,1
7312,1
7313,0
7314,1
7315,1
7316,0
7317,0
7318,1
7319,1
7320,0
7321,1
7322,0
7323,1
7324,0
7325,0
7326,0
7327,1
7328,0
7329,0
7330,0
7331,0
7332,0
7333,0
7334,0
7335,0
7336,1
7337,1
7338,0
7339,0
7340,0
7341,0
7342,0
7343,0
7344,0
7345,1
7346,0
7347,0
7348,0
7349,1
7350,1
7351,1
7352,0
7353,0
7354,0
7355,0
7356,0
7357,0
7358,0
7359,0
7360,1
7361,1
7362,1
7363,0
7364,1
7365,0
7366,1
7367,1
7368,1
7369,1
7370,0
7371,0
7372,0
7373,0
7374,0
7375,1
7376,0
7377,0
7378,1
7379,1
7380,0
7381,1
7382,0
7383,1
7384,1
7385,0
7386,1
7387,1
7388,0
7389,0
7390,0
7391,1
7392,0
7393,0
7394,0
7395,1
7396,1
7397,0
7398,0
7399,0
7400,1
7401,0
7402,1
7403,0
7404,1
7405,0
7406,0
7407,0
7408,0
7409,0
7410,0
7411,0
7412,0
7413,0
7414,0
7415,0
7416,0
7417,0
7418,0
7419,0
7420,0
7421,0
7422,0
7423,1
7424,0
7425,0
7426,0
7427,1
7428,0
7429,0
7430,0
7431,0
7432,0
7433,0
7434,1
7435,0
7436,0
7437,1
7438,1
7439,0
7440,0
7441,0
7442,0
7443,1
7444,0
7445,0
7446,0
7447,0
7448,1
7449,0
7450,1
7451,0
7452,0
7453,0
7454,0
7455,1
7456,0
7457,0
7458,0
7459,0
7460,0
7461,0
7462,0
7463,0
7464,0
7465,0
7466,1
7467,0
7468,0
7469,1
7470,1
7471,0
7472,1
7473,0
7474,0
7475,0
7476,0
7477,1
7478,0
7479,0
7480,0
7481,1
7482,0
7483,0
7484,0
7485,1
7486,1
7487,0
7488,0
7489,0
7490,0
7491,1
7492,0
7493,0
7494,0
7495,0
7496,0
7497,1
7498,0
7499,0
7500,1
7501,1
7502,0
7503,1
7504,0
7505,1
7506,0
7507,0
7508,0
7509,0
7510,1
7511,0
7512,0
7513,1
7514,0
7515,0
7516,0
7517,0
7518,0
7519,0
7520,0
7521,0
7522,0
7523,1
7524,0
7525,0
7526,0
7527,1
7528,0
7529,1
7530,0
7531,1
7532,0
7533,0
7534,0
7535,0
7536,1
7537,0
7538,0
7539,0
7540,1
7541,0
7542,0
7543,0
7544,0
7545,0
7546,0
7547,0
7548,0
7549,0
7550,1
7551,0
7552,1
7553,0
7554,0
7555,1
7556,1
7557,1
7558,0
7559,0
7560,0
7561,1
7562,0
7563,1
7564,0
7565,0
7566,0
7567,0
7568,0
7569,0
7570,0
7571,1
7572,1
7573,0
7574,0
7575,0
7576,0
7577,0
7578,1
7579,0
7580,0
7581,0
7582,1
7583,0
7584,0
7585,0
7586,1
7587,0
7588,0
7589,0
7590,0
7591,0
7592,0
7593,0
7594,0
7595,1
7596,0
7597,1
7598,0
7599,1
7600,0
7601,1
7602,0
7603,0
7604,0
7605,0
7606,1
7607,0
7608,0
7609,0
7610,0
7611,0
7612,1
7613,0
7614,0
7615,0
7616,0
7617,0
7618,0
7619,0
7620,0
7621,0
7622,0
7623,1
7624,0
7625,0
7626,0
7627,0
7628,1
7629,0
7630,0
7631,1
7632,0
7633,0
7634,0
7635,0
7636,0
7637,1
7638,1
7639,0
7640,0
7641,0
7642,0
7643,0
7644,1
7645,0
7646,0
7647,0
7648,0
7649,0
7650,0
7651,0
7652,0
7653,1
7654,0
7655,1
7656,0
7657,0
7658,0
7659,0
7660,1
7661,0
7662,1
7663,1
7664,0
7665,0
7666,1
7667,0
7668,0
7669,0
7670,0
7671,0
7672,0
7673,0
7674,0
7675,0
7676,0
7677,0
7678,1
7679,0
7680,1
7681,0
7682,0
7683,1
7684,0
7685,0
7686,0
7687,1
7688,0
7689,0
7690,1
7691,1
7692,0
7693,0
7694,0
7695,0
7696,1
7697,1
7698,0
7699,0
7700,1
7701,0
7702,0
7703,0
7704,1
7705,0
7706,0
7707,0
7708,1
7709,0
7710,1
7711,0
7712,0
7713,0
7714,0
7715,0
7716,0
7717,0
7718,0
7719,0
7720,0
7721,0
7722,0
7723,0
7724,1
7725,0
7726,0
7727,0
7728,1
7729,0
7730,0
7731,0
7732,1
7733,0
7734,0
7735,0
7736,0
7737,0
7738,1
7739,0
7740,0
7741,0
7742,0
7743,0
7744,0
7745,0
7746,0
7747,1
7748,0
7749,0
7750,0
7751,1
7752,0
7753,0
7754,0
7755,0
7756,0
7757,0
7758,0
7759,0
7760,1
7761,1
7762,0
7763,0
7764,1
7765,0
7766,0
7767,1
7768,0
7769,0
7770,1
7771,0
7772,0
7773,1
7774,0
7775,0
7776,0
7777,0
7778,0
7779,0
7780,0
7781,0
7782,0
7783,1
7784,0
7785,0
7786,1
7787,0
7788,1
7789,0
7790,0
7791,0
7792,0
7793,0
7794,1
7795,1
7796,0
7797,1
7798,0
7799,1
7800,0
7801,0
7802,0
7803,0
7804,1
7805,0
7806,0
7807,0
7808,0
7809,0
7810,0
7811,1
7812,0
7813,0
7814,0
7815,0
7816,1
7817,0
7818,0
7819,1
7820,0
7821,0
7822,0
7823,0
7824,0
7825,0
7826,0
7827,1
7828,0
7829,0
7830,0
7831,0
7832,0
7833,1
7834,1
7835,0
7836,0
7837,0
7838,0
7839,0
7840,0
7841,0
7842,1
7843,1
7844,0
7845,0
7846,0
7847,0
7848,0
7849,0
7850,0
7851,1
7852,0
7853,0
7854,0
7855,1
7856,0
7857,0
7858,1
7859,0
7860,1
7861,0
7862,0
7863,0
7864,0
7865,0
7866,0
7867,0
7868,0
7869,0
7870,0
7871,0
7872,0
7873,0
7874,0
7875,0
7876,1
7877,1
7878,0
7879,0
7880,0
7881,1
7882,1
7883,1
7884,0
7885,0
7886,0
7887,1
7888,0
7889,0
7890,1
7891,1
7892,1
7893,1
7894,0
7895,0
7896,0
7897,0
7898,0
7899,0
7900,0
7901,0
7902,0
7903,0
7904,0
7905,0
7906,0
7907,0
7908,1
7909,0
7910,0
7911,0
7912,1
7913,0
7914,0
7915,0
7916,0
7917,0
7918,1
7919,1
7920,0
7921,0
7922,0
7923,1
7924,1
7925,0
7926,0
7927,0
7928,0
7929,0
7930,0
7931,1
7932,0
7933,0
7934,0
7935,0
7936,0
7937,1
7938,0
7939,1
7940,1
7941,1
7942,1
7943,1
7944,0
7945,0
7946,0
7947,0
7948,0
7949,0
7950,0
7951,1
7952,1
7953,0
7954,0
7955,0
7956,0
7957,1
7958,1
7959,0
7960,0
7961,0
7962,0
7963,1
7964,0
7965,0
7966,1
7967,0
7968,1
7969,0
7970,0
7971,0
7972,0
7973,0
7974,1
7975,0
7976,1
7977,0
7978,0
7979,1
7980,0
7981,0
7982,0
7983,0
7984,0
7985,1
7986,0
7987,0
7988,1
7989,0
7990,0
7991,0
7992,0
7993,0
7994,0
7995,1
7996,0
7997,1
7998,0
7999,1
8000,0
8001,0
8002,0
8003,0
8004,1
8005,1
8006,0
8007,0
8008,0
8009,0
8010,1
8011,0
8012,0
8013,0
8014,1
8015,0
8016,0
8017,0
8018,0
8019,1
8020,0
8021,1
8022,0
8023,0
8024,0
8025,0
8026,0
8027,0
8028,0
8029,0
8030,1
8031,0
8032,0
8033,0
8034,0
8035,0
8036,0
8037,0
8038,1
8039,0
8040,0
8041,0
8042,0
8043,0
8044,1
8045,1
8046,0
8047,0
8048,1
8049,1
8050,1
8051,0
8052,0
8053,0
8054,0
8055,0
8056,0
8057,0
8058,1
8059,1
8060,1
8061,1
8062,1
8063,0
8064,0
8065,0
8066,0
8067,0
8068,0
8069,1
8070,0
8071,0
8072,0
8073,1
8074,0
8075,0
8076,1
8077,0
8078,0
8079,1
8080,0
8081,1
8082,0
8083,0
8084,0
8085,0
8086,0
8087,0
8088,0
8089,0
8090,0
8091,1
8092,0
8093,0
8094,0
8095,1
8096,0
8097,0
8098,1
8099,0
8100,0
8101,0
8102,1
8103,0
8104,1
8105,0
8106,0
8107,1
8108,0
8109,0
8110,0
8111,1
8112,0
8113,0
8114,0
8115,0
8116,0
8117,1
8118,1
8119,0
8120,0
8121,1
8122,1
8123,0
8124,0
8125,0
8126,0
8127,1
8128,0
8129,0
8130,0
8131,0
8132,0
8133,0
8134,1
8135,0
8136,0
8137,0
8138,0
8139,0
8140,0
8141,1
8142,0
8143,1
8144,0
8145,1
8146,0
8147,1
8148,1
8149,1
8150,0
8151,0
8152,0
8153,0
8154,1
8155,0
8156,0
8157,1
8158,1
8159,0
8160,0
8161,0
8162,0
8163,0
8164,0
8165,0
8166,1
8167,0
8168,0
8169,1
8170,0
8171,0
8172,0
8173,0
8174,0
8175,0
8176,0
8177,1
8178,0
8179,0
8180,0
8181,1
8182,0
8183,1
8184,0
8185,0
8186,0
8187,1
8188,0
8189,0
8190,0
8191,0
8192,0
8193,0
8194,0
8195,0
8196,1
8197,0
8198,0
8199,0
8200,0
8201,0
8202,0
8203,1
8204,0
8205,0
8206,1
8207,0
8208,0
8209,0
8210,0
8211,0
8212,0
8213,0
8214,0
8215,0
8216,0
8217,0
8218,1
8219,1
8220,1
8221,0
8222,0
8223,0
8224,0
8225,0
8226,0
8227,0
8228,0
8229,0
8230,1
8231,0
8232,1
8233,0
8234,0
8235,0
8236,0
8237,0
8238,0
8239,0
8240,1
8241,0
8242,0
8243,0
8244,0
8245,0
8246,0
8247,0
8248,1
8249,0
8250,0
8251,1
8252,0
8253,0
8254,0
8255,0
8256,0
8257,0
8258,0
8259,0
8260,1
8261,0
8262,0
8263,1
8264,0
8265,1
8266,1
8267,1
8268,0
8269,0
8270,0
8271,0
8272,1
8273,0
8274,0
8275,0
8276,1
8277,1
8278,0
8279,0
8280,1
8281,0
8282,0
8283,1
8284,0
8285,0
8286,1
8287,0
8288,1
8289,0
8290,1
8291,0
8292,0
8293,0
8294,1
8295,0
8296,0
8297,0
8298,0
8299,1
8300,0
8301,0
8302,0
8303,1
8304,0
8305,0
8306,1
8307,0
8308,0
8309,0
8310,1
8311,0
8312,0
8313,0
8314,0
8315,0
8316,1
8317,0
8318,1
8319,0
8320,1
8321,0
8322,0
8323,0
8324,0
8325,0
8326,1
8327,0
8328,1
8329,0
8330,0
8331,0
8332,0
8333,0
8334,1
8335,1
8336,1
8337,0
8338,1
8339,0
8340,0
8341,0
8342,0
8343,0
8344,0
8345,0
8346,0
8347,0
8348,0
8349,0
8350,1
8351,0
8352,1
8353,1
8354,0
8355,0
8356,1
8357,0
8358,0
8359,0
8360,1
8361,0
8362,1
8363,0
8364,1
8365,0
8366,0
8367,1
8368,0
8369,0
8370,0
8371,0
8372,0
8373,0
8374,0
8375,0
8376,1
8377,0
8378,1
8379,0
8380,0
8381,0
8382,0
8383,0
8384,1
8385,1
8386,0
8387,1
8388,0
8389,0
8390,0
8391,0
8392,0
8393,0
8394,0
8395,0
8396,0
8397,0
8398,0
8399,0
8400,0
8401,1
8402,1
8403,0
8404,0
8405,0
8406,0
8407,0
8408,0
8409,1
8410,1
8411,0
8412,0
8413,0
8414,1
8415,1
8416,0
8417,1
8418,1
8419,0
8420,0
8421,0
8422,0
8423,0
8424,0
8425,0
8426,0
8427,0
8428,1
8429,0
8430,0
8431,0
8432,0
8433,0
8434,1
8435,1
8436,0
8437,0
8438,1
8439,0
8440,0
8441,0
8442,0
8443,1
8444,0
8445,1
8446,0
8447,0
8448,0
8449,0
8450,1
8451,0
8452,1
8453,0
8454,0
8455,1
8456,0
8457,0
8458,0
8459,0
8460,0
8461,0
8462,1
8463,0
8464,0
8465,1
8466,0
8467,0
8468,0
8469,0
8470,0
8471,1
8472,0
8473,1
8474,0
8475,1
8476,0
8477,0
8478,1
8479,0
8480,0
8481,0
8482,0
8483,1
8484,0
8485,0
8486,1
8487,1
8488,0
8489,0
8490,0
8491,0
8492,0
8493,0
8494,1
8495,0
8496,0
8497,0
8498,0
8499,0
8500,0
8501,0
8502,0
8503,1
8504,0
8505,1
8506,1
8507,0
8508,0
8509,0
8510,1
8511,0
8512,1
8513,0
8514,1
8515,0
8516,0
8517,0
8518,0
8519,0
8520,0
8521,0
8522,0
8523,0
8524,0
8525,0
8526,0
8527,0
8528,0
8529,0
8530,0
8531,0
8532,1
8533,1
8534,1
8535,0
8536,0
8537,0
8538,0
8539,0
8540,0
8541,1
8542,0
8543,1
8544,1
8545,1
8546,1
8547,0
8548,0
8549,1
8550,1
8551,1
8552,0
8553,0
8554,0
8555,1
8556,0
8557,0
8558,1
8559,0
8560,0
8561,0
8562,0
8563,0
8564,0
8565,0
8566,0
8567,1
8568,0
8569,0
8570,0
8571,0
8572,0
8573,0
8574,0
8575,0
8576,0
8577,0
8578,1
8579,0
8580,0
8581,1
8582,0
8583,0
8584,0
8585,1
8586,1
8587,0
8588,0
8589,0
8590,0
8591,0
8592,0
8593,0
8594,0
8595,0
8596,1
8597,0
8598,0
8599,1
8600,0
8601,1
8602,0
8603,0
8604,1
8605,0
8606,0
8607,1
8608,0
8609,0
8610,0
8611,0
8612,0
8613,0
8614,0
8615,0
8616,0
8617,1
8618,0
8619,0
8620,1
8621,0
8622,0
8623,1
8624,0
8625,0
8626,1
8627,0
8628,0
8629,0
8630,1
8631,0
8632,0
8633,1
8634,0
8635,0
8636,1
8637,0
8638,1
8639,0
8640,0
8641,0
8642,0
8643,0
8644,0
8645,0
8646,0
8647,1
8648,0
8649,1
8650,1
8651,1
8652,0
8653,1
8654,0
8655,1
8656,1
8657,0
8658,0
8659,1
8660,1
8661,1
8662,0
8663,1
8664,0
8665,0
8666,0
8667,0
8668,0
8669,0
8670,1
8671,0
8672,0
8673,1
8674,0
8675,1
8676,0
8677,0
8678,0
8679,0
8680,0
8681,1
8682,1
8683,0
8684,1
8685,0
8686,0
8687,0
8688,0
8689,1
8690,0
8691,0
8692,0
8693,0
8694,0
8695,1
8696,1
8697,1
8698,1
8699,1
8700,1
8701,0
8702,0
8703,0
8704,0
8705,0
8706,1
8707,0
8708,0
8709,1
8710,0
8711,0
8712,1
8713,0
8714,0
8715,0
8716,0
8717,0
8718,0
8719,0
8720,1
8721,0
8722,1
8723,0
8724,0
8725,0
8726,0
8727,0
8728,0
8729,1
8730,0
8731,0
8732,0
8733,0
8734,0
8735,0
8736,1
8737,1
8738,0
8739,1
8740,0
8741,0
8742,1
8743,0
8744,1
8745,0
8746,0
8747,0
8748,1
8749,0
8750,0
8751,0
8752,0
8753,0
8754,0
8755,0
8756,1
8757,0
8758,1
8759,1
8760,1
8761,0
8762,1
8763,0
8764,1
8765,0
8766,1
8767,0
8768,0
8769,0
8770,0
8771,1
8772,1
8773,0
8774,1
8775,0
8776,0
8777,1
8778,1
8779,1
8780,1
8781,0
8782,0
8783,0
8784,0
8785,0
8786,0
8787,0
8788,0
8789,1
8790,0
8791,0
8792,0
8793,1
8794,0
8795,0
8796,0
8797,0
8798,0
8799,1
8800,1
8801,1
8802,1
8803,0
8804,0
8805,0
8806,0
8807,1
8808,0
8809,0
8810,0
8811,0
8812,0
8813,1
8814,0
8815,0
8816,1
8817,0
8818,0
8819,0
8820,1
8821,0
8822,1
8823,0
8824,0
8825,1
8826,0
8827,0
8828,0
8829,0
8830,0
8831,1
8832,1
8833,0
8834,0
8835,0
8836,0
8837,0
8838,1
8839,0
8840,0
8841,0
8842,0
8843,1
8844,1
8845,0
8846,0
8847,0
8848,1
8849,0
8850,1
8851,1
8852,0
8853,0
8854,0
8855,0
8856,0
8857,0
8858,1
8859,1
8860,1
8861,0
8862,1
8863,0
8864,1
8865,0
8866,0
8867,0
8868,0
8869,1
8870,1
8871,0
8872,0
8873,0
8874,0
8875,0
8876,0
8877,1
8878,0
8879,1
8880,0
8881,1
8882,0
8883,0
8884,1
8885,0
8886,1
8887,0
8888,0
8889,0
8890,0
8891,0
8892,0
8893,0
8894,1
8895,1
8896,0
8897,0
8898,0
8899,0
8900,0
8901,1
8902,0
8903,0
8904,0
8905,1
8906,0
8907,1
8908,1
8909,0
8910,0
8911,0
8912,0
8913,0
8914,0
8915,1
8916,1
8917,0
8918,0
8919,1
8920,0
8921,0
8922,1
8923,0
8924,0
8925,1
8926,0
8927,0
8928,0
8929,1
8930,0
8931,0
8932,1
8933,0
8934,0
8935,0
8936,1
8937,0
8938,0
8939,0
8940,0
8941,1
8942,1
8943,0
8944,0
8945,1
8946,0
8947,0
8948,0
8949,1
8950,0
8951,1
8952,0
8953,1
8954,0
8955,0
8956,1
8957,0
8958,1
8959,1
8960,0
8961,1
8962,0
8963,1
8964,0
8965,0
8966,0
8967,1
8968,0
8969,0
8970,0
8971,0
8972,1
8973,1
8974,1
8975,0
8976,1
8977,1
8978,1
8979,0
8980,0
8981,0
8982,0
8983,0
8984,0
8985,0
8986,0
8987,0
8988,0
8989,0
8990,0
8991,0
8992,0
8993,0
8994,0
8995,0
8996,0
8997,1
8998,0
8999,1
9000,0
9001,1
9002,0
9003,0
9004,0
9005,0
9006,1
9007,1
9008,1
9009,0
9010,0
9011,0
9012,0
9013,1
9014,1
9015,1
9016,0
9017,0
9018,0
9019,1
9020,0
9021,0
9022,1
9023,0
9024,0
9025,0
9026,0
9027,0
9028,0
9029,1
9030,0
9031,1
9032,0
9033,0
9034,0
9035,1
9036,0
9037,0
9038,1
9039,0
9040,0
9041,0
9042,1
9043,0
9044,0
9045,0
9046,0
9047,0
9048,0
9049,0
9050,0
9051,0
9052,1
9053,0
9054,0
9055,1
9056,1
9057,0
9058,0
9059,0
9060,0
9061,0
9062,0
9063,0
9064,0
9065,0
9066,0
9067,0
9068,0
9069,1
9070,0
9071,0
9072,0
9073,0
9074,1
9075,1
9076,0
9077,0
9078,0
9079,1
9080,0
9081,0
9082,0
9083,0
9084,1
9085,0
9086,0
9087,0
9088,0
9089,0
9090,0
9091,0
9092,0
9093,0
9094,0
9095,0
9096,1
9097,0
9098,0
9099,1
9100,0
9101,0
9102,1
9103,0
9104,0
9105,0
9106,0
9107,1
9108,1
9109,1
9110,0
9111,0
9112,0
9113,0
9114,1
9115,0
9116,1
9117,0
9118,0
9119,0
9120,1
9121,0
9122,0
9123,0
9124,1
9125,0
9126,1
9127,0
9128,0
9129,1
9130,0
9131,1
9132,0
9133,0
9134,0
9135,1
9136,0
9137,0
9138,0
9139,0
9140,0
9141,0
9142,1
9143,0
9144,0
9145,0
9146,1
9147,0
9148,1
9149,1
9150,0
9151,0
9152,1
9153,0
9154,0
9155,1
9156,0
9157,0
9158,0
