{
  "type": "NORMAL",
  "maxTrainerWins": 5,
  "maxTrainerDefeats": 1,
  "battleCooldownTicks": 240,
  "spawnWeightFactor": 1.0,
  "biomeTagBlacklist": ["is_void", "is_nether", "is_end", "is_water", "is_underground"],
  "biomeTagWhitelist": ["is_badlands", "is_plains", "is_plateau", "is_savanna", "is_slope", "is_wasteland"]
}