{
  "name": "Expert LanceRe",
  "ai": {
    "type": "rct",
    "data": {
      "maxSelectMargin": 0.15
    }
  },
  "battleRules": {
    "maxItemUses": 5
  },
  "bag": [
    {
      "item": "cobblemon:hyper_potion",
      "quantity": 2
    }
  ],
  "team": [
    {
      "species": "ekans",
      "gender": "FEMALE",
      "level": 5,
      "nature": "gentle",
      "ability": "shedskin",
      "moveset": [
        "wrap",
        "leer",
        "poisonsting"
      ],
      "ivs": {
        "hp": 10,
        "atk": 10,
        "def": 10,
        "spa": 10,
        "spd": 10,
        "spe": 10
      },
      "evs": {}
    }
  ]
}