{
  "type": "TEAM_ROCKET",
  "maxTrainerWins": 5,
  "maxTrainerDefeats": 1,
  "battleCooldownTicks": 240,
  "spawnWeightFactor": 0.5,
  "biomeTagBlacklist": ["is_void"],
  "biomeTagWhitelist": ["is_nether", "has_structure/end_city", "is_badlands", "is_wasteland", "is_peak"]
}