{
  "parent": "rctmod:trainers/defeat_rocket_admin_ariana_2",
  "display": {
    "title": {
      "text": "Head of the snake"
    },
    "description": {
      "text": "Defeat Boss Giovanni in the final encounter"
    },
    "icon": {
      "id": "cobblemon:poke_ball"
    },
    "announce_to_chat": true,
    "show_toast": true,
    "hidden": false,
    "frame": "challenge"
  },
  "criteria": {
    "first_defeat": {
      "conditions": {
        "trainer_ids": ["boss_giovanni_0045"]
      },
      "trigger": "rctmod:defeat_count"
    }
  },
  "requirements": [
    [
      "first_defeat"
    ]
  ]
}