{
  "pools": [
    {
      "rolls": {
        "type": "minecraft:binomial",
        "n": 3,
        "p": 0.35
      },
      "entries": [
        {
          "type": "minecraft:loot_table",
          "value": "rctmod:generic/common",
          "weight": 1000,
          "conditions": [
            {
              "condition": "rctmod:level_range",
              "range": {
                "min": 0,
                "max": 100
              }
            }
          ]
        },
        {
          "type": "minecraft:loot_table",
          "value": "rctmod:generic/uncommon",
          "weight": 500,
          "conditions": [
            {
              "condition": "rctmod:level_range",
              "range": {
                "min": 16,
                "max": 100
              }
            }
          ]
        },
        {
          "type": "minecraft:loot_table",
          "value": "rctmod:generic/rare",
          "weight": 200,
          "conditions": [
            {
              "condition": "rctmod:level_range",
              "range": {
                "min": 38,
                "max": 100
              }
            }
          ]
        },
        {
          "type": "minecraft:loot_table",
          "value": "rctmod:generic/epic",
          "weight": 50,
          "conditions": [
            {
              "condition": "rctmod:level_range",
              "range": {
                "min": 50,
                "max": 100
              }
            }
          ]
        },
        {
          "type": "minecraft:loot_table",
          "value": "rctmod:generic/legendary",
          "weight": 1,
          "conditions": [
            {
              "condition": "rctmod:level_range",
              "range": {
                "min": 70,
                "max": 100
              }
            }
          ]
        }
      ]
    }
  ]
}
