{
  "name": "Falkner",
  "ai": {
    "type": "rct",
    "data": {
      "maxSelectMargin": 0.15
    }
  },
  "battleRules": {
    "maxItemUses": 2
  },
  "bag": [
    {
      "item": "cobblemon:full_restore",
      "quantity": 2
    }
  ],
  "team": [
    {
      "species": "rufflet",
      "gender": "MALE",
      "level": 13,
      "nature": "jolly",
      "ability": "hustle",
      "moveset": [
        "aerialace",
        "slash",
        "rocksmash",
        "roost"
      ],
      "ivs": {
        "hp": 31,
        "atk": 31,
        "def": 31,
        "spa": 31,
        "spd": 31,
        "spe": 31
      },
      "evs": {
        "hp": 4,
        "spe": 40
      },
      "heldItem": "berry_juice"
    },
    {
      "species": "emolga",
      "gender": "FEMALE",
      "level": 13,
      "nature": "timid",
      "ability": "lightningrod",
      "moveset": [
        "shockwave",
        "aircutter",
        "sleeptalk",
        "roost"
      ],
      "ivs": {
        "hp": 31,
        "atk": 31,
        "def": 31,
        "spa": 31,
        "spd": 31,
        "spe": 31
      },
      "evs": {
        "hp": 4,
        "spe": 40
      },
      "heldItem": "berry_juice"
    },
    {
      "species": "corvisquire",
      "gender": "FEMALE",
      "level": 14,
      "nature": "careful",
      "ability": "unnerve",
      "moveset": [
        "pluck",
        "roost",
        "rocksmash",
        "honeclaws"
      ],
      "ivs": {
        "hp": 31,
        "atk": 31,
        "def": 31,
        "spa": 31,
        "spd": 31,
        "spe": 31
      },
      "evs": {
        "hp": 4,
        "spe": 40
      },
      "heldItem": "berry_juice"
    }
  ]
}