{
  "type": "TEAM_ROCKET",
  "requiredDefeats": [
    ["leader_brock_019e"]
  ],
  "maxTrainerWins": 3,
  "maxTrainerDefeats": 1,
  "battleCooldownTicks": 240,
  "spawnWeightFactor": 0.25,
  "biomeTagBlacklist": ["is_void", "is_nether", "is_end"],
  "biomeTagWhitelist": ["is_underground", "is_badlands", "is_wasteland", "is_savanna"]
}