{
  "type": "LEADER",
  "requiredDefeats": [
    ["boss_giovanni_0045"]
  ],
  "maxTrainerWins": 3,
  "maxTrainerDefeats": 1,
  "battleCooldownTicks": 240,
  "spawnWeightFactor": 0.25,
  "biomeTagBlacklist": ["is_void", "is_end"],
  "biomeTagWhitelist": ["is_mountain", "is_peak"]
}