{
  "type": "E4",
  "requiredDefeats": [
    ["trainer_brendan_001a"]
  ],
  "maxTrainerWins": 3,
  "maxTrainerDefeats": 1,
  "battleCooldownTicks": 240,
  "spawnWeightFactor": 0.25,
  "biomeTagBlacklist": ["is_void", "is_nether", "is_end"],
  "biomeTagWhitelist": ["is_cold"]
}