{
  "name": "Dragon Tamer Ramiro",
  "team": [
    {
      "species": "pikachu",
      "gender": "FEMALE",
      "level": 93,
      "nature": "timid",
      "ability": "lightningrod",
      "moveset": [
        "bouncybubble",
        "thunder",
        "fakeout",
        "electroweb"
      ],
      "ivs": {
        "hp": 31,
        "atk": 30,
        "def": 31,
        "spa": 31,
        "spd": 31,
        "spe": 31
      },
      "evs": {
        "spa": 252,
        "spd": 4,
        "spe": 252
      },
      "heldItem": "focus_sash",
      "aspects": [
        "surfing"
      ]
    },
    {
      "species": "milotic",
      "gender": "MALE",
      "level": 93,
      "nature": "modest",
      "ability": "competitive",
      "moveset": [
        "bouncybubble",
        "icebeam",
        "mirrorcoat",
        "hiddenpower"
      ],
      "ivs": {
        "hp": 31,
        "atk": 30,
        "def": 31,
        "spa": 30,
        "spd": 31,
        "spe": 31
      },
      "evs": {
        "hp": 252,
        "def": 4,
        "spa": 252
      },
      "heldItem": "sitrus_berry"
    },
    {
      "species": "lapras",
      "gender": "FEMALE",
      "level": 90,
      "nature": "modest",
      "ability": "waterabsorb",
      "moveset": [
        "boomburst",
        "dragonpulse",
        "thunder",
        "freezedry"
      ],
      "ivs": {
        "hp": 31,
        "atk": 31,
        "def": 31,
        "spa": 31,
        "spd": 31,
        "spe": 31
      },
      "evs": {
        "hp": 252,
        "def": 4,
        "spa": 252
      },
      "heldItem": "life_orb"
    },
    {
      "species": "goodra",
      "gender": "MALE",
      "level": 92,
      "nature": "modest",
      "ability": "gooey",
      "moveset": [
        "surf",
        "dragonpulse",
        "flashcannon",
        "thunder"
      ],
      "ivs": {
        "hp": 31,
        "atk": 31,
        "def": 31,
        "spa": 31,
        "spd": 31,
        "spe": 31
      },
      "evs": {
        "hp": 252,
        "def": 4
      },
      "heldItem": "assault_vest",
      "aspects": [
        "hisuian"
      ]
    },
    {
      "species": "dragonite",
      "gender": "MALE",
      "level": 92,
      "nature": "modest",
      "ability": "multiscale",
      "moveset": [
        "hurricane",
        "thunder",
        "hydropump",
        "icebeam"
      ],
      "ivs": {
        "hp": 31,
        "atk": 31,
        "def": 31,
        "spa": 31,
        "spd": 31,
        "spe": 31
      },
      "evs": {
        "def": 4,
        "spa": 252,
        "spe": 252
      },
      "heldItem": "lum_berry"
    }
  ]
}