{
  "type": "TEAM_ROCKET",
  "requiredDefeats": [
    ["rival_terry_01b0", "rival_terry_01b1", "rival_terry_01b2"]
  ],
  "maxTrainerWins": 3,
  "maxTrainerDefeats": 1,
  "battleCooldownTicks": 240,
  "spawnWeightFactor": 0.25,
  "biomeTagBlacklist": ["is_void", "is_end"],
  "biomeTagWhitelist": ["is_nether", "is_badlands", "is_wasteland", "is_savanna"]
}