{
  "pools": [
    {
      "rolls": {
        "type": "minecraft:binomial",
        "n": 2,
        "p": 0.5
      },
      "entries": [
        {
          "type": "minecraft:loot_table",
          "value": "rctmod:generic/common/nature",
          "weight": 1000,
          "conditions": [
            {
              "condition": "rctmod:level_range",
              "range": {
                "min": 0,
                "max": 19
              }
            }
          ]
        },
        {
          "type": "minecraft:loot_table",
          "value": "rctmod:generic/uncommon/nature",
          "weight": 100,
          "conditions": [
            {
              "condition": "rctmod:level_range",
              "range": {
                "min": 0,
                "max": 19
              }
            }
          ]
        },
        {
          "type": "minecraft:loot_table",
          "value": "rctmod:generic/rare/nature",
          "weight": 40,
          "conditions": [
            {
              "condition": "rctmod:level_range",
              "range": {
                "min": 0,
                "max": 19
              }
            }
          ]
        },
        {
          "type": "minecraft:loot_table",
          "value": "rctmod:generic/epic/nature",
          "weight": 20,
          "conditions": [
            {
              "condition": "rctmod:level_range",
              "range": {
                "min": 0,
                "max": 19
              }
            }
          ]
        },
        {
          "type": "minecraft:loot_table",
          "value": "rctmod:generic/legendary/nature",
          "weight": 2,
          "conditions": [
            {
              "condition": "rctmod:level_range",
              "range": {
                "min": 0,
                "max": 19
              }
            }
          ]
        },
        {
          "type": "minecraft:loot_table",
          "value": "rctmod:generic/common/nature",
          "weight": 1000,
          "conditions": [
            {
              "condition": "rctmod:level_range",
              "range": {
                "min": 20,
                "max": 39
              }
            }
          ]
        },
        {
          "type": "minecraft:loot_table",
          "value": "rctmod:generic/uncommon/nature",
          "weight": 200,
          "conditions": [
            {
              "condition": "rctmod:level_range",
              "range": {
                "min": 20,
                "max": 39
              }
            }
          ]
        },
        {
          "type": "minecraft:loot_table",
          "value": "rctmod:generic/rare/nature",
          "weight": 80,
          "conditions": [
            {
              "condition": "rctmod:level_range",
              "range": {
                "min": 20,
                "max": 39
              }
            }
          ]
        },
        {
          "type": "minecraft:loot_table",
          "value": "rctmod:generic/epic/nature",
          "weight": 40,
          "conditions": [
            {
              "condition": "rctmod:level_range",
              "range": {
                "min": 20,
                "max": 39
              }
            }
          ]
        },
        {
          "type": "minecraft:loot_table",
          "value": "rctmod:generic/legendary/nature",
          "weight": 4,
          "conditions": [
            {
              "condition": "rctmod:level_range",
              "range": {
                "min": 20,
                "max": 39
              }
            }
          ]
        },
        {
          "type": "minecraft:loot_table",
          "value": "rctmod:generic/common/nature",
          "weight": 1000,
          "conditions": [
            {
              "condition": "rctmod:level_range",
              "range": {
                "min": 40,
                "max": 59
              }
            }
          ]
        },
        {
          "type": "minecraft:loot_table",
          "value": "rctmod:generic/uncommon/nature",
          "weight": 300,
          "conditions": [
            {
              "condition": "rctmod:level_range",
              "range": {
                "min": 40,
                "max": 59
              }
            }
          ]
        },
        {
          "type": "minecraft:loot_table",
          "value": "rctmod:generic/rare/nature",
          "weight": 120,
          "conditions": [
            {
              "condition": "rctmod:level_range",
              "range": {
                "min": 40,
                "max": 59
              }
            }
          ]
        },
        {
          "type": "minecraft:loot_table",
          "value": "rctmod:generic/epic/nature",
          "weight": 60,
          "conditions": [
            {
              "condition": "rctmod:level_range",
              "range": {
                "min": 40,
                "max": 59
              }
            }
          ]
        },
        {
          "type": "minecraft:loot_table",
          "value": "rctmod:generic/legendary/nature",
          "weight": 6,
          "conditions": [
            {
              "condition": "rctmod:level_range",
              "range": {
                "min": 40,
                "max": 59
              }
            }
          ]
        },
        {
          "type": "minecraft:loot_table",
          "value": "rctmod:generic/common/nature",
          "weight": 1000,
          "conditions": [
            {
              "condition": "rctmod:level_range",
              "range": {
                "min": 60,
                "max": 79
              }
            }
          ]
        },
        {
          "type": "minecraft:loot_table",
          "value": "rctmod:generic/uncommon/nature",
          "weight": 400,
          "conditions": [
            {
              "condition": "rctmod:level_range",
              "range": {
                "min": 60,
                "max": 79
              }
            }
          ]
        },
        {
          "type": "minecraft:loot_table",
          "value": "rctmod:generic/rare/nature",
          "weight": 160,
          "conditions": [
            {
              "condition": "rctmod:level_range",
              "range": {
                "min": 60,
                "max": 79
              }
            }
          ]
        },
        {
          "type": "minecraft:loot_table",
          "value": "rctmod:generic/epic/nature",
          "weight": 80,
          "conditions": [
            {
              "condition": "rctmod:level_range",
              "range": {
                "min": 60,
                "max": 79
              }
            }
          ]
        },
        {
          "type": "minecraft:loot_table",
          "value": "rctmod:generic/legendary/nature",
          "weight": 8,
          "conditions": [
            {
              "condition": "rctmod:level_range",
              "range": {
                "min": 60,
                "max": 79
              }
            }
          ]
        },
        {
          "type": "minecraft:loot_table",
          "value": "rctmod:generic/common/nature",
          "weight": 1000,
          "conditions": [
            {
              "condition": "rctmod:level_range",
              "range": {
                "min": 80,
                "max": 100
              }
            }
          ]
        },
        {
          "type": "minecraft:loot_table",
          "value": "rctmod:generic/uncommon/nature",
          "weight": 500,
          "conditions": [
            {
              "condition": "rctmod:level_range",
              "range": {
                "min": 80,
                "max": 100
              }
            }
          ]
        },
        {
          "type": "minecraft:loot_table",
          "value": "rctmod:generic/rare/nature",
          "weight": 200,
          "conditions": [
            {
              "condition": "rctmod:level_range",
              "range": {
                "min": 80,
                "max": 100
              }
            }
          ]
        },
        {
          "type": "minecraft:loot_table",
          "value": "rctmod:generic/epic/nature",
          "weight": 100,
          "conditions": [
            {
              "condition": "rctmod:level_range",
              "range": {
                "min": 80,
                "max": 100
              }
            }
          ]
        },
        {
          "type": "minecraft:loot_table",
          "value": "rctmod:generic/legendary/nature",
          "weight": 10,
          "conditions": [
            {
              "condition": "rctmod:level_range",
              "range": {
                "min": 80,
                "max": 100
              }
            }
          ]
        },
        {
          "type": "minecraft:loot_table",
          "value": "rctmod:generic/common/berries",
          "weight": 1000,
          "conditions": [
            {
              "condition": "rctmod:level_range",
              "range": {
                "min": 0,
                "max": 19
              }
            }
          ]
        },
        {
          "type": "minecraft:loot_table",
          "value": "rctmod:generic/uncommon/berries",
          "weight": 100,
          "conditions": [
            {
              "condition": "rctmod:level_range",
              "range": {
                "min": 0,
                "max": 19
              }
            }
          ]
        },
        {
          "type": "minecraft:loot_table",
          "value": "rctmod:generic/rare/berries",
          "weight": 40,
          "conditions": [
            {
              "condition": "rctmod:level_range",
              "range": {
                "min": 0,
                "max": 19
              }
            }
          ]
        },
        {
          "type": "minecraft:loot_table",
          "value": "rctmod:generic/epic/berries",
          "weight": 20,
          "conditions": [
            {
              "condition": "rctmod:level_range",
              "range": {
                "min": 0,
                "max": 19
              }
            }
          ]
        },
        {
          "type": "minecraft:loot_table",
          "value": "rctmod:generic/legendary/berries",
          "weight": 2,
          "conditions": [
            {
              "condition": "rctmod:level_range",
              "range": {
                "min": 0,
                "max": 19
              }
            }
          ]
        },
        {
          "type": "minecraft:loot_table",
          "value": "rctmod:generic/common/berries",
          "weight": 1000,
          "conditions": [
            {
              "condition": "rctmod:level_range",
              "range": {
                "min": 20,
                "max": 39
              }
            }
          ]
        },
        {
          "type": "minecraft:loot_table",
          "value": "rctmod:generic/uncommon/berries",
          "weight": 200,
          "conditions": [
            {
              "condition": "rctmod:level_range",
              "range": {
                "min": 20,
                "max": 39
              }
            }
          ]
        },
        {
          "type": "minecraft:loot_table",
          "value": "rctmod:generic/rare/berries",
          "weight": 80,
          "conditions": [
            {
              "condition": "rctmod:level_range",
              "range": {
                "min": 20,
                "max": 39
              }
            }
          ]
        },
        {
          "type": "minecraft:loot_table",
          "value": "rctmod:generic/epic/berries",
          "weight": 40,
          "conditions": [
            {
              "condition": "rctmod:level_range",
              "range": {
                "min": 20,
                "max": 39
              }
            }
          ]
        },
        {
          "type": "minecraft:loot_table",
          "value": "rctmod:generic/legendary/berries",
          "weight": 4,
          "conditions": [
            {
              "condition": "rctmod:level_range",
              "range": {
                "min": 20,
                "max": 39
              }
            }
          ]
        },
        {
          "type": "minecraft:loot_table",
          "value": "rctmod:generic/common/berries",
          "weight": 1000,
          "conditions": [
            {
              "condition": "rctmod:level_range",
              "range": {
                "min": 40,
                "max": 59
              }
            }
          ]
        },
        {
          "type": "minecraft:loot_table",
          "value": "rctmod:generic/uncommon/berries",
          "weight": 300,
          "conditions": [
            {
              "condition": "rctmod:level_range",
              "range": {
                "min": 40,
                "max": 59
              }
            }
          ]
        },
        {
          "type": "minecraft:loot_table",
          "value": "rctmod:generic/rare/berries",
          "weight": 120,
          "conditions": [
            {
              "condition": "rctmod:level_range",
              "range": {
                "min": 40,
                "max": 59
              }
            }
          ]
        },
        {
          "type": "minecraft:loot_table",
          "value": "rctmod:generic/epic/berries",
          "weight": 60,
          "conditions": [
            {
              "condition": "rctmod:level_range",
              "range": {
                "min": 40,
                "max": 59
              }
            }
          ]
        },
        {
          "type": "minecraft:loot_table",
          "value": "rctmod:generic/legendary/berries",
          "weight": 6,
          "conditions": [
            {
              "condition": "rctmod:level_range",
              "range": {
                "min": 40,
                "max": 59
              }
            }
          ]
        },
        {
          "type": "minecraft:loot_table",
          "value": "rctmod:generic/common/berries",
          "weight": 1000,
          "conditions": [
            {
              "condition": "rctmod:level_range",
              "range": {
                "min": 60,
                "max": 79
              }
            }
          ]
        },
        {
          "type": "minecraft:loot_table",
          "value": "rctmod:generic/uncommon/berries",
          "weight": 400,
          "conditions": [
            {
              "condition": "rctmod:level_range",
              "range": {
                "min": 60,
                "max": 79
              }
            }
          ]
        },
        {
          "type": "minecraft:loot_table",
          "value": "rctmod:generic/rare/berries",
          "weight": 160,
          "conditions": [
            {
              "condition": "rctmod:level_range",
              "range": {
                "min": 60,
                "max": 79
              }
            }
          ]
        },
        {
          "type": "minecraft:loot_table",
          "value": "rctmod:generic/epic/berries",
          "weight": 80,
          "conditions": [
            {
              "condition": "rctmod:level_range",
              "range": {
                "min": 60,
                "max": 79
              }
            }
          ]
        },
        {
          "type": "minecraft:loot_table",
          "value": "rctmod:generic/legendary/berries",
          "weight": 8,
          "conditions": [
            {
              "condition": "rctmod:level_range",
              "range": {
                "min": 60,
                "max": 79
              }
            }
          ]
        },
        {
          "type": "minecraft:loot_table",
          "value": "rctmod:generic/common/berries",
          "weight": 1000,
          "conditions": [
            {
              "condition": "rctmod:level_range",
              "range": {
                "min": 80,
                "max": 100
              }
            }
          ]
        },
        {
          "type": "minecraft:loot_table",
          "value": "rctmod:generic/uncommon/berries",
          "weight": 500,
          "conditions": [
            {
              "condition": "rctmod:level_range",
              "range": {
                "min": 80,
                "max": 100
              }
            }
          ]
        },
        {
          "type": "minecraft:loot_table",
          "value": "rctmod:generic/rare/berries",
          "weight": 200,
          "conditions": [
            {
              "condition": "rctmod:level_range",
              "range": {
                "min": 80,
                "max": 100
              }
            }
          ]
        },
        {
          "type": "minecraft:loot_table",
          "value": "rctmod:generic/epic/berries",
          "weight": 100,
          "conditions": [
            {
              "condition": "rctmod:level_range",
              "range": {
                "min": 80,
                "max": 100
              }
            }
          ]
        },
        {
          "type": "minecraft:loot_table",
          "value": "rctmod:generic/legendary/berries",
          "weight": 10,
          "conditions": [
            {
              "condition": "rctmod:level_range",
              "range": {
                "min": 80,
                "max": 100
              }
            }
          ]
        },
        {
          "type": "minecraft:loot_table",
          "value": "rctmod:generic/common/diverse",
          "weight": 1000,
          "conditions": [
            {
              "condition": "rctmod:level_range",
              "range": {
                "min": 0,
                "max": 19
              }
            }
          ]
        },
        {
          "type": "minecraft:loot_table",
          "value": "rctmod:generic/uncommon/diverse",
          "weight": 100,
          "conditions": [
            {
              "condition": "rctmod:level_range",
              "range": {
                "min": 0,
                "max": 19
              }
            }
          ]
        },
        {
          "type": "minecraft:loot_table",
          "value": "rctmod:generic/rare/diverse",
          "weight": 40,
          "conditions": [
            {
              "condition": "rctmod:level_range",
              "range": {
                "min": 0,
                "max": 19
              }
            }
          ]
        },
        {
          "type": "minecraft:loot_table",
          "value": "rctmod:generic/epic/diverse",
          "weight": 20,
          "conditions": [
            {
              "condition": "rctmod:level_range",
              "range": {
                "min": 0,
                "max": 19
              }
            }
          ]
        },
        {
          "type": "minecraft:loot_table",
          "value": "rctmod:generic/legendary/diverse",
          "weight": 2,
          "conditions": [
            {
              "condition": "rctmod:level_range",
              "range": {
                "min": 0,
                "max": 19
              }
            }
          ]
        },
        {
          "type": "minecraft:loot_table",
          "value": "rctmod:generic/common/diverse",
          "weight": 1000,
          "conditions": [
            {
              "condition": "rctmod:level_range",
              "range": {
                "min": 20,
                "max": 39
              }
            }
          ]
        },
        {
          "type": "minecraft:loot_table",
          "value": "rctmod:generic/uncommon/diverse",
          "weight": 200,
          "conditions": [
            {
              "condition": "rctmod:level_range",
              "range": {
                "min": 20,
                "max": 39
              }
            }
          ]
        },
        {
          "type": "minecraft:loot_table",
          "value": "rctmod:generic/rare/diverse",
          "weight": 80,
          "conditions": [
            {
              "condition": "rctmod:level_range",
              "range": {
                "min": 20,
                "max": 39
              }
            }
          ]
        },
        {
          "type": "minecraft:loot_table",
          "value": "rctmod:generic/epic/diverse",
          "weight": 40,
          "conditions": [
            {
              "condition": "rctmod:level_range",
              "range": {
                "min": 20,
                "max": 39
              }
            }
          ]
        },
        {
          "type": "minecraft:loot_table",
          "value": "rctmod:generic/legendary/diverse",
          "weight": 4,
          "conditions": [
            {
              "condition": "rctmod:level_range",
              "range": {
                "min": 20,
                "max": 39
              }
            }
          ]
        },
        {
          "type": "minecraft:loot_table",
          "value": "rctmod:generic/common/diverse",
          "weight": 1000,
          "conditions": [
            {
              "condition": "rctmod:level_range",
              "range": {
                "min": 40,
                "max": 59
              }
            }
          ]
        },
        {
          "type": "minecraft:loot_table",
          "value": "rctmod:generic/uncommon/diverse",
          "weight": 300,
          "conditions": [
            {
              "condition": "rctmod:level_range",
              "range": {
                "min": 40,
                "max": 59
              }
            }
          ]
        },
        {
          "type": "minecraft:loot_table",
          "value": "rctmod:generic/rare/diverse",
          "weight": 120,
          "conditions": [
            {
              "condition": "rctmod:level_range",
              "range": {
                "min": 40,
                "max": 59
              }
            }
          ]
        },
        {
          "type": "minecraft:loot_table",
          "value": "rctmod:generic/epic/diverse",
          "weight": 60,
          "conditions": [
            {
              "condition": "rctmod:level_range",
              "range": {
                "min": 40,
                "max": 59
              }
            }
          ]
        },
        {
          "type": "minecraft:loot_table",
          "value": "rctmod:generic/legendary/diverse",
          "weight": 6,
          "conditions": [
            {
              "condition": "rctmod:level_range",
              "range": {
                "min": 40,
                "max": 59
              }
            }
          ]
        },
        {
          "type": "minecraft:loot_table",
          "value": "rctmod:generic/common/diverse",
          "weight": 1000,
          "conditions": [
            {
              "condition": "rctmod:level_range",
              "range": {
                "min": 60,
                "max": 79
              }
            }
          ]
        },
        {
          "type": "minecraft:loot_table",
          "value": "rctmod:generic/uncommon/diverse",
          "weight": 400,
          "conditions": [
            {
              "condition": "rctmod:level_range",
              "range": {
                "min": 60,
                "max": 79
              }
            }
          ]
        },
        {
          "type": "minecraft:loot_table",
          "value": "rctmod:generic/rare/diverse",
          "weight": 160,
          "conditions": [
            {
              "condition": "rctmod:level_range",
              "range": {
                "min": 60,
                "max": 79
              }
            }
          ]
        },
        {
          "type": "minecraft:loot_table",
          "value": "rctmod:generic/epic/diverse",
          "weight": 80,
          "conditions": [
            {
              "condition": "rctmod:level_range",
              "range": {
                "min": 60,
                "max": 79
              }
            }
          ]
        },
        {
          "type": "minecraft:loot_table",
          "value": "rctmod:generic/legendary/diverse",
          "weight": 8,
          "conditions": [
            {
              "condition": "rctmod:level_range",
              "range": {
                "min": 60,
                "max": 79
              }
            }
          ]
        },
        {
          "type": "minecraft:loot_table",
          "value": "rctmod:generic/common/diverse",
          "weight": 1000,
          "conditions": [
            {
              "condition": "rctmod:level_range",
              "range": {
                "min": 80,
                "max": 100
              }
            }
          ]
        },
        {
          "type": "minecraft:loot_table",
          "value": "rctmod:generic/uncommon/diverse",
          "weight": 500,
          "conditions": [
            {
              "condition": "rctmod:level_range",
              "range": {
                "min": 80,
                "max": 100
              }
            }
          ]
        },
        {
          "type": "minecraft:loot_table",
          "value": "rctmod:generic/rare/diverse",
          "weight": 200,
          "conditions": [
            {
              "condition": "rctmod:level_range",
              "range": {
                "min": 80,
                "max": 100
              }
            }
          ]
        },
        {
          "type": "minecraft:loot_table",
          "value": "rctmod:generic/epic/diverse",
          "weight": 100,
          "conditions": [
            {
              "condition": "rctmod:level_range",
              "range": {
                "min": 80,
                "max": 100
              }
            }
          ]
        },
        {
          "type": "minecraft:loot_table",
          "value": "rctmod:generic/legendary/diverse",
          "weight": 10,
          "conditions": [
            {
              "condition": "rctmod:level_range",
              "range": {
                "min": 80,
                "max": 100
              }
            }
          ]
        }
      ]
    }
  ],
  "random_sequence": "rctmod:trainers/groups/lady"
}