{
  "name": "Dumbass Kid",
  "team": [
    {
      "species": "swampert",
      "gender": "FEMALE",
      "level": 54,
      "nature": "adamant",
      "ability": "torrent",
      "moveset": [
        "stealthrock",
        "flipturn",
        "liquidation",
        "earthquake"
      ],
      "ivs": {
        "hp": 31,
        "atk": 31,
        "def": 31,
        "spa": 31,
        "spd": 31,
        "spe": 31
      },
      "evs": {
        "hp": 252,
        "atk": 252,
        "spe": 6
      },
      "heldItem": "rindo_berry"
    },
    {
      "species": "pelipper",
      "gender": "MALE",
      "level": 54,
      "nature": "modest",
      "ability": "drizzle",
      "moveset": [
        "surf",
        "hurricane",
        "uturn",
        "roost"
      ],
      "ivs": {
        "hp": 31,
        "atk": 31,
        "def": 31,
        "spa": 31,
        "spd": 31,
        "spe": 31
      },
      "evs": {
        "hp": 6,
        "spa": 252,
        "spe": 252
      },
      "heldItem": "damp_rock"
    },
    {
      "species": "scizor",
      "gender": "FEMALE",
      "level": 54,
      "nature": "adamant",
      "ability": "technician",
      "moveset": [
        "swordsdance",
        "uturn",
        "bulletpunch",
        "superpower"
      ],
      "ivs": {
        "hp": 31,
        "atk": 31,
        "def": 31,
        "spa": 31,
        "spd": 31,
        "spe": 31
      },
      "evs": {
        "hp": 252,
        "atk": 252,
        "spe": 6
      },
      "heldItem": "metal_coat"
    },
    {
      "species": "frosmoth",
      "gender": "MALE",
      "level": 54,
      "nature": "modest",
      "ability": "icescales",
      "moveset": [
        "quiverdance",
        "icebeam",
        "hurricane",
        "bugbuzz"
      ],
      "ivs": {
        "hp": 31,
        "atk": 31,
        "def": 31,
        "spa": 31,
        "spd": 31,
        "spe": 31
      },
      "evs": {
        "hp": 6,
        "spa": 252,
        "spe": 252
      },
      "heldItem": "leftovers"
    },
    {
      "species": "seaking",
      "gender": "MALE",
      "level": 54,
      "nature": "adamant",
      "ability": "raindish",
      "moveset": [
        "fishiousrend",
        "megahorn",
        "flipturn"
      ],
      "ivs": {
        "hp": 31,
        "atk": 31,
        "def": 31,
        "spa": 31,
        "spd": 31,
        "spe": 31
      },
      "evs": {
        "hp": 6,
        "atk": 252,
        "spe": 252
      },
      "heldItem": "choice_band"
    },
    {
      "species": "swampert",
      "gender": "FEMALE",
      "level": 54,
      "nature": "adamant",
      "ability": "torrent",
      "moveset": [
        "liquidation",
        "earthquake",
        "icepunch",
        "flipturn"
      ],
      "ivs": {
        "hp": 31,
        "atk": 31,
        "def": 31,
        "spa": 31,
        "spd": 31,
        "spe": 31
      },
      "evs": {
        "hp": 6,
        "atk": 252,
        "spe": 252
      },
      "heldItem": "leftovers"
    }
  ]
}