{
  "type": "RIVAL",
  "requiredDefeats": [
    ["leader_koga_01a2"]
  ],
  "maxTrainerWins": 3,
  "maxTrainerDefeats": 1,
  "battleCooldownTicks": 240,
  "spawnWeightFactor": 0.25,
  "biomeTagBlacklist": ["is_void", "is_nether", "is_end"],
  "biomeTagWhitelist": ["is_plains", "is_sparse_vegetation", "is_rare", "is_forest"]
}