{
  "name": "Ace Trainer Austina",
  "ai": {
    "type": "rct",
    "data": {
      "maxSelectMargin": 0.15
    }
  },
  "battleRules": {
    "maxItemUses": 5
  },
  "bag": [
    {
      "item": "cobblemon:hyper_potion",
      "quantity": 2
    }
  ],
  "team": [
    {
      "species": "rhyhorn",
      "gender": "FEMALE",
      "level": 42,
      "nature": "rash",
      "ability": "rockhead",
      "moveset": [
        "horndrill",
        "rockblast",
        "scaryface",
        "stomp"
      ],
      "ivs": {
        "hp": 25,
        "atk": 25,
        "def": 25,
        "spa": 25,
        "spd": 25,
        "spe": 25
      },
      "evs": {}
    },
    {
      "species": "nidorina",
      "gender": "FEMALE",
      "level": 42,
      "nature": "lonely",
      "ability": "rivalry",
      "moveset": [
        "doublekick",
        "furyswipes",
        "bite",
        "flatter"
      ],
      "ivs": {
        "hp": 25,
        "atk": 25,
        "def": 25,
        "spa": 25,
        "spd": 25,
        "spe": 25
      },
      "evs": {}
    },
    {
      "species": "nidoqueen",
      "gender": "FEMALE",
      "level": 42,
      "nature": "mild",
      "ability": "rivalry",
      "moveset": [
        "bodyslam",
        "doublekick",
        "bite",
        "growl"
      ],
      "ivs": {
        "hp": 25,
        "atk": 25,
        "def": 25,
        "spa": 25,
        "spd": 25,
        "spe": 25
      },
      "evs": {}
    },
    {
      "species": "nidorino",
      "gender": "MALE",
      "level": 42,
      "nature": "mild",
      "ability": "rivalry",
      "moveset": [
        "hornattack",
        "poisonsting",
        "focusenergy",
        "leer"
      ],
      "ivs": {
        "hp": 25,
        "atk": 25,
        "def": 25,
        "spa": 25,
        "spd": 25,
        "spe": 25
      },
      "evs": {}
    },
    {
      "species": "nidoking",
      "gender": "MALE",
      "level": 42,
      "nature": "quiet",
      "ability": "rivalry",
      "moveset": [
        "thrash",
        "doublekick",
        "poisonsting",
        "peck"
      ],
      "ivs": {
        "hp": 25,
        "atk": 25,
        "def": 25,
        "spa": 25,
        "spd": 25,
        "spe": 25
      },
      "evs": {}
    }
  ]
}