{
  "parent": "rctmod:trainers/defeat_leader_sabrina",
  "display": {
    "title": {
      "text": "Friendly competition"
    },
    "description": {
      "text": "Defeat Trainer Brendan (again)"
    },
    "icon": {
      "id": "cobblemon:poke_ball"
    },
    "announce_to_chat": false,
    "show_toast": true,
    "hidden": false,
    "frame": "task"
  },
  "criteria": {
    "first_defeat": {
      "conditions": {
        "trainer_ids": ["trainer_brendan_0039"]
      },
      "trigger": "rctmod:defeat_count"
    }
  },
  "requirements": [
    [
      "first_defeat"
    ]
  ]
}