{
  "pools": [
    {
      "rolls": {
        "type": "minecraft:binomial",
        "n": 2,
        "p": 0.5
      },
      "entries": [
        {
          "type": "minecraft:loot_table",
          "value": "rctmod:generic/common/pokeballs",
          "weight": 1000,
          "conditions": [
            {
              "condition": "rctmod:level_range",
              "range": {
                "min": 0,
                "max": 19
              }
            }
          ]
        },
        {
          "type": "minecraft:loot_table",
          "value": "rctmod:generic/uncommon/pokeballs",
          "weight": 100,
          "conditions": [
            {
              "condition": "rctmod:level_range",
              "range": {
                "min": 0,
                "max": 19
              }
            }
          ]
        },
        {
          "type": "minecraft:loot_table",
          "value": "rctmod:generic/rare/pokeballs",
          "weight": 40,
          "conditions": [
            {
              "condition": "rctmod:level_range",
              "range": {
                "min": 0,
                "max": 19
              }
            }
          ]
        },
        {
          "type": "minecraft:loot_table",
          "value": "rctmod:generic/epic/pokeballs",
          "weight": 20,
          "conditions": [
            {
              "condition": "rctmod:level_range",
              "range": {
                "min": 0,
                "max": 19
              }
            }
          ]
        },
        {
          "type": "minecraft:loot_table",
          "value": "rctmod:generic/legendary/pokeballs",
          "weight": 2,
          "conditions": [
            {
              "condition": "rctmod:level_range",
              "range": {
                "min": 0,
                "max": 19
              }
            }
          ]
        },
        {
          "type": "minecraft:loot_table",
          "value": "rctmod:generic/common/pokeballs",
          "weight": 1000,
          "conditions": [
            {
              "condition": "rctmod:level_range",
              "range": {
                "min": 20,
                "max": 39
              }
            }
          ]
        },
        {
          "type": "minecraft:loot_table",
          "value": "rctmod:generic/uncommon/pokeballs",
          "weight": 200,
          "conditions": [
            {
              "condition": "rctmod:level_range",
              "range": {
                "min": 20,
                "max": 39
              }
            }
          ]
        },
        {
          "type": "minecraft:loot_table",
          "value": "rctmod:generic/rare/pokeballs",
          "weight": 80,
          "conditions": [
            {
              "condition": "rctmod:level_range",
              "range": {
                "min": 20,
                "max": 39
              }
            }
          ]
        },
        {
          "type": "minecraft:loot_table",
          "value": "rctmod:generic/epic/pokeballs",
          "weight": 40,
          "conditions": [
            {
              "condition": "rctmod:level_range",
              "range": {
                "min": 20,
                "max": 39
              }
            }
          ]
        },
        {
          "type": "minecraft:loot_table",
          "value": "rctmod:generic/legendary/pokeballs",
          "weight": 4,
          "conditions": [
            {
              "condition": "rctmod:level_range",
              "range": {
                "min": 20,
                "max": 39
              }
            }
          ]
        },
        {
          "type": "minecraft:loot_table",
          "value": "rctmod:generic/common/pokeballs",
          "weight": 1000,
          "conditions": [
            {
              "condition": "rctmod:level_range",
              "range": {
                "min": 40,
                "max": 59
              }
            }
          ]
        },
        {
          "type": "minecraft:loot_table",
          "value": "rctmod:generic/uncommon/pokeballs",
          "weight": 300,
          "conditions": [
            {
              "condition": "rctmod:level_range",
              "range": {
                "min": 40,
                "max": 59
              }
            }
          ]
        },
        {
          "type": "minecraft:loot_table",
          "value": "rctmod:generic/rare/pokeballs",
          "weight": 120,
          "conditions": [
            {
              "condition": "rctmod:level_range",
              "range": {
                "min": 40,
                "max": 59
              }
            }
          ]
        },
        {
          "type": "minecraft:loot_table",
          "value": "rctmod:generic/epic/pokeballs",
          "weight": 60,
          "conditions": [
            {
              "condition": "rctmod:level_range",
              "range": {
                "min": 40,
                "max": 59
              }
            }
          ]
        },
        {
          "type": "minecraft:loot_table",
          "value": "rctmod:generic/legendary/pokeballs",
          "weight": 6,
          "conditions": [
            {
              "condition": "rctmod:level_range",
              "range": {
                "min": 40,
                "max": 59
              }
            }
          ]
        },
        {
          "type": "minecraft:loot_table",
          "value": "rctmod:generic/common/pokeballs",
          "weight": 1000,
          "conditions": [
            {
              "condition": "rctmod:level_range",
              "range": {
                "min": 60,
                "max": 79
              }
            }
          ]
        },
        {
          "type": "minecraft:loot_table",
          "value": "rctmod:generic/uncommon/pokeballs",
          "weight": 400,
          "conditions": [
            {
              "condition": "rctmod:level_range",
              "range": {
                "min": 60,
                "max": 79
              }
            }
          ]
        },
        {
          "type": "minecraft:loot_table",
          "value": "rctmod:generic/rare/pokeballs",
          "weight": 160,
          "conditions": [
            {
              "condition": "rctmod:level_range",
              "range": {
                "min": 60,
                "max": 79
              }
            }
          ]
        },
        {
          "type": "minecraft:loot_table",
          "value": "rctmod:generic/epic/pokeballs",
          "weight": 80,
          "conditions": [
            {
              "condition": "rctmod:level_range",
              "range": {
                "min": 60,
                "max": 79
              }
            }
          ]
        },
        {
          "type": "minecraft:loot_table",
          "value": "rctmod:generic/legendary/pokeballs",
          "weight": 8,
          "conditions": [
            {
              "condition": "rctmod:level_range",
              "range": {
                "min": 60,
                "max": 79
              }
            }
          ]
        },
        {
          "type": "minecraft:loot_table",
          "value": "rctmod:generic/common/pokeballs",
          "weight": 1000,
          "conditions": [
            {
              "condition": "rctmod:level_range",
              "range": {
                "min": 80,
                "max": 100
              }
            }
          ]
        },
        {
          "type": "minecraft:loot_table",
          "value": "rctmod:generic/uncommon/pokeballs",
          "weight": 500,
          "conditions": [
            {
              "condition": "rctmod:level_range",
              "range": {
                "min": 80,
                "max": 100
              }
            }
          ]
        },
        {
          "type": "minecraft:loot_table",
          "value": "rctmod:generic/rare/pokeballs",
          "weight": 200,
          "conditions": [
            {
              "condition": "rctmod:level_range",
              "range": {
                "min": 80,
                "max": 100
              }
            }
          ]
        },
        {
          "type": "minecraft:loot_table",
          "value": "rctmod:generic/epic/pokeballs",
          "weight": 100,
          "conditions": [
            {
              "condition": "rctmod:level_range",
              "range": {
                "min": 80,
                "max": 100
              }
            }
          ]
        },
        {
          "type": "minecraft:loot_table",
          "value": "rctmod:generic/legendary/pokeballs",
          "weight": 10,
          "conditions": [
            {
              "condition": "rctmod:level_range",
              "range": {
                "min": 80,
                "max": 100
              }
            }
          ]
        },
        {
          "type": "minecraft:loot_table",
          "value": "rctmod:generic/common/medicine",
          "weight": 1000,
          "conditions": [
            {
              "condition": "rctmod:level_range",
              "range": {
                "min": 0,
                "max": 19
              }
            }
          ]
        },
        {
          "type": "minecraft:loot_table",
          "value": "rctmod:generic/uncommon/medicine",
          "weight": 100,
          "conditions": [
            {
              "condition": "rctmod:level_range",
              "range": {
                "min": 0,
                "max": 19
              }
            }
          ]
        },
        {
          "type": "minecraft:loot_table",
          "value": "rctmod:generic/rare/medicine",
          "weight": 40,
          "conditions": [
            {
              "condition": "rctmod:level_range",
              "range": {
                "min": 0,
                "max": 19
              }
            }
          ]
        },
        {
          "type": "minecraft:loot_table",
          "value": "rctmod:generic/epic/medicine",
          "weight": 20,
          "conditions": [
            {
              "condition": "rctmod:level_range",
              "range": {
                "min": 0,
                "max": 19
              }
            }
          ]
        },
        {
          "type": "minecraft:loot_table",
          "value": "rctmod:generic/legendary/medicine",
          "weight": 2,
          "conditions": [
            {
              "condition": "rctmod:level_range",
              "range": {
                "min": 0,
                "max": 19
              }
            }
          ]
        },
        {
          "type": "minecraft:loot_table",
          "value": "rctmod:generic/common/medicine",
          "weight": 1000,
          "conditions": [
            {
              "condition": "rctmod:level_range",
              "range": {
                "min": 20,
                "max": 39
              }
            }
          ]
        },
        {
          "type": "minecraft:loot_table",
          "value": "rctmod:generic/uncommon/medicine",
          "weight": 200,
          "conditions": [
            {
              "condition": "rctmod:level_range",
              "range": {
                "min": 20,
                "max": 39
              }
            }
          ]
        },
        {
          "type": "minecraft:loot_table",
          "value": "rctmod:generic/rare/medicine",
          "weight": 80,
          "conditions": [
            {
              "condition": "rctmod:level_range",
              "range": {
                "min": 20,
                "max": 39
              }
            }
          ]
        },
        {
          "type": "minecraft:loot_table",
          "value": "rctmod:generic/epic/medicine",
          "weight": 40,
          "conditions": [
            {
              "condition": "rctmod:level_range",
              "range": {
                "min": 20,
                "max": 39
              }
            }
          ]
        },
        {
          "type": "minecraft:loot_table",
          "value": "rctmod:generic/legendary/medicine",
          "weight": 4,
          "conditions": [
            {
              "condition": "rctmod:level_range",
              "range": {
                "min": 20,
                "max": 39
              }
            }
          ]
        },
        {
          "type": "minecraft:loot_table",
          "value": "rctmod:generic/common/medicine",
          "weight": 1000,
          "conditions": [
            {
              "condition": "rctmod:level_range",
              "range": {
                "min": 40,
                "max": 59
              }
            }
          ]
        },
        {
          "type": "minecraft:loot_table",
          "value": "rctmod:generic/uncommon/medicine",
          "weight": 300,
          "conditions": [
            {
              "condition": "rctmod:level_range",
              "range": {
                "min": 40,
                "max": 59
              }
            }
          ]
        },
        {
          "type": "minecraft:loot_table",
          "value": "rctmod:generic/rare/medicine",
          "weight": 120,
          "conditions": [
            {
              "condition": "rctmod:level_range",
              "range": {
                "min": 40,
                "max": 59
              }
            }
          ]
        },
        {
          "type": "minecraft:loot_table",
          "value": "rctmod:generic/epic/medicine",
          "weight": 60,
          "conditions": [
            {
              "condition": "rctmod:level_range",
              "range": {
                "min": 40,
                "max": 59
              }
            }
          ]
        },
        {
          "type": "minecraft:loot_table",
          "value": "rctmod:generic/legendary/medicine",
          "weight": 6,
          "conditions": [
            {
              "condition": "rctmod:level_range",
              "range": {
                "min": 40,
                "max": 59
              }
            }
          ]
        },
        {
          "type": "minecraft:loot_table",
          "value": "rctmod:generic/common/medicine",
          "weight": 1000,
          "conditions": [
            {
              "condition": "rctmod:level_range",
              "range": {
                "min": 60,
                "max": 79
              }
            }
          ]
        },
        {
          "type": "minecraft:loot_table",
          "value": "rctmod:generic/uncommon/medicine",
          "weight": 400,
          "conditions": [
            {
              "condition": "rctmod:level_range",
              "range": {
                "min": 60,
                "max": 79
              }
            }
          ]
        },
        {
          "type": "minecraft:loot_table",
          "value": "rctmod:generic/rare/medicine",
          "weight": 160,
          "conditions": [
            {
              "condition": "rctmod:level_range",
              "range": {
                "min": 60,
                "max": 79
              }
            }
          ]
        },
        {
          "type": "minecraft:loot_table",
          "value": "rctmod:generic/epic/medicine",
          "weight": 80,
          "conditions": [
            {
              "condition": "rctmod:level_range",
              "range": {
                "min": 60,
                "max": 79
              }
            }
          ]
        },
        {
          "type": "minecraft:loot_table",
          "value": "rctmod:generic/legendary/medicine",
          "weight": 8,
          "conditions": [
            {
              "condition": "rctmod:level_range",
              "range": {
                "min": 60,
                "max": 79
              }
            }
          ]
        },
        {
          "type": "minecraft:loot_table",
          "value": "rctmod:generic/common/medicine",
          "weight": 1000,
          "conditions": [
            {
              "condition": "rctmod:level_range",
              "range": {
                "min": 80,
                "max": 100
              }
            }
          ]
        },
        {
          "type": "minecraft:loot_table",
          "value": "rctmod:generic/uncommon/medicine",
          "weight": 500,
          "conditions": [
            {
              "condition": "rctmod:level_range",
              "range": {
                "min": 80,
                "max": 100
              }
            }
          ]
        },
        {
          "type": "minecraft:loot_table",
          "value": "rctmod:generic/rare/medicine",
          "weight": 200,
          "conditions": [
            {
              "condition": "rctmod:level_range",
              "range": {
                "min": 80,
                "max": 100
              }
            }
          ]
        },
        {
          "type": "minecraft:loot_table",
          "value": "rctmod:generic/epic/medicine",
          "weight": 100,
          "conditions": [
            {
              "condition": "rctmod:level_range",
              "range": {
                "min": 80,
                "max": 100
              }
            }
          ]
        },
        {
          "type": "minecraft:loot_table",
          "value": "rctmod:generic/legendary/medicine",
          "weight": 10,
          "conditions": [
            {
              "condition": "rctmod:level_range",
              "range": {
                "min": 80,
                "max": 100
              }
            }
          ]
        },
        {
          "type": "minecraft:loot_table",
          "value": "rctmod:generic/common/archeology",
          "weight": 1000,
          "conditions": [
            {
              "condition": "rctmod:level_range",
              "range": {
                "min": 0,
                "max": 19
              }
            }
          ]
        },
        {
          "type": "minecraft:loot_table",
          "value": "rctmod:generic/uncommon/archeology",
          "weight": 100,
          "conditions": [
            {
              "condition": "rctmod:level_range",
              "range": {
                "min": 0,
                "max": 19
              }
            }
          ]
        },
        {
          "type": "minecraft:loot_table",
          "value": "rctmod:generic/rare/archeology",
          "weight": 40,
          "conditions": [
            {
              "condition": "rctmod:level_range",
              "range": {
                "min": 0,
                "max": 19
              }
            }
          ]
        },
        {
          "type": "minecraft:loot_table",
          "value": "rctmod:generic/epic/archeology",
          "weight": 20,
          "conditions": [
            {
              "condition": "rctmod:level_range",
              "range": {
                "min": 0,
                "max": 19
              }
            }
          ]
        },
        {
          "type": "minecraft:loot_table",
          "value": "rctmod:generic/legendary/archeology",
          "weight": 2,
          "conditions": [
            {
              "condition": "rctmod:level_range",
              "range": {
                "min": 0,
                "max": 19
              }
            }
          ]
        },
        {
          "type": "minecraft:loot_table",
          "value": "rctmod:generic/common/archeology",
          "weight": 1000,
          "conditions": [
            {
              "condition": "rctmod:level_range",
              "range": {
                "min": 20,
                "max": 39
              }
            }
          ]
        },
        {
          "type": "minecraft:loot_table",
          "value": "rctmod:generic/uncommon/archeology",
          "weight": 200,
          "conditions": [
            {
              "condition": "rctmod:level_range",
              "range": {
                "min": 20,
                "max": 39
              }
            }
          ]
        },
        {
          "type": "minecraft:loot_table",
          "value": "rctmod:generic/rare/archeology",
          "weight": 80,
          "conditions": [
            {
              "condition": "rctmod:level_range",
              "range": {
                "min": 20,
                "max": 39
              }
            }
          ]
        },
        {
          "type": "minecraft:loot_table",
          "value": "rctmod:generic/epic/archeology",
          "weight": 40,
          "conditions": [
            {
              "condition": "rctmod:level_range",
              "range": {
                "min": 20,
                "max": 39
              }
            }
          ]
        },
        {
          "type": "minecraft:loot_table",
          "value": "rctmod:generic/legendary/archeology",
          "weight": 4,
          "conditions": [
            {
              "condition": "rctmod:level_range",
              "range": {
                "min": 20,
                "max": 39
              }
            }
          ]
        },
        {
          "type": "minecraft:loot_table",
          "value": "rctmod:generic/common/archeology",
          "weight": 1000,
          "conditions": [
            {
              "condition": "rctmod:level_range",
              "range": {
                "min": 40,
                "max": 59
              }
            }
          ]
        },
        {
          "type": "minecraft:loot_table",
          "value": "rctmod:generic/uncommon/archeology",
          "weight": 300,
          "conditions": [
            {
              "condition": "rctmod:level_range",
              "range": {
                "min": 40,
                "max": 59
              }
            }
          ]
        },
        {
          "type": "minecraft:loot_table",
          "value": "rctmod:generic/rare/archeology",
          "weight": 120,
          "conditions": [
            {
              "condition": "rctmod:level_range",
              "range": {
                "min": 40,
                "max": 59
              }
            }
          ]
        },
        {
          "type": "minecraft:loot_table",
          "value": "rctmod:generic/epic/archeology",
          "weight": 60,
          "conditions": [
            {
              "condition": "rctmod:level_range",
              "range": {
                "min": 40,
                "max": 59
              }
            }
          ]
        },
        {
          "type": "minecraft:loot_table",
          "value": "rctmod:generic/legendary/archeology",
          "weight": 6,
          "conditions": [
            {
              "condition": "rctmod:level_range",
              "range": {
                "min": 40,
                "max": 59
              }
            }
          ]
        },
        {
          "type": "minecraft:loot_table",
          "value": "rctmod:generic/common/archeology",
          "weight": 1000,
          "conditions": [
            {
              "condition": "rctmod:level_range",
              "range": {
                "min": 60,
                "max": 79
              }
            }
          ]
        },
        {
          "type": "minecraft:loot_table",
          "value": "rctmod:generic/uncommon/archeology",
          "weight": 400,
          "conditions": [
            {
              "condition": "rctmod:level_range",
              "range": {
                "min": 60,
                "max": 79
              }
            }
          ]
        },
        {
          "type": "minecraft:loot_table",
          "value": "rctmod:generic/rare/archeology",
          "weight": 160,
          "conditions": [
            {
              "condition": "rctmod:level_range",
              "range": {
                "min": 60,
                "max": 79
              }
            }
          ]
        },
        {
          "type": "minecraft:loot_table",
          "value": "rctmod:generic/epic/archeology",
          "weight": 80,
          "conditions": [
            {
              "condition": "rctmod:level_range",
              "range": {
                "min": 60,
                "max": 79
              }
            }
          ]
        },
        {
          "type": "minecraft:loot_table",
          "value": "rctmod:generic/legendary/archeology",
          "weight": 8,
          "conditions": [
            {
              "condition": "rctmod:level_range",
              "range": {
                "min": 60,
                "max": 79
              }
            }
          ]
        },
        {
          "type": "minecraft:loot_table",
          "value": "rctmod:generic/common/archeology",
          "weight": 1000,
          "conditions": [
            {
              "condition": "rctmod:level_range",
              "range": {
                "min": 80,
                "max": 100
              }
            }
          ]
        },
        {
          "type": "minecraft:loot_table",
          "value": "rctmod:generic/uncommon/archeology",
          "weight": 500,
          "conditions": [
            {
              "condition": "rctmod:level_range",
              "range": {
                "min": 80,
                "max": 100
              }
            }
          ]
        },
        {
          "type": "minecraft:loot_table",
          "value": "rctmod:generic/rare/archeology",
          "weight": 200,
          "conditions": [
            {
              "condition": "rctmod:level_range",
              "range": {
                "min": 80,
                "max": 100
              }
            }
          ]
        },
        {
          "type": "minecraft:loot_table",
          "value": "rctmod:generic/epic/archeology",
          "weight": 100,
          "conditions": [
            {
              "condition": "rctmod:level_range",
              "range": {
                "min": 80,
                "max": 100
              }
            }
          ]
        },
        {
          "type": "minecraft:loot_table",
          "value": "rctmod:generic/legendary/archeology",
          "weight": 10,
          "conditions": [
            {
              "condition": "rctmod:level_range",
              "range": {
                "min": 80,
                "max": 100
              }
            }
          ]
        }
      ]
    }
  ],
  "random_sequence": "rctmod:trainers/groups/friendly_thug"
}