{
  "type": "NORMAL",
  "maxTrainerWins": 5,
  "maxTrainerDefeats": 1,
  "battleCooldownTicks": 240,
  "spawnWeightFactor": 1.0,
  "biomeTagBlacklist": ["is_void", "is_nether", "is_end", "is_underground"],
  "biomeTagWhitelist": ["is_water"]
}