{
  "pools": [
    {
      "rolls": {
        "min": 1,
        "max": 1
      },
      "entries": [
        {
          "type": "minecraft:item",
          "name": "simpletms:tr_10000000voltthunderbolt"
        },
        {
          "type": "minecraft:item",
          "name": "simpletms:tr_absorb"
        },
        {
          "type": "minecraft:item",
          "name": "simpletms:tr_accelerock"
        },
        {
          "type": "minecraft:item",
          "name": "simpletms:tr_acid"
        },
        {
          "type": "minecraft:item",
          "name": "simpletms:tr_acidarmor"
        },
        {
          "type": "minecraft:item",
          "name": "simpletms:tr_aciddownpour"
        },
        {
          "type": "minecraft:item",
          "name": "simpletms:tr_acidspray"
        },
        {
          "type": "minecraft:item",
          "name": "simpletms:tr_acrobatics"
        },
        {
          "type": "minecraft:item",
          "name": "simpletms:tr_acupressure"
        },
        {
          "type": "minecraft:item",
          "name": "simpletms:tr_aerialace"
        },
        {
          "type": "minecraft:item",
          "name": "simpletms:tr_aeroblast"
        },
        {
          "type": "minecraft:item",
          "name": "simpletms:tr_afteryou"
        },
        {
          "type": "minecraft:item",
          "name": "simpletms:tr_agility"
        },
        {
          "type": "minecraft:item",
          "name": "simpletms:tr_aircutter"
        },
        {
          "type": "minecraft:item",
          "name": "simpletms:tr_airslash"
        },
        {
          "type": "minecraft:item",
          "name": "simpletms:tr_alloutpummeling"
        },
        {
          "type": "minecraft:item",
          "name": "simpletms:tr_allyswitch"
        },
        {
          "type": "minecraft:item",
          "name": "simpletms:tr_amnesia"
        },
        {
          "type": "minecraft:item",
          "name": "simpletms:tr_anchorshot"
        },
        {
          "type": "minecraft:item",
          "name": "simpletms:tr_ancientpower"
        },
        {
          "type": "minecraft:item",
          "name": "simpletms:tr_appleacid"
        },
        {
          "type": "minecraft:item",
          "name": "simpletms:tr_aquacutter"
        },
        {
          "type": "minecraft:item",
          "name": "simpletms:tr_aquajet"
        },
        {
          "type": "minecraft:item",
          "name": "simpletms:tr_aquaring"
        },
        {
          "type": "minecraft:item",
          "name": "simpletms:tr_aquastep"
        },
        {
          "type": "minecraft:item",
          "name": "simpletms:tr_aquatail"
        },
        {
          "type": "minecraft:item",
          "name": "simpletms:tr_armorcannon"
        },
        {
          "type": "minecraft:item",
          "name": "simpletms:tr_armthrust"
        },
        {
          "type": "minecraft:item",
          "name": "simpletms:tr_aromatherapy"
        },
        {
          "type": "minecraft:item",
          "name": "simpletms:tr_aromaticmist"
        },
        {
          "type": "minecraft:item",
          "name": "simpletms:tr_assist"
        },
        {
          "type": "minecraft:item",
          "name": "simpletms:tr_assurance"
        },
        {
          "type": "minecraft:item",
          "name": "simpletms:tr_astonish"
        },
        {
          "type": "minecraft:item",
          "name": "simpletms:tr_astralbarrage"
        },
        {
          "type": "minecraft:item",
          "name": "simpletms:tr_attackorder"
        },
        {
          "type": "minecraft:item",
          "name": "simpletms:tr_attract"
        },
        {
          "type": "minecraft:item",
          "name": "simpletms:tr_aurasphere"
        },
        {
          "type": "minecraft:item",
          "name": "simpletms:tr_aurawheel"
        },
        {
          "type": "minecraft:item",
          "name": "simpletms:tr_aurorabeam"
        },
        {
          "type": "minecraft:item",
          "name": "simpletms:tr_auroraveil"
        },
        {
          "type": "minecraft:item",
          "name": "simpletms:tr_autotomize"
        },
        {
          "type": "minecraft:item",
          "name": "simpletms:tr_avalanche"
        },
        {
          "type": "minecraft:item",
          "name": "simpletms:tr_axekick"
        },
        {
          "type": "minecraft:item",
          "name": "simpletms:tr_babydolleyes"
        },
        {
          "type": "minecraft:item",
          "name": "simpletms:tr_baddybad"
        },
        {
          "type": "minecraft:item",
          "name": "simpletms:tr_banefulbunker"
        },
        {
          "type": "minecraft:item",
          "name": "simpletms:tr_barbbarrage"
        },
        {
          "type": "minecraft:item",
          "name": "simpletms:tr_barrage"
        },
        {
          "type": "minecraft:item",
          "name": "simpletms:tr_barrier"
        },
        {
          "type": "minecraft:item",
          "name": "simpletms:tr_batonpass"
        },
        {
          "type": "minecraft:item",
          "name": "simpletms:tr_beakblast"
        },
        {
          "type": "minecraft:item",
          "name": "simpletms:tr_beatup"
        },
        {
          "type": "minecraft:item",
          "name": "simpletms:tr_behemothbash"
        },
        {
          "type": "minecraft:item",
          "name": "simpletms:tr_behemothblade"
        },
        {
          "type": "minecraft:item",
          "name": "simpletms:tr_belch"
        },
        {
          "type": "minecraft:item",
          "name": "simpletms:tr_bellydrum"
        },
        {
          "type": "minecraft:item",
          "name": "simpletms:tr_bestow"
        },
        {
          "type": "minecraft:item",
          "name": "simpletms:tr_bide"
        },
        {
          "type": "minecraft:item",
          "name": "simpletms:tr_bind"
        },
        {
          "type": "minecraft:item",
          "name": "simpletms:tr_bite"
        },
        {
          "type": "minecraft:item",
          "name": "simpletms:tr_bitterblade"
        },
        {
          "type": "minecraft:item",
          "name": "simpletms:tr_bittermalice"
        },
        {
          "type": "minecraft:item",
          "name": "simpletms:tr_blackholeeclipse"
        },
        {
          "type": "minecraft:item",
          "name": "simpletms:tr_blastburn"
        },
        {
          "type": "minecraft:item",
          "name": "simpletms:tr_blazekick"
        },
        {
          "type": "minecraft:item",
          "name": "simpletms:tr_blazingtorque"
        },
        {
          "type": "minecraft:item",
          "name": "simpletms:tr_bleakwindstorm"
        },
        {
          "type": "minecraft:item",
          "name": "simpletms:tr_blizzard"
        },
        {
          "type": "minecraft:item",
          "name": "simpletms:tr_block"
        },
        {
          "type": "minecraft:item",
          "name": "simpletms:tr_bloomdoom"
        },
        {
          "type": "minecraft:item",
          "name": "simpletms:tr_blueflare"
        },
        {
          "type": "minecraft:item",
          "name": "simpletms:tr_bodypress"
        },
        {
          "type": "minecraft:item",
          "name": "simpletms:tr_bodyslam"
        },
        {
          "type": "minecraft:item",
          "name": "simpletms:tr_boltbeak"
        },
        {
          "type": "minecraft:item",
          "name": "simpletms:tr_boltstrike"
        },
        {
          "type": "minecraft:item",
          "name": "simpletms:tr_boneclub"
        },
        {
          "type": "minecraft:item",
          "name": "simpletms:tr_bonemerang"
        },
        {
          "type": "minecraft:item",
          "name": "simpletms:tr_bonerush"
        },
        {
          "type": "minecraft:item",
          "name": "simpletms:tr_boomburst"
        },
        {
          "type": "minecraft:item",
          "name": "simpletms:tr_bounce"
        },
        {
          "type": "minecraft:item",
          "name": "simpletms:tr_bouncybubble"
        },
        {
          "type": "minecraft:item",
          "name": "simpletms:tr_branchpoke"
        },
        {
          "type": "minecraft:item",
          "name": "simpletms:tr_bravebird"
        },
        {
          "type": "minecraft:item",
          "name": "simpletms:tr_breakingswipe"
        },
        {
          "type": "minecraft:item",
          "name": "simpletms:tr_breakneckblitz"
        },
        {
          "type": "minecraft:item",
          "name": "simpletms:tr_brickbreak"
        },
        {
          "type": "minecraft:item",
          "name": "simpletms:tr_brine"
        },
        {
          "type": "minecraft:item",
          "name": "simpletms:tr_brutalswing"
        },
        {
          "type": "minecraft:item",
          "name": "simpletms:tr_bubble"
        },
        {
          "type": "minecraft:item",
          "name": "simpletms:tr_bubblebeam"
        },
        {
          "type": "minecraft:item",
          "name": "simpletms:tr_bugbite"
        },
        {
          "type": "minecraft:item",
          "name": "simpletms:tr_bugbuzz"
        },
        {
          "type": "minecraft:item",
          "name": "simpletms:tr_bulkup"
        },
        {
          "type": "minecraft:item",
          "name": "simpletms:tr_bulldoze"
        },
        {
          "type": "minecraft:item",
          "name": "simpletms:tr_bulletpunch"
        },
        {
          "type": "minecraft:item",
          "name": "simpletms:tr_bulletseed"
        },
        {
          "type": "minecraft:item",
          "name": "simpletms:tr_burningjealousy"
        },
        {
          "type": "minecraft:item",
          "name": "simpletms:tr_burnup"
        },
        {
          "type": "minecraft:item",
          "name": "simpletms:tr_buzzybuzz"
        },
        {
          "type": "minecraft:item",
          "name": "simpletms:tr_calmmind"
        },
        {
          "type": "minecraft:item",
          "name": "simpletms:tr_camouflage"
        },
        {
          "type": "minecraft:item",
          "name": "simpletms:tr_captivate"
        },
        {
          "type": "minecraft:item",
          "name": "simpletms:tr_catastropika"
        },
        {
          "type": "minecraft:item",
          "name": "simpletms:tr_ceaselessedge"
        },
        {
          "type": "minecraft:item",
          "name": "simpletms:tr_celebrate"
        },
        {
          "type": "minecraft:item",
          "name": "simpletms:tr_charge"
        },
        {
          "type": "minecraft:item",
          "name": "simpletms:tr_chargebeam"
        },
        {
          "type": "minecraft:item",
          "name": "simpletms:tr_charm"
        },
        {
          "type": "minecraft:item",
          "name": "simpletms:tr_chatter"
        },
        {
          "type": "minecraft:item",
          "name": "simpletms:tr_chillingwater"
        },
        {
          "type": "minecraft:item",
          "name": "simpletms:tr_chillyreception"
        },
        {
          "type": "minecraft:item",
          "name": "simpletms:tr_chipaway"
        },
        {
          "type": "minecraft:item",
          "name": "simpletms:tr_chloroblast"
        },
        {
          "type": "minecraft:item",
          "name": "simpletms:tr_circlethrow"
        },
        {
          "type": "minecraft:item",
          "name": "simpletms:tr_clamp"
        },
        {
          "type": "minecraft:item",
          "name": "simpletms:tr_clangingscales"
        },
        {
          "type": "minecraft:item",
          "name": "simpletms:tr_clangoroussoul"
        },
        {
          "type": "minecraft:item",
          "name": "simpletms:tr_clangoroussoulblaze"
        },
        {
          "type": "minecraft:item",
          "name": "simpletms:tr_clearsmog"
        },
        {
          "type": "minecraft:item",
          "name": "simpletms:tr_closecombat"
        },
        {
          "type": "minecraft:item",
          "name": "simpletms:tr_coaching"
        },
        {
          "type": "minecraft:item",
          "name": "simpletms:tr_coil"
        },
        {
          "type": "minecraft:item",
          "name": "simpletms:tr_collisioncourse"
        },
        {
          "type": "minecraft:item",
          "name": "simpletms:tr_combattorque"
        },
        {
          "type": "minecraft:item",
          "name": "simpletms:tr_cometpunch"
        },
        {
          "type": "minecraft:item",
          "name": "simpletms:tr_comeuppance"
        },
        {
          "type": "minecraft:item",
          "name": "simpletms:tr_confide"
        },
        {
          "type": "minecraft:item",
          "name": "simpletms:tr_confuseray"
        },
        {
          "type": "minecraft:item",
          "name": "simpletms:tr_confusion"
        },
        {
          "type": "minecraft:item",
          "name": "simpletms:tr_constrict"
        },
        {
          "type": "minecraft:item",
          "name": "simpletms:tr_continentalcrush"
        },
        {
          "type": "minecraft:item",
          "name": "simpletms:tr_conversion"
        },
        {
          "type": "minecraft:item",
          "name": "simpletms:tr_conversion2"
        },
        {
          "type": "minecraft:item",
          "name": "simpletms:tr_copycat"
        },
        {
          "type": "minecraft:item",
          "name": "simpletms:tr_coreenforcer"
        },
        {
          "type": "minecraft:item",
          "name": "simpletms:tr_corkscrewcrash"
        },
        {
          "type": "minecraft:item",
          "name": "simpletms:tr_corrosivegas"
        },
        {
          "type": "minecraft:item",
          "name": "simpletms:tr_cosmicpower"
        },
        {
          "type": "minecraft:item",
          "name": "simpletms:tr_cottonguard"
        },
        {
          "type": "minecraft:item",
          "name": "simpletms:tr_cottonspore"
        },
        {
          "type": "minecraft:item",
          "name": "simpletms:tr_counter"
        },
        {
          "type": "minecraft:item",
          "name": "simpletms:tr_courtchange"
        },
        {
          "type": "minecraft:item",
          "name": "simpletms:tr_covet"
        },
        {
          "type": "minecraft:item",
          "name": "simpletms:tr_crabhammer"
        },
        {
          "type": "minecraft:item",
          "name": "simpletms:tr_craftyshield"
        },
        {
          "type": "minecraft:item",
          "name": "simpletms:tr_crosschop"
        },
        {
          "type": "minecraft:item",
          "name": "simpletms:tr_crosspoison"
        },
        {
          "type": "minecraft:item",
          "name": "simpletms:tr_crunch"
        },
        {
          "type": "minecraft:item",
          "name": "simpletms:tr_crushclaw"
        },
        {
          "type": "minecraft:item",
          "name": "simpletms:tr_crushgrip"
        },
        {
          "type": "minecraft:item",
          "name": "simpletms:tr_curse"
        },
        {
          "type": "minecraft:item",
          "name": "simpletms:tr_cut"
        },
        {
          "type": "minecraft:item",
          "name": "simpletms:tr_darkestlariat"
        },
        {
          "type": "minecraft:item",
          "name": "simpletms:tr_darkpulse"
        },
        {
          "type": "minecraft:item",
          "name": "simpletms:tr_darkvoid"
        },
        {
          "type": "minecraft:item",
          "name": "simpletms:tr_dazzlinggleam"
        },
        {
          "type": "minecraft:item",
          "name": "simpletms:tr_decorate"
        },
        {
          "type": "minecraft:item",
          "name": "simpletms:tr_defendorder"
        },
        {
          "type": "minecraft:item",
          "name": "simpletms:tr_defensecurl"
        },
        {
          "type": "minecraft:item",
          "name": "simpletms:tr_defog"
        },
        {
          "type": "minecraft:item",
          "name": "simpletms:tr_destinybond"
        },
        {
          "type": "minecraft:item",
          "name": "simpletms:tr_detect"
        },
        {
          "type": "minecraft:item",
          "name": "simpletms:tr_devastatingdrake"
        },
        {
          "type": "minecraft:item",
          "name": "simpletms:tr_diamondstorm"
        },
        {
          "type": "minecraft:item",
          "name": "simpletms:tr_dig"
        },
        {
          "type": "minecraft:item",
          "name": "simpletms:tr_disable"
        },
        {
          "type": "minecraft:item",
          "name": "simpletms:tr_disarmingvoice"
        },
        {
          "type": "minecraft:item",
          "name": "simpletms:tr_discharge"
        },
        {
          "type": "minecraft:item",
          "name": "simpletms:tr_direclaw"
        },
        {
          "type": "minecraft:item",
          "name": "simpletms:tr_dive"
        },
        {
          "type": "minecraft:item",
          "name": "simpletms:tr_dizzypunch"
        },
        {
          "type": "minecraft:item",
          "name": "simpletms:tr_doodle"
        },
        {
          "type": "minecraft:item",
          "name": "simpletms:tr_doomdesire"
        },
        {
          "type": "minecraft:item",
          "name": "simpletms:tr_doubleedge"
        },
        {
          "type": "minecraft:item",
          "name": "simpletms:tr_doublehit"
        },
        {
          "type": "minecraft:item",
          "name": "simpletms:tr_doubleironbash"
        },
        {
          "type": "minecraft:item",
          "name": "simpletms:tr_doublekick"
        },
        {
          "type": "minecraft:item",
          "name": "simpletms:tr_doubleshock"
        },
        {
          "type": "minecraft:item",
          "name": "simpletms:tr_doubleslap"
        },
        {
          "type": "minecraft:item",
          "name": "simpletms:tr_doubleteam"
        },
        {
          "type": "minecraft:item",
          "name": "simpletms:tr_dracometeor"
        },
        {
          "type": "minecraft:item",
          "name": "simpletms:tr_dragonascent"
        },
        {
          "type": "minecraft:item",
          "name": "simpletms:tr_dragonbreath"
        },
        {
          "type": "minecraft:item",
          "name": "simpletms:tr_dragonclaw"
        },
        {
          "type": "minecraft:item",
          "name": "simpletms:tr_dragondance"
        },
        {
          "type": "minecraft:item",
          "name": "simpletms:tr_dragondarts"
        },
        {
          "type": "minecraft:item",
          "name": "simpletms:tr_dragonenergy"
        },
        {
          "type": "minecraft:item",
          "name": "simpletms:tr_dragonhammer"
        },
        {
          "type": "minecraft:item",
          "name": "simpletms:tr_dragonpulse"
        },
        {
          "type": "minecraft:item",
          "name": "simpletms:tr_dragonrage"
        },
        {
          "type": "minecraft:item",
          "name": "simpletms:tr_dragonrush"
        },
        {
          "type": "minecraft:item",
          "name": "simpletms:tr_dragontail"
        },
        {
          "type": "minecraft:item",
          "name": "simpletms:tr_drainingkiss"
        },
        {
          "type": "minecraft:item",
          "name": "simpletms:tr_drainpunch"
        },
        {
          "type": "minecraft:item",
          "name": "simpletms:tr_dreameater"
        },
        {
          "type": "minecraft:item",
          "name": "simpletms:tr_drillpeck"
        },
        {
          "type": "minecraft:item",
          "name": "simpletms:tr_drillrun"
        },
        {
          "type": "minecraft:item",
          "name": "simpletms:tr_drumbeating"
        },
        {
          "type": "minecraft:item",
          "name": "simpletms:tr_dualchop"
        },
        {
          "type": "minecraft:item",
          "name": "simpletms:tr_dualwingbeat"
        },
        {
          "type": "minecraft:item",
          "name": "simpletms:tr_dynamaxcannon"
        },
        {
          "type": "minecraft:item",
          "name": "simpletms:tr_dynamicpunch"
        },
        {
          "type": "minecraft:item",
          "name": "simpletms:tr_earthpower"
        },
        {
          "type": "minecraft:item",
          "name": "simpletms:tr_earthquake"
        },
        {
          "type": "minecraft:item",
          "name": "simpletms:tr_echoedvoice"
        },
        {
          "type": "minecraft:item",
          "name": "simpletms:tr_eerieimpulse"
        },
        {
          "type": "minecraft:item",
          "name": "simpletms:tr_eeriespell"
        },
        {
          "type": "minecraft:item",
          "name": "simpletms:tr_eggbomb"
        },
        {
          "type": "minecraft:item",
          "name": "simpletms:tr_electricterrain"
        },
        {
          "type": "minecraft:item",
          "name": "simpletms:tr_electrify"
        },
        {
          "type": "minecraft:item",
          "name": "simpletms:tr_electroball"
        },
        {
          "type": "minecraft:item",
          "name": "simpletms:tr_electrodrift"
        },
        {
          "type": "minecraft:item",
          "name": "simpletms:tr_electroweb"
        },
        {
          "type": "minecraft:item",
          "name": "simpletms:tr_embargo"
        },
        {
          "type": "minecraft:item",
          "name": "simpletms:tr_ember"
        },
        {
          "type": "minecraft:item",
          "name": "simpletms:tr_encore"
        },
        {
          "type": "minecraft:item",
          "name": "simpletms:tr_endeavor"
        },
        {
          "type": "minecraft:item",
          "name": "simpletms:tr_endure"
        },
        {
          "type": "minecraft:item",
          "name": "simpletms:tr_energyball"
        },
        {
          "type": "minecraft:item",
          "name": "simpletms:tr_entrainment"
        },
        {
          "type": "minecraft:item",
          "name": "simpletms:tr_eruption"
        },
        {
          "type": "minecraft:item",
          "name": "simpletms:tr_esperwing"
        },
        {
          "type": "minecraft:item",
          "name": "simpletms:tr_eternabeam"
        },
        {
          "type": "minecraft:item",
          "name": "simpletms:tr_expandingforce"
        },
        {
          "type": "minecraft:item",
          "name": "simpletms:tr_explosion"
        },
        {
          "type": "minecraft:item",
          "name": "simpletms:tr_extrasensory"
        },
        {
          "type": "minecraft:item",
          "name": "simpletms:tr_extremeevoboost"
        },
        {
          "type": "minecraft:item",
          "name": "simpletms:tr_extremespeed"
        },
        {
          "type": "minecraft:item",
          "name": "simpletms:tr_facade"
        },
        {
          "type": "minecraft:item",
          "name": "simpletms:tr_fairylock"
        },
        {
          "type": "minecraft:item",
          "name": "simpletms:tr_fairywind"
        },
        {
          "type": "minecraft:item",
          "name": "simpletms:tr_fakeout"
        },
        {
          "type": "minecraft:item",
          "name": "simpletms:tr_faketears"
        },
        {
          "type": "minecraft:item",
          "name": "simpletms:tr_falsesurrender"
        },
        {
          "type": "minecraft:item",
          "name": "simpletms:tr_falseswipe"
        },
        {
          "type": "minecraft:item",
          "name": "simpletms:tr_featherdance"
        },
        {
          "type": "minecraft:item",
          "name": "simpletms:tr_feint"
        },
        {
          "type": "minecraft:item",
          "name": "simpletms:tr_feintattack"
        },
        {
          "type": "minecraft:item",
          "name": "simpletms:tr_fellstinger"
        },
        {
          "type": "minecraft:item",
          "name": "simpletms:tr_fierydance"
        },
        {
          "type": "minecraft:item",
          "name": "simpletms:tr_fierywrath"
        },
        {
          "type": "minecraft:item",
          "name": "simpletms:tr_filletaway"
        },
        {
          "type": "minecraft:item",
          "name": "simpletms:tr_finalgambit"
        },
        {
          "type": "minecraft:item",
          "name": "simpletms:tr_fireblast"
        },
        {
          "type": "minecraft:item",
          "name": "simpletms:tr_firefang"
        },
        {
          "type": "minecraft:item",
          "name": "simpletms:tr_firelash"
        },
        {
          "type": "minecraft:item",
          "name": "simpletms:tr_firepledge"
        },
        {
          "type": "minecraft:item",
          "name": "simpletms:tr_firepunch"
        },
        {
          "type": "minecraft:item",
          "name": "simpletms:tr_firespin"
        },
        {
          "type": "minecraft:item",
          "name": "simpletms:tr_firstimpression"
        },
        {
          "type": "minecraft:item",
          "name": "simpletms:tr_fishiousrend"
        },
        {
          "type": "minecraft:item",
          "name": "simpletms:tr_fissure"
        },
        {
          "type": "minecraft:item",
          "name": "simpletms:tr_flail"
        },
        {
          "type": "minecraft:item",
          "name": "simpletms:tr_flameburst"
        },
        {
          "type": "minecraft:item",
          "name": "simpletms:tr_flamecharge"
        },
        {
          "type": "minecraft:item",
          "name": "simpletms:tr_flamewheel"
        },
        {
          "type": "minecraft:item",
          "name": "simpletms:tr_flamethrower"
        },
        {
          "type": "minecraft:item",
          "name": "simpletms:tr_flareblitz"
        },
        {
          "type": "minecraft:item",
          "name": "simpletms:tr_flash"
        },
        {
          "type": "minecraft:item",
          "name": "simpletms:tr_flashcannon"
        },
        {
          "type": "minecraft:item",
          "name": "simpletms:tr_flatter"
        },
        {
          "type": "minecraft:item",
          "name": "simpletms:tr_fleurcannon"
        },
        {
          "type": "minecraft:item",
          "name": "simpletms:tr_fling"
        },
        {
          "type": "minecraft:item",
          "name": "simpletms:tr_flipturn"
        },
        {
          "type": "minecraft:item",
          "name": "simpletms:tr_floatyfall"
        },
        {
          "type": "minecraft:item",
          "name": "simpletms:tr_floralhealing"
        },
        {
          "type": "minecraft:item",
          "name": "simpletms:tr_flowershield"
        },
        {
          "type": "minecraft:item",
          "name": "simpletms:tr_flowertrick"
        },
        {
          "type": "minecraft:item",
          "name": "simpletms:tr_fly"
        },
        {
          "type": "minecraft:item",
          "name": "simpletms:tr_flyingpress"
        },
        {
          "type": "minecraft:item",
          "name": "simpletms:tr_focusblast"
        },
        {
          "type": "minecraft:item",
          "name": "simpletms:tr_focusenergy"
        },
        {
          "type": "minecraft:item",
          "name": "simpletms:tr_focuspunch"
        },
        {
          "type": "minecraft:item",
          "name": "simpletms:tr_followme"
        },
        {
          "type": "minecraft:item",
          "name": "simpletms:tr_forcepalm"
        },
        {
          "type": "minecraft:item",
          "name": "simpletms:tr_foresight"
        },
        {
          "type": "minecraft:item",
          "name": "simpletms:tr_forestscurse"
        },
        {
          "type": "minecraft:item",
          "name": "simpletms:tr_foulplay"
        },
        {
          "type": "minecraft:item",
          "name": "simpletms:tr_freezedry"
        },
        {
          "type": "minecraft:item",
          "name": "simpletms:tr_freezeshock"
        },
        {
          "type": "minecraft:item",
          "name": "simpletms:tr_freezingglare"
        },
        {
          "type": "minecraft:item",
          "name": "simpletms:tr_freezyfrost"
        },
        {
          "type": "minecraft:item",
          "name": "simpletms:tr_frenzyplant"
        },
        {
          "type": "minecraft:item",
          "name": "simpletms:tr_frostbreath"
        },
        {
          "type": "minecraft:item",
          "name": "simpletms:tr_frustration"
        },
        {
          "type": "minecraft:item",
          "name": "simpletms:tr_furyattack"
        },
        {
          "type": "minecraft:item",
          "name": "simpletms:tr_furycutter"
        },
        {
          "type": "minecraft:item",
          "name": "simpletms:tr_furyswipes"
        },
        {
          "type": "minecraft:item",
          "name": "simpletms:tr_fusionbolt"
        },
        {
          "type": "minecraft:item",
          "name": "simpletms:tr_fusionflare"
        },
        {
          "type": "minecraft:item",
          "name": "simpletms:tr_futuresight"
        },
        {
          "type": "minecraft:item",
          "name": "simpletms:tr_gastroacid"
        },
        {
          "type": "minecraft:item",
          "name": "simpletms:tr_geargrind"
        },
        {
          "type": "minecraft:item",
          "name": "simpletms:tr_gearup"
        },
        {
          "type": "minecraft:item",
          "name": "simpletms:tr_genesissupernova"
        },
        {
          "type": "minecraft:item",
          "name": "simpletms:tr_geomancy"
        },
        {
          "type": "minecraft:item",
          "name": "simpletms:tr_gigadrain"
        },
        {
          "type": "minecraft:item",
          "name": "simpletms:tr_gigaimpact"
        },
        {
          "type": "minecraft:item",
          "name": "simpletms:tr_gigatonhammer"
        },
        {
          "type": "minecraft:item",
          "name": "simpletms:tr_gigavolthavoc"
        },
        {
          "type": "minecraft:item",
          "name": "simpletms:tr_glaciallance"
        },
        {
          "type": "minecraft:item",
          "name": "simpletms:tr_glaciate"
        },
        {
          "type": "minecraft:item",
          "name": "simpletms:tr_glaiverush"
        },
        {
          "type": "minecraft:item",
          "name": "simpletms:tr_glare"
        },
        {
          "type": "minecraft:item",
          "name": "simpletms:tr_glitzyglow"
        },
        {
          "type": "minecraft:item",
          "name": "simpletms:tr_gmaxbefuddle"
        },
        {
          "type": "minecraft:item",
          "name": "simpletms:tr_gmaxcannonade"
        },
        {
          "type": "minecraft:item",
          "name": "simpletms:tr_gmaxcentiferno"
        },
        {
          "type": "minecraft:item",
          "name": "simpletms:tr_gmaxchistrike"
        },
        {
          "type": "minecraft:item",
          "name": "simpletms:tr_gmaxcuddle"
        },
        {
          "type": "minecraft:item",
          "name": "simpletms:tr_gmaxdepletion"
        },
        {
          "type": "minecraft:item",
          "name": "simpletms:tr_gmaxdrumsolo"
        },
        {
          "type": "minecraft:item",
          "name": "simpletms:tr_gmaxfinale"
        },
        {
          "type": "minecraft:item",
          "name": "simpletms:tr_gmaxfireball"
        },
        {
          "type": "minecraft:item",
          "name": "simpletms:tr_gmaxfoamburst"
        },
        {
          "type": "minecraft:item",
          "name": "simpletms:tr_gmaxgoldrush"
        },
        {
          "type": "minecraft:item",
          "name": "simpletms:tr_gmaxgravitas"
        },
        {
          "type": "minecraft:item",
          "name": "simpletms:tr_gmaxhydrosnipe"
        },
        {
          "type": "minecraft:item",
          "name": "simpletms:tr_gmaxmalodor"
        },
        {
          "type": "minecraft:item",
          "name": "simpletms:tr_gmaxmeltdown"
        },
        {
          "type": "minecraft:item",
          "name": "simpletms:tr_gmaxoneblow"
        },
        {
          "type": "minecraft:item",
          "name": "simpletms:tr_gmaxrapidflow"
        },
        {
          "type": "minecraft:item",
          "name": "simpletms:tr_gmaxreplenish"
        },
        {
          "type": "minecraft:item",
          "name": "simpletms:tr_gmaxresonance"
        },
        {
          "type": "minecraft:item",
          "name": "simpletms:tr_gmaxsandblast"
        },
        {
          "type": "minecraft:item",
          "name": "simpletms:tr_gmaxsmite"
        },
        {
          "type": "minecraft:item",
          "name": "simpletms:tr_gmaxsnooze"
        },
        {
          "type": "minecraft:item",
          "name": "simpletms:tr_gmaxsteelsurge"
        },
        {
          "type": "minecraft:item",
          "name": "simpletms:tr_gmaxstonesurge"
        },
        {
          "type": "minecraft:item",
          "name": "simpletms:tr_gmaxstunshock"
        },
        {
          "type": "minecraft:item",
          "name": "simpletms:tr_gmaxsweetness"
        },
        {
          "type": "minecraft:item",
          "name": "simpletms:tr_gmaxtartness"
        },
        {
          "type": "minecraft:item",
          "name": "simpletms:tr_gmaxterror"
        },
        {
          "type": "minecraft:item",
          "name": "simpletms:tr_gmaxvinelash"
        },
        {
          "type": "minecraft:item",
          "name": "simpletms:tr_gmaxvolcalith"
        },
        {
          "type": "minecraft:item",
          "name": "simpletms:tr_gmaxvoltcrash"
        },
        {
          "type": "minecraft:item",
          "name": "simpletms:tr_gmaxwildfire"
        },
        {
          "type": "minecraft:item",
          "name": "simpletms:tr_gmaxwindrage"
        },
        {
          "type": "minecraft:item",
          "name": "simpletms:tr_grassknot"
        },
        {
          "type": "minecraft:item",
          "name": "simpletms:tr_grasspledge"
        },
        {
          "type": "minecraft:item",
          "name": "simpletms:tr_grasswhistle"
        },
        {
          "type": "minecraft:item",
          "name": "simpletms:tr_grassyglide"
        },
        {
          "type": "minecraft:item",
          "name": "simpletms:tr_grassyterrain"
        },
        {
          "type": "minecraft:item",
          "name": "simpletms:tr_gravapple"
        },
        {
          "type": "minecraft:item",
          "name": "simpletms:tr_gravity"
        },
        {
          "type": "minecraft:item",
          "name": "simpletms:tr_growl"
        },
        {
          "type": "minecraft:item",
          "name": "simpletms:tr_growth"
        },
        {
          "type": "minecraft:item",
          "name": "simpletms:tr_grudge"
        },
        {
          "type": "minecraft:item",
          "name": "simpletms:tr_guardianofalola"
        },
        {
          "type": "minecraft:item",
          "name": "simpletms:tr_guardsplit"
        },
        {
          "type": "minecraft:item",
          "name": "simpletms:tr_guardswap"
        },
        {
          "type": "minecraft:item",
          "name": "simpletms:tr_guillotine"
        },
        {
          "type": "minecraft:item",
          "name": "simpletms:tr_gunkshot"
        },
        {
          "type": "minecraft:item",
          "name": "simpletms:tr_gust"
        },
        {
          "type": "minecraft:item",
          "name": "simpletms:tr_gyroball"
        },
        {
          "type": "minecraft:item",
          "name": "simpletms:tr_hail"
        },
        {
          "type": "minecraft:item",
          "name": "simpletms:tr_hammerarm"
        },
        {
          "type": "minecraft:item",
          "name": "simpletms:tr_happyhour"
        },
        {
          "type": "minecraft:item",
          "name": "simpletms:tr_harden"
        },
        {
          "type": "minecraft:item",
          "name": "simpletms:tr_haze"
        },
        {
          "type": "minecraft:item",
          "name": "simpletms:tr_headbutt"
        },
        {
          "type": "minecraft:item",
          "name": "simpletms:tr_headcharge"
        },
        {
          "type": "minecraft:item",
          "name": "simpletms:tr_headlongrush"
        },
        {
          "type": "minecraft:item",
          "name": "simpletms:tr_headsmash"
        },
        {
          "type": "minecraft:item",
          "name": "simpletms:tr_healbell"
        },
        {
          "type": "minecraft:item",
          "name": "simpletms:tr_healblock"
        },
        {
          "type": "minecraft:item",
          "name": "simpletms:tr_healingwish"
        },
        {
          "type": "minecraft:item",
          "name": "simpletms:tr_healorder"
        },
        {
          "type": "minecraft:item",
          "name": "simpletms:tr_healpulse"
        },
        {
          "type": "minecraft:item",
          "name": "simpletms:tr_heartstamp"
        },
        {
          "type": "minecraft:item",
          "name": "simpletms:tr_heartswap"
        },
        {
          "type": "minecraft:item",
          "name": "simpletms:tr_heatcrash"
        },
        {
          "type": "minecraft:item",
          "name": "simpletms:tr_heatwave"
        },
        {
          "type": "minecraft:item",
          "name": "simpletms:tr_heavyslam"
        },
        {
          "type": "minecraft:item",
          "name": "simpletms:tr_helpinghand"
        },
        {
          "type": "minecraft:item",
          "name": "simpletms:tr_hex"
        },
        {
          "type": "minecraft:item",
          "name": "simpletms:tr_hiddenpower"
        },
        {
          "type": "minecraft:item",
          "name": "simpletms:tr_highhorsepower"
        },
        {
          "type": "minecraft:item",
          "name": "simpletms:tr_highjumpkick"
        },
        {
          "type": "minecraft:item",
          "name": "simpletms:tr_holdback"
        },
        {
          "type": "minecraft:item",
          "name": "simpletms:tr_holdhands"
        },
        {
          "type": "minecraft:item",
          "name": "simpletms:tr_honeclaws"
        },
        {
          "type": "minecraft:item",
          "name": "simpletms:tr_hornattack"
        },
        {
          "type": "minecraft:item",
          "name": "simpletms:tr_horndrill"
        },
        {
          "type": "minecraft:item",
          "name": "simpletms:tr_hornleech"
        },
        {
          "type": "minecraft:item",
          "name": "simpletms:tr_howl"
        },
        {
          "type": "minecraft:item",
          "name": "simpletms:tr_hurricane"
        },
        {
          "type": "minecraft:item",
          "name": "simpletms:tr_hydrocannon"
        },
        {
          "type": "minecraft:item",
          "name": "simpletms:tr_hydropump"
        },
        {
          "type": "minecraft:item",
          "name": "simpletms:tr_hydrosteam"
        },
        {
          "type": "minecraft:item",
          "name": "simpletms:tr_hydrovortex"
        },
        {
          "type": "minecraft:item",
          "name": "simpletms:tr_hyperbeam"
        },
        {
          "type": "minecraft:item",
          "name": "simpletms:tr_hyperdrill"
        },
        {
          "type": "minecraft:item",
          "name": "simpletms:tr_hyperfang"
        },
        {
          "type": "minecraft:item",
          "name": "simpletms:tr_hyperspacefury"
        },
        {
          "type": "minecraft:item",
          "name": "simpletms:tr_hyperspacehole"
        },
        {
          "type": "minecraft:item",
          "name": "simpletms:tr_hypervoice"
        },
        {
          "type": "minecraft:item",
          "name": "simpletms:tr_hypnosis"
        },
        {
          "type": "minecraft:item",
          "name": "simpletms:tr_iceball"
        },
        {
          "type": "minecraft:item",
          "name": "simpletms:tr_icebeam"
        },
        {
          "type": "minecraft:item",
          "name": "simpletms:tr_iceburn"
        },
        {
          "type": "minecraft:item",
          "name": "simpletms:tr_icefang"
        },
        {
          "type": "minecraft:item",
          "name": "simpletms:tr_icehammer"
        },
        {
          "type": "minecraft:item",
          "name": "simpletms:tr_icepunch"
        },
        {
          "type": "minecraft:item",
          "name": "simpletms:tr_iceshard"
        },
        {
          "type": "minecraft:item",
          "name": "simpletms:tr_icespinner"
        },
        {
          "type": "minecraft:item",
          "name": "simpletms:tr_iciclecrash"
        },
        {
          "type": "minecraft:item",
          "name": "simpletms:tr_iciclespear"
        },
        {
          "type": "minecraft:item",
          "name": "simpletms:tr_icywind"
        },
        {
          "type": "minecraft:item",
          "name": "simpletms:tr_imprison"
        },
        {
          "type": "minecraft:item",
          "name": "simpletms:tr_incinerate"
        },
        {
          "type": "minecraft:item",
          "name": "simpletms:tr_infernalparade"
        },
        {
          "type": "minecraft:item",
          "name": "simpletms:tr_inferno"
        },
        {
          "type": "minecraft:item",
          "name": "simpletms:tr_infernooverdrive"
        },
        {
          "type": "minecraft:item",
          "name": "simpletms:tr_infestation"
        },
        {
          "type": "minecraft:item",
          "name": "simpletms:tr_ingrain"
        },
        {
          "type": "minecraft:item",
          "name": "simpletms:tr_instruct"
        },
        {
          "type": "minecraft:item",
          "name": "simpletms:tr_iondeluge"
        },
        {
          "type": "minecraft:item",
          "name": "simpletms:tr_irondefense"
        },
        {
          "type": "minecraft:item",
          "name": "simpletms:tr_ironhead"
        },
        {
          "type": "minecraft:item",
          "name": "simpletms:tr_irontail"
        },
        {
          "type": "minecraft:item",
          "name": "simpletms:tr_jawlock"
        },
        {
          "type": "minecraft:item",
          "name": "simpletms:tr_jetpunch"
        },
        {
          "type": "minecraft:item",
          "name": "simpletms:tr_judgment"
        },
        {
          "type": "minecraft:item",
          "name": "simpletms:tr_jumpkick"
        },
        {
          "type": "minecraft:item",
          "name": "simpletms:tr_junglehealing"
        },
        {
          "type": "minecraft:item",
          "name": "simpletms:tr_karatechop"
        },
        {
          "type": "minecraft:item",
          "name": "simpletms:tr_kinesis"
        },
        {
          "type": "minecraft:item",
          "name": "simpletms:tr_kingsshield"
        },
        {
          "type": "minecraft:item",
          "name": "simpletms:tr_knockoff"
        },
        {
          "type": "minecraft:item",
          "name": "simpletms:tr_kowtowcleave"
        },
        {
          "type": "minecraft:item",
          "name": "simpletms:tr_landswrath"
        },
        {
          "type": "minecraft:item",
          "name": "simpletms:tr_laserfocus"
        },
        {
          "type": "minecraft:item",
          "name": "simpletms:tr_lashout"
        },
        {
          "type": "minecraft:item",
          "name": "simpletms:tr_lastresort"
        },
        {
          "type": "minecraft:item",
          "name": "simpletms:tr_lastrespects"
        },
        {
          "type": "minecraft:item",
          "name": "simpletms:tr_lavaplume"
        },
        {
          "type": "minecraft:item",
          "name": "simpletms:tr_leafage"
        },
        {
          "type": "minecraft:item",
          "name": "simpletms:tr_leafblade"
        },
        {
          "type": "minecraft:item",
          "name": "simpletms:tr_leafstorm"
        },
        {
          "type": "minecraft:item",
          "name": "simpletms:tr_leaftornado"
        },
        {
          "type": "minecraft:item",
          "name": "simpletms:tr_leechlife"
        },
        {
          "type": "minecraft:item",
          "name": "simpletms:tr_leechseed"
        },
        {
          "type": "minecraft:item",
          "name": "simpletms:tr_leer"
        },
        {
          "type": "minecraft:item",
          "name": "simpletms:tr_letssnuggleforever"
        },
        {
          "type": "minecraft:item",
          "name": "simpletms:tr_lick"
        },
        {
          "type": "minecraft:item",
          "name": "simpletms:tr_lifedew"
        },
        {
          "type": "minecraft:item",
          "name": "simpletms:tr_lightofruin"
        },
        {
          "type": "minecraft:item",
          "name": "simpletms:tr_lightscreen"
        },
        {
          "type": "minecraft:item",
          "name": "simpletms:tr_lightthatburnsthesky"
        },
        {
          "type": "minecraft:item",
          "name": "simpletms:tr_liquidation"
        },
        {
          "type": "minecraft:item",
          "name": "simpletms:tr_lockon"
        },
        {
          "type": "minecraft:item",
          "name": "simpletms:tr_lovelykiss"
        },
        {
          "type": "minecraft:item",
          "name": "simpletms:tr_lowkick"
        },
        {
          "type": "minecraft:item",
          "name": "simpletms:tr_lowsweep"
        },
        {
          "type": "minecraft:item",
          "name": "simpletms:tr_luckychant"
        },
        {
          "type": "minecraft:item",
          "name": "simpletms:tr_luminacrash"
        },
        {
          "type": "minecraft:item",
          "name": "simpletms:tr_lunarblessing"
        },
        {
          "type": "minecraft:item",
          "name": "simpletms:tr_lunardance"
        },
        {
          "type": "minecraft:item",
          "name": "simpletms:tr_lunge"
        },
        {
          "type": "minecraft:item",
          "name": "simpletms:tr_lusterpurge"
        },
        {
          "type": "minecraft:item",
          "name": "simpletms:tr_machpunch"
        },
        {
          "type": "minecraft:item",
          "name": "simpletms:tr_magicalleaf"
        },
        {
          "type": "minecraft:item",
          "name": "simpletms:tr_magicaltorque"
        },
        {
          "type": "minecraft:item",
          "name": "simpletms:tr_magiccoat"
        },
        {
          "type": "minecraft:item",
          "name": "simpletms:tr_magicpowder"
        },
        {
          "type": "minecraft:item",
          "name": "simpletms:tr_magicroom"
        },
        {
          "type": "minecraft:item",
          "name": "simpletms:tr_magmastorm"
        },
        {
          "type": "minecraft:item",
          "name": "simpletms:tr_magnetbomb"
        },
        {
          "type": "minecraft:item",
          "name": "simpletms:tr_magneticflux"
        },
        {
          "type": "minecraft:item",
          "name": "simpletms:tr_magnetrise"
        },
        {
          "type": "minecraft:item",
          "name": "simpletms:tr_magnitude"
        },
        {
          "type": "minecraft:item",
          "name": "simpletms:tr_makeitrain"
        },
        {
          "type": "minecraft:item",
          "name": "simpletms:tr_maliciousmoonsault"
        },
        {
          "type": "minecraft:item",
          "name": "simpletms:tr_matblock"
        },
        {
          "type": "minecraft:item",
          "name": "simpletms:tr_maxairstream"
        },
        {
          "type": "minecraft:item",
          "name": "simpletms:tr_maxdarkness"
        },
        {
          "type": "minecraft:item",
          "name": "simpletms:tr_maxflare"
        },
        {
          "type": "minecraft:item",
          "name": "simpletms:tr_maxflutterby"
        },
        {
          "type": "minecraft:item",
          "name": "simpletms:tr_maxgeyser"
        },
        {
          "type": "minecraft:item",
          "name": "simpletms:tr_maxguard"
        },
        {
          "type": "minecraft:item",
          "name": "simpletms:tr_maxhailstorm"
        },
        {
          "type": "minecraft:item",
          "name": "simpletms:tr_maxknuckle"
        },
        {
          "type": "minecraft:item",
          "name": "simpletms:tr_maxlightning"
        },
        {
          "type": "minecraft:item",
          "name": "simpletms:tr_maxmindstorm"
        },
        {
          "type": "minecraft:item",
          "name": "simpletms:tr_maxooze"
        },
        {
          "type": "minecraft:item",
          "name": "simpletms:tr_maxovergrowth"
        },
        {
          "type": "minecraft:item",
          "name": "simpletms:tr_maxphantasm"
        },
        {
          "type": "minecraft:item",
          "name": "simpletms:tr_maxquake"
        },
        {
          "type": "minecraft:item",
          "name": "simpletms:tr_maxrockfall"
        },
        {
          "type": "minecraft:item",
          "name": "simpletms:tr_maxstarfall"
        },
        {
          "type": "minecraft:item",
          "name": "simpletms:tr_maxsteelspike"
        },
        {
          "type": "minecraft:item",
          "name": "simpletms:tr_maxstrike"
        },
        {
          "type": "minecraft:item",
          "name": "simpletms:tr_maxwyrmwind"
        },
        {
          "type": "minecraft:item",
          "name": "simpletms:tr_meanlook"
        },
        {
          "type": "minecraft:item",
          "name": "simpletms:tr_meditate"
        },
        {
          "type": "minecraft:item",
          "name": "simpletms:tr_mefirst"
        },
        {
          "type": "minecraft:item",
          "name": "simpletms:tr_megadrain"
        },
        {
          "type": "minecraft:item",
          "name": "simpletms:tr_megahorn"
        },
        {
          "type": "minecraft:item",
          "name": "simpletms:tr_megakick"
        },
        {
          "type": "minecraft:item",
          "name": "simpletms:tr_megapunch"
        },
        {
          "type": "minecraft:item",
          "name": "simpletms:tr_memento"
        },
        {
          "type": "minecraft:item",
          "name": "simpletms:tr_menacingmoonrazemaelstrom"
        },
        {
          "type": "minecraft:item",
          "name": "simpletms:tr_metalburst"
        },
        {
          "type": "minecraft:item",
          "name": "simpletms:tr_metalclaw"
        },
        {
          "type": "minecraft:item",
          "name": "simpletms:tr_metalsound"
        },
        {
          "type": "minecraft:item",
          "name": "simpletms:tr_meteorassault"
        },
        {
          "type": "minecraft:item",
          "name": "simpletms:tr_meteorbeam"
        },
        {
          "type": "minecraft:item",
          "name": "simpletms:tr_meteormash"
        },
        {
          "type": "minecraft:item",
          "name": "simpletms:tr_metronome"
        },
        {
          "type": "minecraft:item",
          "name": "simpletms:tr_milkdrink"
        },
        {
          "type": "minecraft:item",
          "name": "simpletms:tr_mimic"
        },
        {
          "type": "minecraft:item",
          "name": "simpletms:tr_mindblown"
        },
        {
          "type": "minecraft:item",
          "name": "simpletms:tr_mindreader"
        },
        {
          "type": "minecraft:item",
          "name": "simpletms:tr_minimize"
        },
        {
          "type": "minecraft:item",
          "name": "simpletms:tr_miracleeye"
        },
        {
          "type": "minecraft:item",
          "name": "simpletms:tr_mirrorcoat"
        },
        {
          "type": "minecraft:item",
          "name": "simpletms:tr_mirrormove"
        },
        {
          "type": "minecraft:item",
          "name": "simpletms:tr_mirrorshot"
        },
        {
          "type": "minecraft:item",
          "name": "simpletms:tr_mist"
        },
        {
          "type": "minecraft:item",
          "name": "simpletms:tr_mistball"
        },
        {
          "type": "minecraft:item",
          "name": "simpletms:tr_mistyexplosion"
        },
        {
          "type": "minecraft:item",
          "name": "simpletms:tr_mistyterrain"
        },
        {
          "type": "minecraft:item",
          "name": "simpletms:tr_moonblast"
        },
        {
          "type": "minecraft:item",
          "name": "simpletms:tr_moongeistbeam"
        },
        {
          "type": "minecraft:item",
          "name": "simpletms:tr_moonlight"
        },
        {
          "type": "minecraft:item",
          "name": "simpletms:tr_morningsun"
        },
        {
          "type": "minecraft:item",
          "name": "simpletms:tr_mortalspin"
        },
        {
          "type": "minecraft:item",
          "name": "simpletms:tr_mountaingale"
        },
        {
          "type": "minecraft:item",
          "name": "simpletms:tr_mudbomb"
        },
        {
          "type": "minecraft:item",
          "name": "simpletms:tr_mudshot"
        },
        {
          "type": "minecraft:item",
          "name": "simpletms:tr_mudslap"
        },
        {
          "type": "minecraft:item",
          "name": "simpletms:tr_mudsport"
        },
        {
          "type": "minecraft:item",
          "name": "simpletms:tr_muddywater"
        },
        {
          "type": "minecraft:item",
          "name": "simpletms:tr_multiattack"
        },
        {
          "type": "minecraft:item",
          "name": "simpletms:tr_mysticalfire"
        },
        {
          "type": "minecraft:item",
          "name": "simpletms:tr_mysticalpower"
        },
        {
          "type": "minecraft:item",
          "name": "simpletms:tr_nastyplot"
        },
        {
          "type": "minecraft:item",
          "name": "simpletms:tr_naturalgift"
        },
        {
          "type": "minecraft:item",
          "name": "simpletms:tr_naturepower"
        },
        {
          "type": "minecraft:item",
          "name": "simpletms:tr_naturesmadness"
        },
        {
          "type": "minecraft:item",
          "name": "simpletms:tr_needlearm"
        },
        {
          "type": "minecraft:item",
          "name": "simpletms:tr_neverendingnightmare"
        },
        {
          "type": "minecraft:item",
          "name": "simpletms:tr_nightdaze"
        },
        {
          "type": "minecraft:item",
          "name": "simpletms:tr_nightmare"
        },
        {
          "type": "minecraft:item",
          "name": "simpletms:tr_nightshade"
        },
        {
          "type": "minecraft:item",
          "name": "simpletms:tr_nightslash"
        },
        {
          "type": "minecraft:item",
          "name": "simpletms:tr_nobleroar"
        },
        {
          "type": "minecraft:item",
          "name": "simpletms:tr_noretreat"
        },
        {
          "type": "minecraft:item",
          "name": "simpletms:tr_noxioustorque"
        },
        {
          "type": "minecraft:item",
          "name": "simpletms:tr_nuzzle"
        },
        {
          "type": "minecraft:item",
          "name": "simpletms:tr_oblivionwing"
        },
        {
          "type": "minecraft:item",
          "name": "simpletms:tr_obstruct"
        },
        {
          "type": "minecraft:item",
          "name": "simpletms:tr_oceanicoperetta"
        },
        {
          "type": "minecraft:item",
          "name": "simpletms:tr_octazooka"
        },
        {
          "type": "minecraft:item",
          "name": "simpletms:tr_octolock"
        },
        {
          "type": "minecraft:item",
          "name": "simpletms:tr_odorsleuth"
        },
        {
          "type": "minecraft:item",
          "name": "simpletms:tr_ominouswind"
        },
        {
          "type": "minecraft:item",
          "name": "simpletms:tr_orderup"
        },
        {
          "type": "minecraft:item",
          "name": "simpletms:tr_originpulse"
        },
        {
          "type": "minecraft:item",
          "name": "simpletms:tr_outrage"
        },
        {
          "type": "minecraft:item",
          "name": "simpletms:tr_overdrive"
        },
        {
          "type": "minecraft:item",
          "name": "simpletms:tr_overheat"
        },
        {
          "type": "minecraft:item",
          "name": "simpletms:tr_painsplit"
        },
        {
          "type": "minecraft:item",
          "name": "simpletms:tr_paraboliccharge"
        },
        {
          "type": "minecraft:item",
          "name": "simpletms:tr_partingshot"
        },
        {
          "type": "minecraft:item",
          "name": "simpletms:tr_payback"
        },
        {
          "type": "minecraft:item",
          "name": "simpletms:tr_payday"
        },
        {
          "type": "minecraft:item",
          "name": "simpletms:tr_peck"
        },
        {
          "type": "minecraft:item",
          "name": "simpletms:tr_perishsong"
        },
        {
          "type": "minecraft:item",
          "name": "simpletms:tr_petalblizzard"
        },
        {
          "type": "minecraft:item",
          "name": "simpletms:tr_petaldance"
        },
        {
          "type": "minecraft:item",
          "name": "simpletms:tr_phantomforce"
        },
        {
          "type": "minecraft:item",
          "name": "simpletms:tr_photongeyser"
        },
        {
          "type": "minecraft:item",
          "name": "simpletms:tr_pikapapow"
        },
        {
          "type": "minecraft:item",
          "name": "simpletms:tr_pinmissile"
        },
        {
          "type": "minecraft:item",
          "name": "simpletms:tr_plasmafists"
        },
        {
          "type": "minecraft:item",
          "name": "simpletms:tr_playnice"
        },
        {
          "type": "minecraft:item",
          "name": "simpletms:tr_playrough"
        },
        {
          "type": "minecraft:item",
          "name": "simpletms:tr_pluck"
        },
        {
          "type": "minecraft:item",
          "name": "simpletms:tr_poisonfang"
        },
        {
          "type": "minecraft:item",
          "name": "simpletms:tr_poisongas"
        },
        {
          "type": "minecraft:item",
          "name": "simpletms:tr_poisonjab"
        },
        {
          "type": "minecraft:item",
          "name": "simpletms:tr_poisonpowder"
        },
        {
          "type": "minecraft:item",
          "name": "simpletms:tr_poisonsting"
        },
        {
          "type": "minecraft:item",
          "name": "simpletms:tr_poisontail"
        },
        {
          "type": "minecraft:item",
          "name": "simpletms:tr_pollenpuff"
        },
        {
          "type": "minecraft:item",
          "name": "simpletms:tr_poltergeist"
        },
        {
          "type": "minecraft:item",
          "name": "simpletms:tr_populationbomb"
        },
        {
          "type": "minecraft:item",
          "name": "simpletms:tr_pounce"
        },
        {
          "type": "minecraft:item",
          "name": "simpletms:tr_pound"
        },
        {
          "type": "minecraft:item",
          "name": "simpletms:tr_powder"
        },
        {
          "type": "minecraft:item",
          "name": "simpletms:tr_powdersnow"
        },
        {
          "type": "minecraft:item",
          "name": "simpletms:tr_powergem"
        },
        {
          "type": "minecraft:item",
          "name": "simpletms:tr_powershift"
        },
        {
          "type": "minecraft:item",
          "name": "simpletms:tr_powersplit"
        },
        {
          "type": "minecraft:item",
          "name": "simpletms:tr_powerswap"
        },
        {
          "type": "minecraft:item",
          "name": "simpletms:tr_powertrick"
        },
        {
          "type": "minecraft:item",
          "name": "simpletms:tr_powertrip"
        },
        {
          "type": "minecraft:item",
          "name": "simpletms:tr_poweruppunch"
        },
        {
          "type": "minecraft:item",
          "name": "simpletms:tr_powerwhip"
        },
        {
          "type": "minecraft:item",
          "name": "simpletms:tr_precipiceblades"
        },
        {
          "type": "minecraft:item",
          "name": "simpletms:tr_present"
        },
        {
          "type": "minecraft:item",
          "name": "simpletms:tr_prismaticlaser"
        },
        {
          "type": "minecraft:item",
          "name": "simpletms:tr_protect"
        },
        {
          "type": "minecraft:item",
          "name": "simpletms:tr_psybeam"
        },
        {
          "type": "minecraft:item",
          "name": "simpletms:tr_psyblade"
        },
        {
          "type": "minecraft:item",
          "name": "simpletms:tr_psychup"
        },
        {
          "type": "minecraft:item",
          "name": "simpletms:tr_psychic"
        },
        {
          "type": "minecraft:item",
          "name": "simpletms:tr_psychicfangs"
        },
        {
          "type": "minecraft:item",
          "name": "simpletms:tr_psychicterrain"
        },
        {
          "type": "minecraft:item",
          "name": "simpletms:tr_psychoboost"
        },
        {
          "type": "minecraft:item",
          "name": "simpletms:tr_psychocut"
        },
        {
          "type": "minecraft:item",
          "name": "simpletms:tr_psychoshift"
        },
        {
          "type": "minecraft:item",
          "name": "simpletms:tr_psyshieldbash"
        },
        {
          "type": "minecraft:item",
          "name": "simpletms:tr_psyshock"
        },
        {
          "type": "minecraft:item",
          "name": "simpletms:tr_psystrike"
        },
        {
          "type": "minecraft:item",
          "name": "simpletms:tr_psywave"
        },
        {
          "type": "minecraft:item",
          "name": "simpletms:tr_pulverizingpancake"
        },
        {
          "type": "minecraft:item",
          "name": "simpletms:tr_punishment"
        },
        {
          "type": "minecraft:item",
          "name": "simpletms:tr_purify"
        },
        {
          "type": "minecraft:item",
          "name": "simpletms:tr_pursuit"
        },
        {
          "type": "minecraft:item",
          "name": "simpletms:tr_pyroball"
        },
        {
          "type": "minecraft:item",
          "name": "simpletms:tr_quash"
        },
        {
          "type": "minecraft:item",
          "name": "simpletms:tr_quickattack"
        },
        {
          "type": "minecraft:item",
          "name": "simpletms:tr_quickguard"
        },
        {
          "type": "minecraft:item",
          "name": "simpletms:tr_quiverdance"
        },
        {
          "type": "minecraft:item",
          "name": "simpletms:tr_rage"
        },
        {
          "type": "minecraft:item",
          "name": "simpletms:tr_ragefist"
        },
        {
          "type": "minecraft:item",
          "name": "simpletms:tr_ragepowder"
        },
        {
          "type": "minecraft:item",
          "name": "simpletms:tr_ragingbull"
        },
        {
          "type": "minecraft:item",
          "name": "simpletms:tr_ragingfury"
        },
        {
          "type": "minecraft:item",
          "name": "simpletms:tr_raindance"
        },
        {
          "type": "minecraft:item",
          "name": "simpletms:tr_rapidspin"
        },
        {
          "type": "minecraft:item",
          "name": "simpletms:tr_razorleaf"
        },
        {
          "type": "minecraft:item",
          "name": "simpletms:tr_razorshell"
        },
        {
          "type": "minecraft:item",
          "name": "simpletms:tr_razorwind"
        },
        {
          "type": "minecraft:item",
          "name": "simpletms:tr_recover"
        },
        {
          "type": "minecraft:item",
          "name": "simpletms:tr_recycle"
        },
        {
          "type": "minecraft:item",
          "name": "simpletms:tr_reflect"
        },
        {
          "type": "minecraft:item",
          "name": "simpletms:tr_reflecttype"
        },
        {
          "type": "minecraft:item",
          "name": "simpletms:tr_refresh"
        },
        {
          "type": "minecraft:item",
          "name": "simpletms:tr_relicsong"
        },
        {
          "type": "minecraft:item",
          "name": "simpletms:tr_rest"
        },
        {
          "type": "minecraft:item",
          "name": "simpletms:tr_retaliate"
        },
        {
          "type": "minecraft:item",
          "name": "simpletms:tr_return"
        },
        {
          "type": "minecraft:item",
          "name": "simpletms:tr_revelationdance"
        },
        {
          "type": "minecraft:item",
          "name": "simpletms:tr_revenge"
        },
        {
          "type": "minecraft:item",
          "name": "simpletms:tr_reversal"
        },
        {
          "type": "minecraft:item",
          "name": "simpletms:tr_revivalblessing"
        },
        {
          "type": "minecraft:item",
          "name": "simpletms:tr_risingvoltage"
        },
        {
          "type": "minecraft:item",
          "name": "simpletms:tr_roar"
        },
        {
          "type": "minecraft:item",
          "name": "simpletms:tr_roaroftime"
        },
        {
          "type": "minecraft:item",
          "name": "simpletms:tr_rockblast"
        },
        {
          "type": "minecraft:item",
          "name": "simpletms:tr_rockclimb"
        },
        {
          "type": "minecraft:item",
          "name": "simpletms:tr_rockpolish"
        },
        {
          "type": "minecraft:item",
          "name": "simpletms:tr_rockslide"
        },
        {
          "type": "minecraft:item",
          "name": "simpletms:tr_rocksmash"
        },
        {
          "type": "minecraft:item",
          "name": "simpletms:tr_rockthrow"
        },
        {
          "type": "minecraft:item",
          "name": "simpletms:tr_rocktomb"
        },
        {
          "type": "minecraft:item",
          "name": "simpletms:tr_rockwrecker"
        },
        {
          "type": "minecraft:item",
          "name": "simpletms:tr_roleplay"
        },
        {
          "type": "minecraft:item",
          "name": "simpletms:tr_rollingkick"
        },
        {
          "type": "minecraft:item",
          "name": "simpletms:tr_rollout"
        },
        {
          "type": "minecraft:item",
          "name": "simpletms:tr_roost"
        },
        {
          "type": "minecraft:item",
          "name": "simpletms:tr_rototiller"
        },
        {
          "type": "minecraft:item",
          "name": "simpletms:tr_round"
        },
        {
          "type": "minecraft:item",
          "name": "simpletms:tr_ruination"
        },
        {
          "type": "minecraft:item",
          "name": "simpletms:tr_sacredfire"
        },
        {
          "type": "minecraft:item",
          "name": "simpletms:tr_sacredsword"
        },
        {
          "type": "minecraft:item",
          "name": "simpletms:tr_safeguard"
        },
        {
          "type": "minecraft:item",
          "name": "simpletms:tr_saltcure"
        },
        {
          "type": "minecraft:item",
          "name": "simpletms:tr_sandattack"
        },
        {
          "type": "minecraft:item",
          "name": "simpletms:tr_sandsearstorm"
        },
        {
          "type": "minecraft:item",
          "name": "simpletms:tr_sandstorm"
        },
        {
          "type": "minecraft:item",
          "name": "simpletms:tr_sandtomb"
        },
        {
          "type": "minecraft:item",
          "name": "simpletms:tr_sappyseed"
        },
        {
          "type": "minecraft:item",
          "name": "simpletms:tr_savagespinout"
        },
        {
          "type": "minecraft:item",
          "name": "simpletms:tr_scald"
        },
        {
          "type": "minecraft:item",
          "name": "simpletms:tr_scaleshot"
        },
        {
          "type": "minecraft:item",
          "name": "simpletms:tr_scaryface"
        },
        {
          "type": "minecraft:item",
          "name": "simpletms:tr_scorchingsands"
        },
        {
          "type": "minecraft:item",
          "name": "simpletms:tr_scratch"
        },
        {
          "type": "minecraft:item",
          "name": "simpletms:tr_screech"
        },
        {
          "type": "minecraft:item",
          "name": "simpletms:tr_searingshot"
        },
        {
          "type": "minecraft:item",
          "name": "simpletms:tr_searingsunrazesmash"
        },
        {
          "type": "minecraft:item",
          "name": "simpletms:tr_secretpower"
        },
        {
          "type": "minecraft:item",
          "name": "simpletms:tr_secretsword"
        },
        {
          "type": "minecraft:item",
          "name": "simpletms:tr_seedbomb"
        },
        {
          "type": "minecraft:item",
          "name": "simpletms:tr_seedflare"
        },
        {
          "type": "minecraft:item",
          "name": "simpletms:tr_seismictoss"
        },
        {
          "type": "minecraft:item",
          "name": "simpletms:tr_selfdestruct"
        },
        {
          "type": "minecraft:item",
          "name": "simpletms:tr_shadowball"
        },
        {
          "type": "minecraft:item",
          "name": "simpletms:tr_shadowbone"
        },
        {
          "type": "minecraft:item",
          "name": "simpletms:tr_shadowclaw"
        },
        {
          "type": "minecraft:item",
          "name": "simpletms:tr_shadowforce"
        },
        {
          "type": "minecraft:item",
          "name": "simpletms:tr_shadowpunch"
        },
        {
          "type": "minecraft:item",
          "name": "simpletms:tr_shadowsneak"
        },
        {
          "type": "minecraft:item",
          "name": "simpletms:tr_shadowstrike"
        },
        {
          "type": "minecraft:item",
          "name": "simpletms:tr_sharpen"
        },
        {
          "type": "minecraft:item",
          "name": "simpletms:tr_shatteredpsyche"
        },
        {
          "type": "minecraft:item",
          "name": "simpletms:tr_shedtail"
        },
        {
          "type": "minecraft:item",
          "name": "simpletms:tr_sheercold"
        },
        {
          "type": "minecraft:item",
          "name": "simpletms:tr_shellsidearm"
        },
        {
          "type": "minecraft:item",
          "name": "simpletms:tr_shellsmash"
        },
        {
          "type": "minecraft:item",
          "name": "simpletms:tr_shelltrap"
        },
        {
          "type": "minecraft:item",
          "name": "simpletms:tr_shelter"
        },
        {
          "type": "minecraft:item",
          "name": "simpletms:tr_shiftgear"
        },
        {
          "type": "minecraft:item",
          "name": "simpletms:tr_shockwave"
        },
        {
          "type": "minecraft:item",
          "name": "simpletms:tr_shoreup"
        },
        {
          "type": "minecraft:item",
          "name": "simpletms:tr_signalbeam"
        },
        {
          "type": "minecraft:item",
          "name": "simpletms:tr_silktrap"
        },
        {
          "type": "minecraft:item",
          "name": "simpletms:tr_silverwind"
        },
        {
          "type": "minecraft:item",
          "name": "simpletms:tr_simplebeam"
        },
        {
          "type": "minecraft:item",
          "name": "simpletms:tr_sing"
        },
        {
          "type": "minecraft:item",
          "name": "simpletms:tr_sinisterarrowraid"
        },
        {
          "type": "minecraft:item",
          "name": "simpletms:tr_sizzlyslide"
        },
        {
          "type": "minecraft:item",
          "name": "simpletms:tr_sketch"
        },
        {
          "type": "minecraft:item",
          "name": "simpletms:tr_skillswap"
        },
        {
          "type": "minecraft:item",
          "name": "simpletms:tr_skittersmack"
        },
        {
          "type": "minecraft:item",
          "name": "simpletms:tr_skullbash"
        },
        {
          "type": "minecraft:item",
          "name": "simpletms:tr_skyattack"
        },
        {
          "type": "minecraft:item",
          "name": "simpletms:tr_skydrop"
        },
        {
          "type": "minecraft:item",
          "name": "simpletms:tr_skyuppercut"
        },
        {
          "type": "minecraft:item",
          "name": "simpletms:tr_slackoff"
        },
        {
          "type": "minecraft:item",
          "name": "simpletms:tr_slam"
        },
        {
          "type": "minecraft:item",
          "name": "simpletms:tr_slash"
        },
        {
          "type": "minecraft:item",
          "name": "simpletms:tr_sleeppowder"
        },
        {
          "type": "minecraft:item",
          "name": "simpletms:tr_sleeptalk"
        },
        {
          "type": "minecraft:item",
          "name": "simpletms:tr_sludge"
        },
        {
          "type": "minecraft:item",
          "name": "simpletms:tr_sludgebomb"
        },
        {
          "type": "minecraft:item",
          "name": "simpletms:tr_sludgewave"
        },
        {
          "type": "minecraft:item",
          "name": "simpletms:tr_smackdown"
        },
        {
          "type": "minecraft:item",
          "name": "simpletms:tr_smartstrike"
        },
        {
          "type": "minecraft:item",
          "name": "simpletms:tr_smellingsalts"
        },
        {
          "type": "minecraft:item",
          "name": "simpletms:tr_smog"
        },
        {
          "type": "minecraft:item",
          "name": "simpletms:tr_smokescreen"
        },
        {
          "type": "minecraft:item",
          "name": "simpletms:tr_snaptrap"
        },
        {
          "type": "minecraft:item",
          "name": "simpletms:tr_snarl"
        },
        {
          "type": "minecraft:item",
          "name": "simpletms:tr_snatch"
        },
        {
          "type": "minecraft:item",
          "name": "simpletms:tr_snipeshot"
        },
        {
          "type": "minecraft:item",
          "name": "simpletms:tr_snore"
        },
        {
          "type": "minecraft:item",
          "name": "simpletms:tr_snowscape"
        },
        {
          "type": "minecraft:item",
          "name": "simpletms:tr_soak"
        },
        {
          "type": "minecraft:item",
          "name": "simpletms:tr_softboiled"
        },
        {
          "type": "minecraft:item",
          "name": "simpletms:tr_solarbeam"
        },
        {
          "type": "minecraft:item",
          "name": "simpletms:tr_solarblade"
        },
        {
          "type": "minecraft:item",
          "name": "simpletms:tr_sonicboom"
        },
        {
          "type": "minecraft:item",
          "name": "simpletms:tr_soulstealing7starstrike"
        },
        {
          "type": "minecraft:item",
          "name": "simpletms:tr_spacialrend"
        },
        {
          "type": "minecraft:item",
          "name": "simpletms:tr_spark"
        },
        {
          "type": "minecraft:item",
          "name": "simpletms:tr_sparklingaria"
        },
        {
          "type": "minecraft:item",
          "name": "simpletms:tr_sparklyswirl"
        },
        {
          "type": "minecraft:item",
          "name": "simpletms:tr_spectralthief"
        },
        {
          "type": "minecraft:item",
          "name": "simpletms:tr_speedswap"
        },
        {
          "type": "minecraft:item",
          "name": "simpletms:tr_spicyextract"
        },
        {
          "type": "minecraft:item",
          "name": "simpletms:tr_spiderweb"
        },
        {
          "type": "minecraft:item",
          "name": "simpletms:tr_spikecannon"
        },
        {
          "type": "minecraft:item",
          "name": "simpletms:tr_spikes"
        },
        {
          "type": "minecraft:item",
          "name": "simpletms:tr_spikyshield"
        },
        {
          "type": "minecraft:item",
          "name": "simpletms:tr_spinout"
        },
        {
          "type": "minecraft:item",
          "name": "simpletms:tr_spiritbreak"
        },
        {
          "type": "minecraft:item",
          "name": "simpletms:tr_spiritshackle"
        },
        {
          "type": "minecraft:item",
          "name": "simpletms:tr_spitup"
        },
        {
          "type": "minecraft:item",
          "name": "simpletms:tr_spite"
        },
        {
          "type": "minecraft:item",
          "name": "simpletms:tr_splash"
        },
        {
          "type": "minecraft:item",
          "name": "simpletms:tr_splinteredstormshards"
        },
        {
          "type": "minecraft:item",
          "name": "simpletms:tr_splishysplash"
        },
        {
          "type": "minecraft:item",
          "name": "simpletms:tr_spore"
        },
        {
          "type": "minecraft:item",
          "name": "simpletms:tr_spotlight"
        },
        {
          "type": "minecraft:item",
          "name": "simpletms:tr_springtidestorm"
        },
        {
          "type": "minecraft:item",
          "name": "simpletms:tr_stealthrock"
        },
        {
          "type": "minecraft:item",
          "name": "simpletms:tr_steameruption"
        },
        {
          "type": "minecraft:item",
          "name": "simpletms:tr_steamroller"
        },
        {
          "type": "minecraft:item",
          "name": "simpletms:tr_steelbeam"
        },
        {
          "type": "minecraft:item",
          "name": "simpletms:tr_steelroller"
        },
        {
          "type": "minecraft:item",
          "name": "simpletms:tr_steelwing"
        },
        {
          "type": "minecraft:item",
          "name": "simpletms:tr_stickyweb"
        },
        {
          "type": "minecraft:item",
          "name": "simpletms:tr_stockpile"
        },
        {
          "type": "minecraft:item",
          "name": "simpletms:tr_stokedsparksurfer"
        },
        {
          "type": "minecraft:item",
          "name": "simpletms:tr_stomp"
        },
        {
          "type": "minecraft:item",
          "name": "simpletms:tr_stompingtantrum"
        },
        {
          "type": "minecraft:item",
          "name": "simpletms:tr_stoneaxe"
        },
        {
          "type": "minecraft:item",
          "name": "simpletms:tr_stoneedge"
        },
        {
          "type": "minecraft:item",
          "name": "simpletms:tr_storedpower"
        },
        {
          "type": "minecraft:item",
          "name": "simpletms:tr_stormthrow"
        },
        {
          "type": "minecraft:item",
          "name": "simpletms:tr_strangesteam"
        },
        {
          "type": "minecraft:item",
          "name": "simpletms:tr_strength"
        },
        {
          "type": "minecraft:item",
          "name": "simpletms:tr_strengthsap"
        },
        {
          "type": "minecraft:item",
          "name": "simpletms:tr_stringshot"
        },
        {
          "type": "minecraft:item",
          "name": "simpletms:tr_struggle"
        },
        {
          "type": "minecraft:item",
          "name": "simpletms:tr_strugglebug"
        },
        {
          "type": "minecraft:item",
          "name": "simpletms:tr_stuffcheeks"
        },
        {
          "type": "minecraft:item",
          "name": "simpletms:tr_stunspore"
        },
        {
          "type": "minecraft:item",
          "name": "simpletms:tr_submission"
        },
        {
          "type": "minecraft:item",
          "name": "simpletms:tr_substitute"
        },
        {
          "type": "minecraft:item",
          "name": "simpletms:tr_subzeroslammer"
        },
        {
          "type": "minecraft:item",
          "name": "simpletms:tr_suckerpunch"
        },
        {
          "type": "minecraft:item",
          "name": "simpletms:tr_sunnyday"
        },
        {
          "type": "minecraft:item",
          "name": "simpletms:tr_sunsteelstrike"
        },
        {
          "type": "minecraft:item",
          "name": "simpletms:tr_superfang"
        },
        {
          "type": "minecraft:item",
          "name": "simpletms:tr_superpower"
        },
        {
          "type": "minecraft:item",
          "name": "simpletms:tr_supersonic"
        },
        {
          "type": "minecraft:item",
          "name": "simpletms:tr_supersonicskystrike"
        },
        {
          "type": "minecraft:item",
          "name": "simpletms:tr_surf"
        },
        {
          "type": "minecraft:item",
          "name": "simpletms:tr_surgingstrikes"
        },
        {
          "type": "minecraft:item",
          "name": "simpletms:tr_swagger"
        },
        {
          "type": "minecraft:item",
          "name": "simpletms:tr_swallow"
        },
        {
          "type": "minecraft:item",
          "name": "simpletms:tr_sweetkiss"
        },
        {
          "type": "minecraft:item",
          "name": "simpletms:tr_sweetscent"
        },
        {
          "type": "minecraft:item",
          "name": "simpletms:tr_swift"
        },
        {
          "type": "minecraft:item",
          "name": "simpletms:tr_switcheroo"
        },
        {
          "type": "minecraft:item",
          "name": "simpletms:tr_swordsdance"
        },
        {
          "type": "minecraft:item",
          "name": "simpletms:tr_synchronoise"
        },
        {
          "type": "minecraft:item",
          "name": "simpletms:tr_synthesis"
        },
        {
          "type": "minecraft:item",
          "name": "simpletms:tr_tackle"
        },
        {
          "type": "minecraft:item",
          "name": "simpletms:tr_tailglow"
        },
        {
          "type": "minecraft:item",
          "name": "simpletms:tr_tailslap"
        },
        {
          "type": "minecraft:item",
          "name": "simpletms:tr_tailwhip"
        },
        {
          "type": "minecraft:item",
          "name": "simpletms:tr_tailwind"
        },
        {
          "type": "minecraft:item",
          "name": "simpletms:tr_takedown"
        },
        {
          "type": "minecraft:item",
          "name": "simpletms:tr_takeheart"
        },
        {
          "type": "minecraft:item",
          "name": "simpletms:tr_tarshot"
        },
        {
          "type": "minecraft:item",
          "name": "simpletms:tr_taunt"
        },
        {
          "type": "minecraft:item",
          "name": "simpletms:tr_tearfullook"
        },
        {
          "type": "minecraft:item",
          "name": "simpletms:tr_teatime"
        },
        {
          "type": "minecraft:item",
          "name": "simpletms:tr_technoblast"
        },
        {
          "type": "minecraft:item",
          "name": "simpletms:tr_tectonicrage"
        },
        {
          "type": "minecraft:item",
          "name": "simpletms:tr_teeterdance"
        },
        {
          "type": "minecraft:item",
          "name": "simpletms:tr_telekinesis"
        },
        {
          "type": "minecraft:item",
          "name": "simpletms:tr_teleport"
        },
        {
          "type": "minecraft:item",
          "name": "simpletms:tr_terablast"
        },
        {
          "type": "minecraft:item",
          "name": "simpletms:tr_terrainpulse"
        },
        {
          "type": "minecraft:item",
          "name": "simpletms:tr_thief"
        },
        {
          "type": "minecraft:item",
          "name": "simpletms:tr_thousandarrows"
        },
        {
          "type": "minecraft:item",
          "name": "simpletms:tr_thousandwaves"
        },
        {
          "type": "minecraft:item",
          "name": "simpletms:tr_thrash"
        },
        {
          "type": "minecraft:item",
          "name": "simpletms:tr_throatchop"
        },
        {
          "type": "minecraft:item",
          "name": "simpletms:tr_thunder"
        },
        {
          "type": "minecraft:item",
          "name": "simpletms:tr_thunderbolt"
        },
        {
          "type": "minecraft:item",
          "name": "simpletms:tr_thundercage"
        },
        {
          "type": "minecraft:item",
          "name": "simpletms:tr_thunderfang"
        },
        {
          "type": "minecraft:item",
          "name": "simpletms:tr_thunderouskick"
        },
        {
          "type": "minecraft:item",
          "name": "simpletms:tr_thunderpunch"
        },
        {
          "type": "minecraft:item",
          "name": "simpletms:tr_thundershock"
        },
        {
          "type": "minecraft:item",
          "name": "simpletms:tr_thunderwave"
        },
        {
          "type": "minecraft:item",
          "name": "simpletms:tr_tickle"
        },
        {
          "type": "minecraft:item",
          "name": "simpletms:tr_tidyup"
        },
        {
          "type": "minecraft:item",
          "name": "simpletms:tr_topsyturvy"
        },
        {
          "type": "minecraft:item",
          "name": "simpletms:tr_torchsong"
        },
        {
          "type": "minecraft:item",
          "name": "simpletms:tr_torment"
        },
        {
          "type": "minecraft:item",
          "name": "simpletms:tr_toxic"
        },
        {
          "type": "minecraft:item",
          "name": "simpletms:tr_toxicspikes"
        },
        {
          "type": "minecraft:item",
          "name": "simpletms:tr_toxicthread"
        },
        {
          "type": "minecraft:item",
          "name": "simpletms:tr_trailblaze"
        },
        {
          "type": "minecraft:item",
          "name": "simpletms:tr_transform"
        },
        {
          "type": "minecraft:item",
          "name": "simpletms:tr_triattack"
        },
        {
          "type": "minecraft:item",
          "name": "simpletms:tr_trick"
        },
        {
          "type": "minecraft:item",
          "name": "simpletms:tr_trickortreat"
        },
        {
          "type": "minecraft:item",
          "name": "simpletms:tr_trickroom"
        },
        {
          "type": "minecraft:item",
          "name": "simpletms:tr_triplearrows"
        },
        {
          "type": "minecraft:item",
          "name": "simpletms:tr_tripleaxel"
        },
        {
          "type": "minecraft:item",
          "name": "simpletms:tr_tripledive"
        },
        {
          "type": "minecraft:item",
          "name": "simpletms:tr_triplekick"
        },
        {
          "type": "minecraft:item",
          "name": "simpletms:tr_tropkick"
        },
        {
          "type": "minecraft:item",
          "name": "simpletms:tr_trumpcard"
        },
        {
          "type": "minecraft:item",
          "name": "simpletms:tr_twinbeam"
        },
        {
          "type": "minecraft:item",
          "name": "simpletms:tr_twineedle"
        },
        {
          "type": "minecraft:item",
          "name": "simpletms:tr_twinkletackle"
        },
        {
          "type": "minecraft:item",
          "name": "simpletms:tr_twister"
        },
        {
          "type": "minecraft:item",
          "name": "simpletms:tr_uturn"
        },
        {
          "type": "minecraft:item",
          "name": "simpletms:tr_uproar"
        },
        {
          "type": "minecraft:item",
          "name": "simpletms:tr_vacuumwave"
        },
        {
          "type": "minecraft:item",
          "name": "simpletms:tr_vcreate"
        },
        {
          "type": "minecraft:item",
          "name": "simpletms:tr_veeveevolley"
        },
        {
          "type": "minecraft:item",
          "name": "simpletms:tr_venomdrench"
        },
        {
          "type": "minecraft:item",
          "name": "simpletms:tr_venoshock"
        },
        {
          "type": "minecraft:item",
          "name": "simpletms:tr_victorydance"
        },
        {
          "type": "minecraft:item",
          "name": "simpletms:tr_vinewhip"
        },
        {
          "type": "minecraft:item",
          "name": "simpletms:tr_visegrip"
        },
        {
          "type": "minecraft:item",
          "name": "simpletms:tr_vitalthrow"
        },
        {
          "type": "minecraft:item",
          "name": "simpletms:tr_voltswitch"
        },
        {
          "type": "minecraft:item",
          "name": "simpletms:tr_volttackle"
        },
        {
          "type": "minecraft:item",
          "name": "simpletms:tr_wakeupslap"
        },
        {
          "type": "minecraft:item",
          "name": "simpletms:tr_waterfall"
        },
        {
          "type": "minecraft:item",
          "name": "simpletms:tr_watergun"
        },
        {
          "type": "minecraft:item",
          "name": "simpletms:tr_waterpledge"
        },
        {
          "type": "minecraft:item",
          "name": "simpletms:tr_waterpulse"
        },
        {
          "type": "minecraft:item",
          "name": "simpletms:tr_watershuriken"
        },
        {
          "type": "minecraft:item",
          "name": "simpletms:tr_watersport"
        },
        {
          "type": "minecraft:item",
          "name": "simpletms:tr_waterspout"
        },
        {
          "type": "minecraft:item",
          "name": "simpletms:tr_wavecrash"
        },
        {
          "type": "minecraft:item",
          "name": "simpletms:tr_weatherball"
        },
        {
          "type": "minecraft:item",
          "name": "simpletms:tr_whirlpool"
        },
        {
          "type": "minecraft:item",
          "name": "simpletms:tr_whirlwind"
        },
        {
          "type": "minecraft:item",
          "name": "simpletms:tr_wickedblow"
        },
        {
          "type": "minecraft:item",
          "name": "simpletms:tr_wickedtorque"
        },
        {
          "type": "minecraft:item",
          "name": "simpletms:tr_wideguard"
        },
        {
          "type": "minecraft:item",
          "name": "simpletms:tr_wildboltstorm"
        },
        {
          "type": "minecraft:item",
          "name": "simpletms:tr_wildcharge"
        },
        {
          "type": "minecraft:item",
          "name": "simpletms:tr_willowisp"
        },
        {
          "type": "minecraft:item",
          "name": "simpletms:tr_wingattack"
        },
        {
          "type": "minecraft:item",
          "name": "simpletms:tr_wish"
        },
        {
          "type": "minecraft:item",
          "name": "simpletms:tr_withdraw"
        },
        {
          "type": "minecraft:item",
          "name": "simpletms:tr_wonderroom"
        },
        {
          "type": "minecraft:item",
          "name": "simpletms:tr_woodhammer"
        },
        {
          "type": "minecraft:item",
          "name": "simpletms:tr_workup"
        },
        {
          "type": "minecraft:item",
          "name": "simpletms:tr_worryseed"
        },
        {
          "type": "minecraft:item",
          "name": "simpletms:tr_wrap"
        },
        {
          "type": "minecraft:item",
          "name": "simpletms:tr_wringout"
        },
        {
          "type": "minecraft:item",
          "name": "simpletms:tr_xscissor"
        },
        {
          "type": "minecraft:item",
          "name": "simpletms:tr_yawn"
        },
        {
          "type": "minecraft:item",
          "name": "simpletms:tr_zapcannon"
        },
        {
          "type": "minecraft:item",
          "name": "simpletms:tr_zenheadbutt"
        },
        {
          "type": "minecraft:item",
          "name": "simpletms:tr_zingzap"
        },
        {
          "type": "minecraft:item",
          "name": "simpletms:tr_zippyzap"
        }
      ]
    }
  ],
  "random_sequence": "rctmod:generic/rare/trs"
}