{
  "name": "Ace Trainer Mary",
  "ai": {
    "type": "rct",
    "data": {
      "maxSelectMargin": 0.15
    }
  },
  "battleRules": {
    "maxItemUses": 5
  },
  "bag": [
    {
      "item": "cobblemon:hyper_potion",
      "quantity": 2
    }
  ],
  "team": [
    {
      "species": "grotle",
      "gender": "FEMALE",
      "level": 35,
      "nature": "brave",
      "ability": "overgrow",
      "moveset": [
        "curse",
        "bite",
        "seedbomb",
        "leechseed"
      ],
      "ivs": {
        "hp": 25,
        "atk": 25,
        "def": 25,
        "spa": 25,
        "spd": 25,
        "spe": 25
      },
      "evs": {}
    },
    {
      "species": "graveler",
      "gender": "FEMALE",
      "level": 35,
      "nature": "quirky",
      "ability": "rockhead",
      "moveset": [
        "bulldoze",
        "selfdestruct",
        "stealthrock",
        "rockblast"
      ],
      "ivs": {
        "hp": 25,
        "atk": 25,
        "def": 25,
        "spa": 25,
        "spd": 25,
        "spe": 25
      },
      "evs": {}
    },
    {
      "species": "ferroseed",
      "gender": "MALE",
      "level": 36,
      "nature": "rash",
      "ability": "ironbarbs",
      "moveset": [
        "gyroball",
        "irondefense",
        "mirrorshot",
        "ingrain"
      ],
      "ivs": {
        "hp": 25,
        "atk": 25,
        "def": 25,
        "spa": 25,
        "spd": 25,
        "spe": 25
      },
      "evs": {}
    },
    {
      "species": "tentacruel",
      "gender": "FEMALE",
      "level": 35,
      "nature": "serious",
      "ability": "clearbody",
      "moveset": [
        "bubblebeam",
        "barrier",
        "poisonjab",
        "scald"
      ],
      "ivs": {
        "hp": 25,
        "atk": 25,
        "def": 25,
        "spa": 25,
        "spd": 25,
        "spe": 25
      },
      "evs": {}
    },
    {
      "species": "lombre",
      "gender": "FEMALE",
      "level": 38,
      "nature": "brave",
      "ability": "swiftswim",
      "moveset": [
        "bubblebeam",
        "naturepower",
        "uproar",
        "knockoff"
      ],
      "ivs": {
        "hp": 25,
        "atk": 25,
        "def": 25,
        "spa": 25,
        "spd": 25,
        "spe": 25
      },
      "evs": {}
    }
  ]
}