{
  "type": "LEADER",
  "requiredDefeats": [
    ["trainer_brendan_0039"]
  ],
  "maxTrainerWins": 3,
  "maxTrainerDefeats": 1,
  "battleCooldownTicks": 240,
  "spawnWeightFactor": 0.25,
  "biomeTagBlacklist": ["is_void", "is_end"],
  "biomeTagWhitelist": ["is_swamp", "is_jungle"]
}