{
  "type": "RIVAL",
  "requiredDefeats": [
    ["rocket_admin_archer_002e"]
  ],
  "maxTrainerWins": 3,
  "maxTrainerDefeats": 1,
  "battleCooldownTicks": 240,
  "spawnWeightFactor": 0.25,
  "biomeTagBlacklist": ["is_void"],
  "biomeTagWhitelist": ["is_plains", "is_sparse_vegetation", "is_rare", "has_structure/end_city"]
}