{
  "type": "TEAM_ROCKET",
  "requiredDefeats": [
    ["leader_blaine_01a3"]
  ],
  "maxTrainerWins": 3,
  "maxTrainerDefeats": 1,
  "battleCooldownTicks": 240,
  "spawnWeightFactor": 0.25,
  "biomeTagBlacklist": ["is_void"],
  "biomeTagWhitelist": ["is_nether", "has_structure/end_city", "is_badlands", "is_wasteland", "is_savanna"]
}