{
  "name": "Ace Trainer Nick",
  "ai": {
    "type": "rct",
    "data": {
      "maxSelectMargin": 0.15
    }
  },
  "battleRules": {
    "maxItemUses": 5
  },
  "bag": [
    {
      "item": "cobblemon:hyper_potion",
      "quantity": 2
    }
  ],
  "team": [
    {
      "species": "ninetales",
      "gender": "FEMALE",
      "level": 93,
      "nature": "timid",
      "ability": "snowwarning",
      "moveset": [
        "freezedry",
        "moonblast",
        "auroraveil",
        "frostbreath"
      ],
      "ivs": {
        "hp": 31,
        "atk": 31,
        "def": 31,
        "spa": 31,
        "spd": 31,
        "spe": 31
      },
      "evs": {
        "hp": 252,
        "def": 4,
        "spe": 252
      },
      "heldItem": "light_clay",
      "aspects": [
        "alolan"
      ]
    },
    {
      "species": "garchomp",
      "gender": "FEMALE",
      "level": 93,
      "nature": "jolly",
      "ability": "sandveil",
      "moveset": [
        "swordsdance",
        "earthquake",
        "scaleshot",
        "stoneedge"
      ],
      "ivs": {
        "hp": 31,
        "atk": 31,
        "def": 31,
        "spa": 31,
        "spd": 31,
        "spe": 31
      },
      "evs": {
        "atk": 252,
        "spa": 4,
        "spe": 252
      },
      "heldItem": "life_orb"
    },
    {
      "species": "dragapult",
      "gender": "MALE",
      "level": 94,
      "nature": "jolly",
      "ability": "clearbody",
      "moveset": [
        "dragondance",
        "phantomforce",
        "dragondarts",
        "fireblast"
      ],
      "ivs": {
        "hp": 31,
        "atk": 31,
        "def": 31,
        "spa": 31,
        "spd": 31,
        "spe": 31
      },
      "evs": {
        "hp": 120,
        "atk": 252,
        "spa": 4,
        "spe": 132
      },
      "heldItem": "weakness_policy"
    },
    {
      "species": "heatran",
      "gender": "FEMALE",
      "level": 93,
      "nature": "timid",
      "ability": "flashfire",
      "moveset": [
        "magmastorm",
        "earthpower",
        "flashcannon",
        "protect"
      ],
      "ivs": {
        "hp": 31,
        "atk": 31,
        "def": 31,
        "spa": 31,
        "spd": 31,
        "spe": 31
      },
      "evs": {
        "hp": 184,
        "def": 4,
        "spa": 96,
        "spe": 224
      },
      "heldItem": "air_balloon"
    },
    {
      "species": "arctozolt",
      "gender": "GENDERLESS",
      "level": 95,
      "nature": "naive",
      "ability": "slushrush",
      "moveset": [
        "boltbeak",
        "blizzard",
        "freezedry",
        "lowkick"
      ],
      "ivs": {
        "hp": 31,
        "atk": 31,
        "def": 31,
        "spa": 31,
        "spd": 31,
        "spe": 31
      },
      "evs": {
        "atk": 200,
        "def": 4,
        "spa": 76,
        "spe": 232
      },
      "heldItem": "ice_gem"
    },
    {
      "species": "zapdos",
      "gender": "GENDERLESS",
      "level": 94,
      "nature": "jolly",
      "ability": "defiant",
      "moveset": [
        "closecombat",
        "bravebird",
        "uturn",
        "stompingtantrum"
      ],
      "ivs": {
        "hp": 31,
        "atk": 31,
        "def": 31,
        "spa": 30,
        "spd": 31,
        "spe": 31
      },
      "evs": {
        "atk": 252,
        "def": 4,
        "spe": 252
      },
      "heldItem": "flying_gem",
      "aspects": [
        "galarian"
      ]
    }
  ]
}