{
  "parent": "rctmod:trainers/defeat_trainer_red",
  "display": {
    "title": {
      "text": "There can only be one"
    },
    "description": {
      "text": "Defeat all rivals"
    },
    "icon": {
      "id": "cobblemon:poke_ball"
    },
    "announce_to_chat": true,
    "show_toast": true,
    "hidden": true,
    "frame": "challenge"
  },
  "criteria": {
    "first_defeat": {
      "conditions": {
        "trainer_type": "RIVAL",
        "count": -1
      },
      "trigger": "rctmod:defeat_count"
    }
  },
  "requirements": [
    [
      "first_defeat"
    ]
  ]
}