{
  "type": "NORMAL",
  "maxTrainerWins": 3,
  "maxTrainerDefeats": 1,
  "battleCooldownTicks": 240,
  "spawnWeightFactor": 0.25,
  "biomeTagBlacklist": ["is_void"],
  "biomeTagWhitelist": ["is_nether", "has_structure/end_city", "is_peak", "is_rare"]
}