{
  "parent": "rctmod:trainers/defeat_any",
  "display": {
    "title": {
      "text": "Wrong way to battle"
    },
    "description": {
      "text": "'Defeat' any Trainer"
    },
    "icon": {
      "id": "minecraft:iron_sword"
    },
    "announce_to_chat": false,
    "show_toast": true,
    "hidden": true,
    "frame": "task"
  },
  "criteria": {
    "kill_trainer": {
      "conditions": {
        "entity": {
          "type": "rctmod:trainer"
        }
      },
      "trigger": "minecraft:player_killed_entity"
    }
  },
  "requirements": [
    [
      "kill_trainer"
    ]
  ]
}