{
  "name": "Ace Trainer Gilbert",
  "ai": {
    "type": "rct",
    "data": {
      "maxSelectMargin": 0.15
    }
  },
  "battleRules": {
    "maxItemUses": 5
  },
  "bag": [
    {
      "item": "cobblemon:hyper_potion",
      "quantity": 2
    }
  ],
  "team": [
    {
      "species": "pidgeotto",
      "gender": "FEMALE",
      "level": 42,
      "nature": "gentle",
      "ability": "tangledfeet",
      "moveset": [
        "wingattack",
        "featherdance",
        "whirlwind",
        "quickattack"
      ],
      "ivs": {
        "hp": 25,
        "atk": 25,
        "def": 25,
        "spa": 25,
        "spd": 25,
        "spe": 25
      },
      "evs": {}
    },
    {
      "species": "fearow",
      "gender": "FEMALE",
      "level": 42,
      "nature": "mild",
      "ability": "technician",
      "moveset": [
        "drillpeck",
        "mirrormove",
        "pursuit",
        "leer"
      ],
      "ivs": {
        "hp": 25,
        "atk": 25,
        "def": 25,
        "spa": 25,
        "spd": 25,
        "spe": 25
      },
      "evs": {}
    },
    {
      "species": "persian",
      "gender": "FEMALE",
      "level": 42,
      "nature": "impish",
      "ability": "technician",
      "moveset": [
        "payday",
        "feintattack",
        "screech",
        "bite"
      ],
      "ivs": {
        "hp": 25,
        "atk": 25,
        "def": 25,
        "spa": 25,
        "spd": 25,
        "spe": 25
      },
      "evs": {}
    },
    {
      "species": "lickitung",
      "gender": "FEMALE",
      "level": 42,
      "nature": "docile",
      "ability": "oblivious",
      "moveset": [
        "slam",
        "disable",
        "wrap",
        "supersonic"
      ],
      "ivs": {
        "hp": 25,
        "atk": 25,
        "def": 25,
        "spa": 25,
        "spd": 25,
        "spe": 25
      },
      "evs": {}
    },
    {
      "species": "tauros",
      "gender": "MALE",
      "level": 42,
      "nature": "relaxed",
      "ability": "angerpoint",
      "moveset": [
        "hornattack",
        "scaryface",
        "swagger",
        "tailwhip"
      ],
      "ivs": {
        "hp": 25,
        "atk": 25,
        "def": 25,
        "spa": 25,
        "spd": 25,
        "spe": 25
      },
      "evs": {}
    }
  ]
}