
--------------------------------------------------------------------------------
- Test Application (v0.0.0) [7a6be6b5dbf2f2bb24a85f2c1dd261d29d254490]
-
- @author  Author Name <name@domain.tld>
- @license MIT License <https://opensource.org/licenses/MIT>
--------------------------------------------------------------------------------

Starting up...done.






                                [ TEXT HELPERS ]                                

 A line of text
--------------------------------------------------------------------------------
 // A comment
--------------------------------------------------------------------------------
Some muted text
--------------------------------------------------------------------------------
 * a
 * listing

--------------------------------------------------------------------------------
 [definition-name] -> definition-value

                               [ TITLE HELPERS ]                                

--------------------------------------------------------------------------------
- A title
--------------------------------------------------------------------------------

--------------------------------------------------------------------------------

                                  [ SECTION ]                                   

--------------------------------------------------------------------------------

                                [ SUB SECTION ]                                 

--------------------------------------------------------------------------------

 # [ 4 of 102 ] type
 # Section

                               [ BLOCK HELPERS ]                                

                                                                                
 Block                                                                          
                                                                                

--------------------------------------------------------------------------------

                                                                                
 [ Has "simple-string" scalar, "100" integer, and complex replacement ] Line 1  
 with simple-string scalar replacement                                          
 And line 2 with 100 integer replacement                                        
{ And line 3 with \{#[0-9]+\} complex replacement                                    }
                                                                                

--------------------------------------------------------------------------------

                                                                                
 -- [ INFO ] Info block                                                         
                                                                                

--------------------------------------------------------------------------------

                                                                                
 || [ OK ] Success block                                                        
                                                                                

--------------------------------------------------------------------------------

                                                                                
 ## [ WARN ] Warning block                                                      
                                                                                

--------------------------------------------------------------------------------

                                                                                
 !! [ ERR ]                                                                     
 !! -------                                                                     
 !! Error block                                                                 
                                                                                

--------------------------------------------------------------------------------

                                                                                
 ** [ CRITICAL ]                                                                
 ** ------------                                                                
 ** Critical block                                                              
                                                                                

                               [ ACTION HELPERS ]                               

Action 1 ... [done]

--------------------------------------------------------------------------------
Action 2 ... [fail]

--------------------------------------------------------------------------------
Action 3 ... [stop]

--------------------------------------------------------------------------------
Action 4 ... [warn]

--------------------------------------------------------------------------------
Action 5 ... [okay]

                               [ TABLE HELPERS ]                                

+--------+
| header |
+--------+
| row    |
+--------+

--------------------------------------------------------------------------------

+--------+-----+
| header | row |
+--------+-----+

