<svg width="19" height="18" viewBox="0 0 19 18" fill="none" xmlns="http://www.w3.org/2000/svg">
<path d="M7.25 8.8125C7.00136 8.8125 6.7629 8.91127 6.58709 9.08709C6.41127 9.2629 6.3125 9.50136 6.3125 9.75C6.3125 9.99864 6.41127 10.2371 6.58709 10.4129C6.7629 10.5887 7.00136 10.6875 7.25 10.6875C7.37311 10.6875 7.49502 10.6633 7.60877 10.6161C7.72251 10.569 7.82586 10.5 7.91291 10.4129C7.99997 10.3259 8.06902 10.2225 8.11614 10.1088C8.16325 9.99502 8.1875 9.87311 8.1875 9.75C8.1875 9.62689 8.16325 9.50498 8.11614 9.39123C8.06902 9.27749 7.99997 9.17414 7.91291 9.08709C7.82586 9.00003 7.72251 8.93098 7.60877 8.88386C7.49502 8.83675 7.37311 8.8125 7.25 8.8125ZM11.75 8.8125C11.5014 8.8125 11.2629 8.91127 11.0871 9.08709C10.9113 9.2629 10.8125 9.50136 10.8125 9.75C10.8125 9.99864 10.9113 10.2371 11.0871 10.4129C11.2629 10.5887 11.5014 10.6875 11.75 10.6875C11.9986 10.6875 12.2371 10.5887 12.4129 10.4129C12.5887 10.2371 12.6875 9.99864 12.6875 9.75C12.6875 9.50136 12.5887 9.2629 12.4129 9.08709C12.2371 8.91127 11.9986 8.8125 11.75 8.8125ZM9.5 1.5C8.51509 1.5 7.53982 1.69399 6.62987 2.0709C5.71993 2.44781 4.89314 3.00026 4.1967 3.6967C2.79018 5.10322 2 7.01088 2 9C2 10.9891 2.79018 12.8968 4.1967 14.3033C4.89314 14.9997 5.71993 15.5522 6.62987 15.9291C7.53982 16.306 8.51509 16.5 9.5 16.5C11.4891 16.5 13.3968 15.7098 14.8033 14.3033C16.2098 12.8968 17 10.9891 17 9C17 8.01509 16.806 7.03982 16.4291 6.12987C16.0522 5.21993 15.4997 4.39314 14.8033 3.6967C14.1069 3.00026 13.2801 2.44781 12.3701 2.0709C11.4602 1.69399 10.4849 1.5 9.5 1.5ZM9.5 15C7.9087 15 6.38258 14.3679 5.25736 13.2426C4.13214 12.1174 3.5 10.5913 3.5 9C3.4775 8.78559 3.4775 8.56941 3.5 8.355C5.28646 7.57334 6.70047 6.12975 7.445 4.3275C8.13642 5.30782 9.05323 6.1077 10.1183 6.65979C11.1833 7.21189 12.3654 7.50004 13.565 7.5C14.135 7.5 14.6975 7.4325 15.2525 7.305C16.19 10.5 14.375 13.8225 11.195 14.7525C10.625 14.9175 10.07 15 9.5 15ZM0.5 1.5C0.5 1.10218 0.658035 0.720644 0.93934 0.43934C1.22064 0.158035 1.60218 0 2 0L5 0V1.5H2V4.5H0.5V1.5ZM18.5 16.5C18.5 16.8978 18.342 17.2794 18.0607 17.5607C17.7794 17.842 17.3978 18 17 18H14V16.5H17V13.5H18.5V16.5ZM2 18C1.60218 18 1.22064 17.842 0.93934 17.5607C0.658035 17.2794 0.5 16.8978 0.5 16.5V13.5H2V16.5H5V18H2ZM17 0C17.3978 0 17.7794 0.158035 18.0607 0.43934C18.342 0.720644 18.5 1.10218 18.5 1.5V4.5H17V1.5H14V0H17Z" fill="white"/>
</svg>
