[
  {
    "CODI_EQUIPAMENT": 75990029216,
    "EQUIPAMENT": "Punt Verd de Barri Col·laborador - Recuperació per al Reciclatge Tabuenca",
    "SECCIO": "#",
    "TIPUS_VIA": "C",
    "NOM_CARRER": "Guilleries",
    "NUM_CARRER_1": 24,
    "NUM_CARRER_2": 24,
    "CODI_BARRI": 31,
    "NUM_BARRI": "la Vila de Gràcia",
    "CODI_DISTRICTE": "06",
    "NOM_DISTRICTE": "Gràcia",
    "CODI_POSTAL": "08012",
    "CODI_POBLACIO": "019",
    "POBLACIO": "BARCELONA",
    "LATITUD": 41.40366,
    "LONGITUD": 2.156418,
    "X_ETRS89": 429487.702,
    "Y_ETRS89": 4583912.014,
    "X_ED50": 429579.625,
    "Y_ED50": 4584112.965,
    "TELEFON_NUM": "",
    "TELEFON_TIPUS": "No tenen telèfon",
    "TELEFON_INFO_COM": "",
    "HORARI_PERIODE_INICI": "25/09",
    "HORARI_PERIODE_FI": "23/06",
    "HORARI_DIES": "0000011",
    "HORARI_HORES_INICI": "08:30:00",
    "HORARI_HORES_FI": "13:30:00",
    "HORARI_OBSERVACIONS": "",
    "3ER_NIVELL": "Punt verd col·laborador",
    "2N_NIVELL": "Medi ambient",
    "1ER_NIVELL": "Medi ambient",
    "": ""
  },
  {
    "CODI_EQUIPAMENT": 75990029216,
    "EQUIPAMENT": "Punt Verd de Barri Col·laborador - Recuperació per al Reciclatge Tabuenca",
    "SECCIO": "#",
    "TIPUS_VIA": "C",
    "NOM_CARRER": "Guilleries",
    "NUM_CARRER_1": 24,
    "NUM_CARRER_2": 24,
    "CODI_BARRI": 31,
    "NUM_BARRI": "la Vila de Gràcia",
    "CODI_DISTRICTE": "06",
    "NOM_DISTRICTE": "Gràcia",
    "CODI_POSTAL": "08012",
    "CODI_POBLACIO": "019",
    "POBLACIO": "BARCELONA",
    "LATITUD": 41.40366,
    "LONGITUD": 2.156418,
    "X_ETRS89": 429487.702,
    "Y_ETRS89": 4583912.014,
    "X_ED50": 429579.625,
    "Y_ED50": 4584112.965,
    "TELEFON_NUM": "",
    "TELEFON_TIPUS": "No tenen telèfon",
    "TELEFON_INFO_COM": "",
    "HORARI_PERIODE_INICI": "25/09",
    "HORARI_PERIODE_FI": "23/06",
    "HORARI_DIES": 1111111,
    "HORARI_HORES_INICI": "16:00:00",
    "HORARI_HORES_FI": "19:00:00",
    "HORARI_OBSERVACIONS": "",
    "3ER_NIVELL": "Punt verd col·laborador",
    "2N_NIVELL": "Medi ambient",
    "1ER_NIVELL": "Medi ambient",
    "": ""
  },
  {
    "CODI_EQUIPAMENT": 75990029216,
    "EQUIPAMENT": "Punt Verd de Barri Col·laborador - Recuperació per al Reciclatge Tabuenca",
    "SECCIO": "#",
    "TIPUS_VIA": "C",
    "NOM_CARRER": "Guilleries",
    "NUM_CARRER_1": 24,
    "NUM_CARRER_2": 24,
    "CODI_BARRI": 31,
    "NUM_BARRI": "la Vila de Gràcia",
    "CODI_DISTRICTE": "06",
    "NOM_DISTRICTE": "Gràcia",
    "CODI_POSTAL": "08012",
    "CODI_POBLACIO": "019",
    "POBLACIO": "BARCELONA",
    "LATITUD": 41.40366,
    "LONGITUD": 2.156418,
    "X_ETRS89": 429487.702,
    "Y_ETRS89": 4583912.014,
    "X_ED50": 429579.625,
    "Y_ED50": 4584112.965,
    "TELEFON_NUM": "",
    "TELEFON_TIPUS": "No tenen telèfon",
    "TELEFON_INFO_COM": "",
    "HORARI_PERIODE_INICI": "25/09",
    "HORARI_PERIODE_FI": "23/06",
    "HORARI_DIES": 1111101,
    "HORARI_HORES_INICI": "10:00:00",
    "HORARI_HORES_FI": "13:00:00",
    "HORARI_OBSERVACIONS": "",
    "3ER_NIVELL": "Punt verd col·laborador",
    "2N_NIVELL": "Medi ambient",
    "1ER_NIVELL": "Medi ambient",
    "": ""
  },
  {
    "CODI_EQUIPAMENT": 75990029216,
    "EQUIPAMENT": "Punt Verd de Barri Col·laborador - Recuperació per al Reciclatge Tabuenca",
    "SECCIO": "#",
    "TIPUS_VIA": "C",
    "NOM_CARRER": "Guilleries",
    "NUM_CARRER_1": 24,
    "NUM_CARRER_2": 24,
    "CODI_BARRI": 31,
    "NUM_BARRI": "la Vila de Gràcia",
    "CODI_DISTRICTE": "06",
    "NOM_DISTRICTE": "Gràcia",
    "CODI_POSTAL": "08012",
    "CODI_POBLACIO": "019",
    "POBLACIO": "BARCELONA",
    "LATITUD": 41.40366,
    "LONGITUD": 2.156418,
    "X_ETRS89": 429487.702,
    "Y_ETRS89": 4583912.014,
    "X_ED50": 429579.625,
    "Y_ED50": 4584112.965,
    "TELEFON_NUM": "",
    "TELEFON_TIPUS": "No tenen telèfon",
    "TELEFON_INFO_COM": "",
    "HORARI_PERIODE_INICI": "24/06",
    "HORARI_PERIODE_FI": "24/09",
    "HORARI_DIES": "0000011",
    "HORARI_HORES_INICI": "08:30:00",
    "HORARI_HORES_FI": "13:30:00",
    "HORARI_OBSERVACIONS": "",
    "3ER_NIVELL": "Punt verd col·laborador",
    "2N_NIVELL": "Medi ambient",
    "1ER_NIVELL": "Medi ambient",
    "": ""
  },
  {
    "CODI_EQUIPAMENT": 75990029216,
    "EQUIPAMENT": "Punt Verd de Barri Col·laborador - Recuperació per al Reciclatge Tabuenca",
    "SECCIO": "#",
    "TIPUS_VIA": "C",
    "NOM_CARRER": "Guilleries",
    "NUM_CARRER_1": 24,
    "NUM_CARRER_2": 24,
    "CODI_BARRI": 31,
    "NUM_BARRI": "la Vila de Gràcia",
    "CODI_DISTRICTE": "06",
    "NOM_DISTRICTE": "Gràcia",
    "CODI_POSTAL": "08012",
    "CODI_POBLACIO": "019",
    "POBLACIO": "BARCELONA",
    "LATITUD": 41.40366,
    "LONGITUD": 2.156418,
    "X_ETRS89": 429487.702,
    "Y_ETRS89": 4583912.014,
    "X_ED50": 429579.625,
    "Y_ED50": 4584112.965,
    "TELEFON_NUM": "",
    "TELEFON_TIPUS": "No tenen telèfon",
    "TELEFON_INFO_COM": "",
    "HORARI_PERIODE_INICI": "24/06",
    "HORARI_PERIODE_FI": "24/09",
    "HORARI_DIES": 1111111,
    "HORARI_HORES_INICI": "16:00:00",
    "HORARI_HORES_FI": "19:00:00",
    "HORARI_OBSERVACIONS": "",
    "3ER_NIVELL": "Punt verd col·laborador",
    "2N_NIVELL": "Medi ambient",
    "1ER_NIVELL": "Medi ambient",
    "": ""
  },
  {
    "CODI_EQUIPAMENT": 75990029216,
    "EQUIPAMENT": "Punt Verd de Barri Col·laborador - Recuperació per al Reciclatge Tabuenca",
    "SECCIO": "#",
    "TIPUS_VIA": "C",
    "NOM_CARRER": "Guilleries",
    "NUM_CARRER_1": 24,
    "NUM_CARRER_2": 24,
    "CODI_BARRI": 31,
    "NUM_BARRI": "la Vila de Gràcia",
    "CODI_DISTRICTE": "06",
    "NOM_DISTRICTE": "Gràcia",
    "CODI_POSTAL": "08012",
    "CODI_POBLACIO": "019",
    "POBLACIO": "BARCELONA",
    "LATITUD": 41.40366,
    "LONGITUD": 2.156418,
    "X_ETRS89": 429487.702,
    "Y_ETRS89": 4583912.014,
    "X_ED50": 429579.625,
    "Y_ED50": 4584112.965,
    "TELEFON_NUM": "",
    "TELEFON_TIPUS": "No tenen telèfon",
    "TELEFON_INFO_COM": "",
    "HORARI_PERIODE_INICI": "25/09",
    "HORARI_PERIODE_FI": "23/06",
    "HORARI_DIES": "0000011",
    "HORARI_HORES_INICI": "08:30:00",
    "HORARI_HORES_FI": "13:30:00",
    "HORARI_OBSERVACIONS": "",
    "3ER_NIVELL": "",
    "2N_NIVELL": "Punt verd col·laborador",
    "1ER_NIVELL": "Medi ambient",
    "": ""
  },
  {
    "CODI_EQUIPAMENT": 75990029216,
    "EQUIPAMENT": "Punt Verd de Barri Col·laborador - Recuperació per al Reciclatge Tabuenca",
    "SECCIO": "#",
    "TIPUS_VIA": "C",
    "NOM_CARRER": "Guilleries",
    "NUM_CARRER_1": 24,
    "NUM_CARRER_2": 24,
    "CODI_BARRI": 31,
    "NUM_BARRI": "la Vila de Gràcia",
    "CODI_DISTRICTE": "06",
    "NOM_DISTRICTE": "Gràcia",
    "CODI_POSTAL": "08012",
    "CODI_POBLACIO": "019",
    "POBLACIO": "BARCELONA",
    "LATITUD": 41.40366,
    "LONGITUD": 2.156418,
    "X_ETRS89": 429487.702,
    "Y_ETRS89": 4583912.014,
    "X_ED50": 429579.625,
    "Y_ED50": 4584112.965,
    "TELEFON_NUM": "",
    "TELEFON_TIPUS": "No tenen telèfon",
    "TELEFON_INFO_COM": "",
    "HORARI_PERIODE_INICI": "25/09",
    "HORARI_PERIODE_FI": "23/06",
    "HORARI_DIES": 1111111,
    "HORARI_HORES_INICI": "16:00:00",
    "HORARI_HORES_FI": "19:00:00",
    "HORARI_OBSERVACIONS": "",
    "3ER_NIVELL": "",
    "2N_NIVELL": "Punt verd col·laborador",
    "1ER_NIVELL": "Medi ambient",
    "": ""
  },
  {
    "CODI_EQUIPAMENT": 75990029216,
    "EQUIPAMENT": "Punt Verd de Barri Col·laborador - Recuperació per al Reciclatge Tabuenca",
    "SECCIO": "#",
    "TIPUS_VIA": "C",
    "NOM_CARRER": "Guilleries",
    "NUM_CARRER_1": 24,
    "NUM_CARRER_2": 24,
    "CODI_BARRI": 31,
    "NUM_BARRI": "la Vila de Gràcia",
    "CODI_DISTRICTE": "06",
    "NOM_DISTRICTE": "Gràcia",
    "CODI_POSTAL": "08012",
    "CODI_POBLACIO": "019",
    "POBLACIO": "BARCELONA",
    "LATITUD": 41.40366,
    "LONGITUD": 2.156418,
    "X_ETRS89": 429487.702,
    "Y_ETRS89": 4583912.014,
    "X_ED50": 429579.625,
    "Y_ED50": 4584112.965,
    "TELEFON_NUM": "",
    "TELEFON_TIPUS": "No tenen telèfon",
    "TELEFON_INFO_COM": "",
    "HORARI_PERIODE_INICI": "25/09",
    "HORARI_PERIODE_FI": "23/06",
    "HORARI_DIES": 1111101,
    "HORARI_HORES_INICI": "10:00:00",
    "HORARI_HORES_FI": "13:00:00",
    "HORARI_OBSERVACIONS": "",
    "3ER_NIVELL": "",
    "2N_NIVELL": "Punt verd col·laborador",
    "1ER_NIVELL": "Medi ambient",
    "": ""
  },
  {
    "CODI_EQUIPAMENT": 75990029216,
    "EQUIPAMENT": "Punt Verd de Barri Col·laborador - Recuperació per al Reciclatge Tabuenca",
    "SECCIO": "#",
    "TIPUS_VIA": "C",
    "NOM_CARRER": "Guilleries",
    "NUM_CARRER_1": 24,
    "NUM_CARRER_2": 24,
    "CODI_BARRI": 31,
    "NUM_BARRI": "la Vila de Gràcia",
    "CODI_DISTRICTE": "06",
    "NOM_DISTRICTE": "Gràcia",
    "CODI_POSTAL": "08012",
    "CODI_POBLACIO": "019",
    "POBLACIO": "BARCELONA",
    "LATITUD": 41.40366,
    "LONGITUD": 2.156418,
    "X_ETRS89": 429487.702,
    "Y_ETRS89": 4583912.014,
    "X_ED50": 429579.625,
    "Y_ED50": 4584112.965,
    "TELEFON_NUM": "",
    "TELEFON_TIPUS": "No tenen telèfon",
    "TELEFON_INFO_COM": "",
    "HORARI_PERIODE_INICI": "24/06",
    "HORARI_PERIODE_FI": "24/09",
    "HORARI_DIES": "0000011",
    "HORARI_HORES_INICI": "08:30:00",
    "HORARI_HORES_FI": "13:30:00",
    "HORARI_OBSERVACIONS": "",
    "3ER_NIVELL": "",
    "2N_NIVELL": "Punt verd col·laborador",
    "1ER_NIVELL": "Medi ambient",
    "": ""
  },
  {
    "CODI_EQUIPAMENT": 75990029216,
    "EQUIPAMENT": "Punt Verd de Barri Col·laborador - Recuperació per al Reciclatge Tabuenca",
    "SECCIO": "#",
    "TIPUS_VIA": "C",
    "NOM_CARRER": "Guilleries",
    "NUM_CARRER_1": 24,
    "NUM_CARRER_2": 24,
    "CODI_BARRI": 31,
    "NUM_BARRI": "la Vila de Gràcia",
    "CODI_DISTRICTE": "06",
    "NOM_DISTRICTE": "Gràcia",
    "CODI_POSTAL": "08012",
    "CODI_POBLACIO": "019",
    "POBLACIO": "BARCELONA",
    "LATITUD": 41.40366,
    "LONGITUD": 2.156418,
    "X_ETRS89": 429487.702,
    "Y_ETRS89": 4583912.014,
    "X_ED50": 429579.625,
    "Y_ED50": 4584112.965,
    "TELEFON_NUM": "",
    "TELEFON_TIPUS": "No tenen telèfon",
    "TELEFON_INFO_COM": "",
    "HORARI_PERIODE_INICI": "24/06",
    "HORARI_PERIODE_FI": "24/09",
    "HORARI_DIES": 1111111,
    "HORARI_HORES_INICI": "16:00:00",
    "HORARI_HORES_FI": "19:00:00",
    "HORARI_OBSERVACIONS": "",
    "3ER_NIVELL": "",
    "2N_NIVELL": "Punt verd col·laborador",
    "1ER_NIVELL": "Medi ambient",
    "": ""
  }
]