[
  {
    "CODI_EQUIPAMENT": 297122514,
    "EQUIPAMENT": "Punt Verd de Zona - Deixalleria Sant Andreu",
    "SECCIO": "#",
    "TIPUS_VIA": "C",
    "NOM_CARRER": "Caracas",
    "NUM_CARRER_1": 46,
    "NUM_CARRER_2": 46,
    "CODI_BARRI": 59,
    "NUM_BARRI": "el Bon Pastor",
    "CODI_DISTRICTE": "09",
    "NOM_DISTRICTE": "Sant Andreu",
    "CODI_POSTAL": "08030",
    "CODI_POBLACIO": "019",
    "POBLACIO": "BARCELONA",
    "LATITUD": 41.44555,
    "LONGITUD": 2.202367,
    "X_ETRS89": 433371.318,
    "Y_ETRS89": 4588526.246,
    "X_ED50": 433463.276,
    "Y_ED50": 4588727.241,
    "TELEFON_NUM": "",
    "TELEFON_TIPUS": "No tenen telèfon",
    "TELEFON_INFO_COM": "",
    "HORARI_PERIODE_INICI": "01/01",
    "HORARI_PERIODE_FI": "31/12",
    "HORARI_DIES": 1111111,
    "HORARI_HORES_INICI": "08:00:00",
    "HORARI_HORES_FI": "18:30:00",
    "HORARI_OBSERVACIONS": "",
    "3ER_NIVELL": "",
    "2N_NIVELL": "Deixalleries - Punt verd de ciutat",
    "1ER_NIVELL": "Medi ambient",
    "": ""
  },
  {
    "CODI_EQUIPAMENT": 297122514,
    "EQUIPAMENT": "Punt Verd de Zona - Deixalleria Sant Andreu",
    "SECCIO": "#",
    "TIPUS_VIA": "C",
    "NOM_CARRER": "Caracas",
    "NUM_CARRER_1": 46,
    "NUM_CARRER_2": 46,
    "CODI_BARRI": 59,
    "NUM_BARRI": "el Bon Pastor",
    "CODI_DISTRICTE": "09",
    "NOM_DISTRICTE": "Sant Andreu",
    "CODI_POSTAL": "08030",
    "CODI_POBLACIO": "019",
    "POBLACIO": "BARCELONA",
    "LATITUD": 41.44555,
    "LONGITUD": 2.202367,
    "X_ETRS89": 433371.318,
    "Y_ETRS89": 4588526.246,
    "X_ED50": 433463.276,
    "Y_ED50": 4588727.241,
    "TELEFON_NUM": "",
    "TELEFON_TIPUS": "No tenen telèfon",
    "TELEFON_INFO_COM": "",
    "HORARI_PERIODE_INICI": "01/01",
    "HORARI_PERIODE_FI": "31/12",
    "HORARI_DIES": 1111100,
    "HORARI_HORES_INICI": "09:00:00",
    "HORARI_HORES_FI": "13:00:00",
    "HORARI_OBSERVACIONS": "",
    "3ER_NIVELL": "",
    "2N_NIVELL": "Deixalleries - Punt verd de ciutat",
    "1ER_NIVELL": "Medi ambient",
    "": ""
  },
  {
    "CODI_EQUIPAMENT": 297122514,
    "EQUIPAMENT": "Punt Verd de Zona - Deixalleria Sant Andreu",
    "SECCIO": "#",
    "TIPUS_VIA": "C",
    "NOM_CARRER": "Caracas",
    "NUM_CARRER_1": 46,
    "NUM_CARRER_2": 46,
    "CODI_BARRI": 59,
    "NUM_BARRI": "el Bon Pastor",
    "CODI_DISTRICTE": "09",
    "NOM_DISTRICTE": "Sant Andreu",
    "CODI_POSTAL": "08030",
    "CODI_POBLACIO": "019",
    "POBLACIO": "BARCELONA",
    "LATITUD": 41.44555,
    "LONGITUD": 2.202367,
    "X_ETRS89": 433371.318,
    "Y_ETRS89": 4588526.246,
    "X_ED50": 433463.276,
    "Y_ED50": 4588727.241,
    "TELEFON_NUM": "",
    "TELEFON_TIPUS": "No tenen telèfon",
    "TELEFON_INFO_COM": "",
    "HORARI_PERIODE_INICI": "01/01",
    "HORARI_PERIODE_FI": "31/12",
    "HORARI_DIES": 1111111,
    "HORARI_HORES_INICI": "08:00:00",
    "HORARI_HORES_FI": "18:30:00",
    "HORARI_OBSERVACIONS": "",
    "3ER_NIVELL": "Punt verd",
    "2N_NIVELL": "Medi ambient",
    "1ER_NIVELL": "Medi ambient",
    "": ""
  },
  {
    "CODI_EQUIPAMENT": 297122514,
    "EQUIPAMENT": "Punt Verd de Zona - Deixalleria Sant Andreu",
    "SECCIO": "#",
    "TIPUS_VIA": "C",
    "NOM_CARRER": "Caracas",
    "NUM_CARRER_1": 46,
    "NUM_CARRER_2": 46,
    "CODI_BARRI": 59,
    "NUM_BARRI": "el Bon Pastor",
    "CODI_DISTRICTE": "09",
    "NOM_DISTRICTE": "Sant Andreu",
    "CODI_POSTAL": "08030",
    "CODI_POBLACIO": "019",
    "POBLACIO": "BARCELONA",
    "LATITUD": 41.44555,
    "LONGITUD": 2.202367,
    "X_ETRS89": 433371.318,
    "Y_ETRS89": 4588526.246,
    "X_ED50": 433463.276,
    "Y_ED50": 4588727.241,
    "TELEFON_NUM": "",
    "TELEFON_TIPUS": "No tenen telèfon",
    "TELEFON_INFO_COM": "",
    "HORARI_PERIODE_INICI": "01/01",
    "HORARI_PERIODE_FI": "31/12",
    "HORARI_DIES": 1111100,
    "HORARI_HORES_INICI": "09:00:00",
    "HORARI_HORES_FI": "13:00:00",
    "HORARI_OBSERVACIONS": "",
    "3ER_NIVELL": "Punt verd",
    "2N_NIVELL": "Medi ambient",
    "1ER_NIVELL": "Medi ambient",
    "": ""
  },
  {
    "CODI_EQUIPAMENT": 297122918,
    "EQUIPAMENT": "Punt Verd de Zona - Deixalleria de Les Corts-Pedralbes",
    "SECCIO": "#",
    "TIPUS_VIA": "Av",
    "NOM_CARRER": "Esplugues",
    "NUM_CARRER_1": 58,
    "NUM_CARRER_2": 60,
    "CODI_BARRI": 21,
    "NUM_BARRI": "Pedralbes",
    "CODI_DISTRICTE": "04",
    "NOM_DISTRICTE": "Les Corts",
    "CODI_POSTAL": "08034",
    "CODI_POBLACIO": "019",
    "POBLACIO": "BARCELONA",
    "LATITUD": 41.388879,
    "LONGITUD": 2.10827,
    "X_ETRS89": 425446.31,
    "Y_ETRS89": 4582311.395,
    "X_ED50": 425538.196,
    "Y_ED50": 4582512.331,
    "TELEFON_NUM": "",
    "TELEFON_TIPUS": "No tenen telèfon",
    "TELEFON_INFO_COM": "",
    "HORARI_PERIODE_INICI": "01/01",
    "HORARI_PERIODE_FI": "31/12",
    "HORARI_DIES": 1111111,
    "HORARI_HORES_INICI": "08:00:00",
    "HORARI_HORES_FI": "18:30:00",
    "HORARI_OBSERVACIONS": "",
    "3ER_NIVELL": "",
    "2N_NIVELL": "Deixalleries - Punt verd de ciutat",
    "1ER_NIVELL": "Medi ambient",
    "": ""
  },
  {
    "CODI_EQUIPAMENT": 297122918,
    "EQUIPAMENT": "Punt Verd de Zona - Deixalleria de Les Corts-Pedralbes",
    "SECCIO": "#",
    "TIPUS_VIA": "Av",
    "NOM_CARRER": "Esplugues",
    "NUM_CARRER_1": 58,
    "NUM_CARRER_2": 60,
    "CODI_BARRI": 21,
    "NUM_BARRI": "Pedralbes",
    "CODI_DISTRICTE": "04",
    "NOM_DISTRICTE": "Les Corts",
    "CODI_POSTAL": "08034",
    "CODI_POBLACIO": "019",
    "POBLACIO": "BARCELONA",
    "LATITUD": 41.388879,
    "LONGITUD": 2.10827,
    "X_ETRS89": 425446.31,
    "Y_ETRS89": 4582311.395,
    "X_ED50": 425538.196,
    "Y_ED50": 4582512.331,
    "TELEFON_NUM": "",
    "TELEFON_TIPUS": "No tenen telèfon",
    "TELEFON_INFO_COM": "",
    "HORARI_PERIODE_INICI": "01/01",
    "HORARI_PERIODE_FI": "31/12",
    "HORARI_DIES": 1111100,
    "HORARI_HORES_INICI": "09:00:00",
    "HORARI_HORES_FI": "13:00:00",
    "HORARI_OBSERVACIONS": "",
    "3ER_NIVELL": "",
    "2N_NIVELL": "Deixalleries - Punt verd de ciutat",
    "1ER_NIVELL": "Medi ambient",
    "": ""
  },
  {
    "CODI_EQUIPAMENT": 297122918,
    "EQUIPAMENT": "Punt Verd de Zona - Deixalleria de Les Corts-Pedralbes",
    "SECCIO": "#",
    "TIPUS_VIA": "Av",
    "NOM_CARRER": "Esplugues",
    "NUM_CARRER_1": 58,
    "NUM_CARRER_2": 60,
    "CODI_BARRI": 21,
    "NUM_BARRI": "Pedralbes",
    "CODI_DISTRICTE": "04",
    "NOM_DISTRICTE": "Les Corts",
    "CODI_POSTAL": "08034",
    "CODI_POBLACIO": "019",
    "POBLACIO": "BARCELONA",
    "LATITUD": 41.388879,
    "LONGITUD": 2.10827,
    "X_ETRS89": 425446.31,
    "Y_ETRS89": 4582311.395,
    "X_ED50": 425538.196,
    "Y_ED50": 4582512.331,
    "TELEFON_NUM": "",
    "TELEFON_TIPUS": "No tenen telèfon",
    "TELEFON_INFO_COM": "",
    "HORARI_PERIODE_INICI": "01/01",
    "HORARI_PERIODE_FI": "31/12",
    "HORARI_DIES": 1111111,
    "HORARI_HORES_INICI": "08:00:00",
    "HORARI_HORES_FI": "18:30:00",
    "HORARI_OBSERVACIONS": "",
    "3ER_NIVELL": "Punt verd",
    "2N_NIVELL": "Medi ambient",
    "1ER_NIVELL": "Medi ambient",
    "": ""
  },
  {
    "CODI_EQUIPAMENT": 297122918,
    "EQUIPAMENT": "Punt Verd de Zona - Deixalleria de Les Corts-Pedralbes",
    "SECCIO": "#",
    "TIPUS_VIA": "Av",
    "NOM_CARRER": "Esplugues",
    "NUM_CARRER_1": 58,
    "NUM_CARRER_2": 60,
    "CODI_BARRI": 21,
    "NUM_BARRI": "Pedralbes",
    "CODI_DISTRICTE": "04",
    "NOM_DISTRICTE": "Les Corts",
    "CODI_POSTAL": "08034",
    "CODI_POBLACIO": "019",
    "POBLACIO": "BARCELONA",
    "LATITUD": 41.388879,
    "LONGITUD": 2.10827,
    "X_ETRS89": 425446.31,
    "Y_ETRS89": 4582311.395,
    "X_ED50": 425538.196,
    "Y_ED50": 4582512.331,
    "TELEFON_NUM": "",
    "TELEFON_TIPUS": "No tenen telèfon",
    "TELEFON_INFO_COM": "",
    "HORARI_PERIODE_INICI": "01/01",
    "HORARI_PERIODE_FI": "31/12",
    "HORARI_DIES": 1111100,
    "HORARI_HORES_INICI": "09:00:00",
    "HORARI_HORES_FI": "13:00:00",
    "HORARI_OBSERVACIONS": "",
    "3ER_NIVELL": "Punt verd",
    "2N_NIVELL": "Medi ambient",
    "1ER_NIVELL": "Medi ambient",
    "": ""
  },
  {
    "CODI_EQUIPAMENT": 297123401,
    "EQUIPAMENT": "Punt Verd de Zona - Deixalleria de Vallbona",
    "SECCIO": "#",
    "TIPUS_VIA": "C",
    "NOM_CARRER": "Castelladral",
    "NUM_CARRER_1": 6,
    "NUM_CARRER_2": 10,
    "CODI_BARRI": 56,
    "NUM_BARRI": "Vallbona",
    "CODI_DISTRICTE": "08",
    "NOM_DISTRICTE": "Nou Barris",
    "CODI_POSTAL": "08033",
    "CODI_POBLACIO": "019",
    "POBLACIO": "BARCELONA",
    "LATITUD": 41.465022,
    "LONGITUD": 2.186038,
    "X_ETRS89": 432027.665,
    "Y_ETRS89": 4590700.742,
    "X_ED50": 432119.61,
    "Y_ED50": 4590901.757,
    "TELEFON_NUM": "",
    "TELEFON_TIPUS": "No tenen telèfon",
    "TELEFON_INFO_COM": "",
    "HORARI_PERIODE_INICI": "01/01",
    "HORARI_PERIODE_FI": "31/12",
    "HORARI_DIES": 1111111,
    "HORARI_HORES_INICI": "08:00:00",
    "HORARI_HORES_FI": "18:30:00",
    "HORARI_OBSERVACIONS": "",
    "3ER_NIVELL": "",
    "2N_NIVELL": "Deixalleries - Punt verd de ciutat",
    "1ER_NIVELL": "Medi ambient",
    "": ""
  },
  {
    "CODI_EQUIPAMENT": 297123401,
    "EQUIPAMENT": "Punt Verd de Zona - Deixalleria de Vallbona",
    "SECCIO": "#",
    "TIPUS_VIA": "C",
    "NOM_CARRER": "Castelladral",
    "NUM_CARRER_1": 6,
    "NUM_CARRER_2": 10,
    "CODI_BARRI": 56,
    "NUM_BARRI": "Vallbona",
    "CODI_DISTRICTE": "08",
    "NOM_DISTRICTE": "Nou Barris",
    "CODI_POSTAL": "08033",
    "CODI_POBLACIO": "019",
    "POBLACIO": "BARCELONA",
    "LATITUD": 41.465022,
    "LONGITUD": 2.186038,
    "X_ETRS89": 432027.665,
    "Y_ETRS89": 4590700.742,
    "X_ED50": 432119.61,
    "Y_ED50": 4590901.757,
    "TELEFON_NUM": "",
    "TELEFON_TIPUS": "No tenen telèfon",
    "TELEFON_INFO_COM": "",
    "HORARI_PERIODE_INICI": "01/01",
    "HORARI_PERIODE_FI": "31/12",
    "HORARI_DIES": 1111100,
    "HORARI_HORES_INICI": "09:00:00",
    "HORARI_HORES_FI": "13:00:00",
    "HORARI_OBSERVACIONS": "",
    "3ER_NIVELL": "",
    "2N_NIVELL": "Deixalleries - Punt verd de ciutat",
    "1ER_NIVELL": "Medi ambient",
    "": ""
  },
  {
    "CODI_EQUIPAMENT": 297123401,
    "EQUIPAMENT": "Punt Verd de Zona - Deixalleria de Vallbona",
    "SECCIO": "#",
    "TIPUS_VIA": "C",
    "NOM_CARRER": "Castelladral",
    "NUM_CARRER_1": 6,
    "NUM_CARRER_2": 10,
    "CODI_BARRI": 56,
    "NUM_BARRI": "Vallbona",
    "CODI_DISTRICTE": "08",
    "NOM_DISTRICTE": "Nou Barris",
    "CODI_POSTAL": "08033",
    "CODI_POBLACIO": "019",
    "POBLACIO": "BARCELONA",
    "LATITUD": 41.465022,
    "LONGITUD": 2.186038,
    "X_ETRS89": 432027.665,
    "Y_ETRS89": 4590700.742,
    "X_ED50": 432119.61,
    "Y_ED50": 4590901.757,
    "TELEFON_NUM": "",
    "TELEFON_TIPUS": "No tenen telèfon",
    "TELEFON_INFO_COM": "",
    "HORARI_PERIODE_INICI": "01/01",
    "HORARI_PERIODE_FI": "31/12",
    "HORARI_DIES": 1111111,
    "HORARI_HORES_INICI": "08:00:00",
    "HORARI_HORES_FI": "18:30:00",
    "HORARI_OBSERVACIONS": "",
    "3ER_NIVELL": "Punt verd",
    "2N_NIVELL": "Medi ambient",
    "1ER_NIVELL": "Medi ambient",
    "": ""
  },
  {
    "CODI_EQUIPAMENT": 297123401,
    "EQUIPAMENT": "Punt Verd de Zona - Deixalleria de Vallbona",
    "SECCIO": "#",
    "TIPUS_VIA": "C",
    "NOM_CARRER": "Castelladral",
    "NUM_CARRER_1": 6,
    "NUM_CARRER_2": 10,
    "CODI_BARRI": 56,
    "NUM_BARRI": "Vallbona",
    "CODI_DISTRICTE": "08",
    "NOM_DISTRICTE": "Nou Barris",
    "CODI_POSTAL": "08033",
    "CODI_POBLACIO": "019",
    "POBLACIO": "BARCELONA",
    "LATITUD": 41.465022,
    "LONGITUD": 2.186038,
    "X_ETRS89": 432027.665,
    "Y_ETRS89": 4590700.742,
    "X_ED50": 432119.61,
    "Y_ED50": 4590901.757,
    "TELEFON_NUM": "",
    "TELEFON_TIPUS": "No tenen telèfon",
    "TELEFON_INFO_COM": "",
    "HORARI_PERIODE_INICI": "01/01",
    "HORARI_PERIODE_FI": "31/12",
    "HORARI_DIES": 1111100,
    "HORARI_HORES_INICI": "09:00:00",
    "HORARI_HORES_FI": "13:00:00",
    "HORARI_OBSERVACIONS": "",
    "3ER_NIVELL": "Punt verd",
    "2N_NIVELL": "Medi ambient",
    "1ER_NIVELL": "Medi ambient",
    "": ""
  },
  {
    "CODI_EQUIPAMENT": 94075112530,
    "EQUIPAMENT": "Punt Verd de Zona - Deixalleria de Collserola",
    "SECCIO": "#",
    "TIPUS_VIA": "C",
    "NOM_CARRER": "Collserola",
    "NUM_CARRER_1": 2,
    "NUM_CARRER_2": 2,
    "CODI_BARRI": 28,
    "NUM_BARRI": "Vallcarca i els Penitents",
    "CODI_DISTRICTE": "06",
    "NOM_DISTRICTE": "Gràcia",
    "CODI_POSTAL": "08035",
    "CODI_POBLACIO": "019",
    "POBLACIO": "BARCELONA",
    "LATITUD": 41.416269,
    "LONGITUD": 2.136213,
    "X_ETRS89": 427812.811,
    "Y_ETRS89": 4585328.488,
    "X_ED50": 427904.718,
    "Y_ED50": 4585529.452,
    "TELEFON_NUM": "",
    "TELEFON_TIPUS": "No tenen telèfon",
    "TELEFON_INFO_COM": "",
    "HORARI_PERIODE_INICI": "01/01",
    "HORARI_PERIODE_FI": "31/12",
    "HORARI_DIES": 1111111,
    "HORARI_HORES_INICI": "08:00:00",
    "HORARI_HORES_FI": "18:30:00",
    "HORARI_OBSERVACIONS": "",
    "3ER_NIVELL": "Punt verd",
    "2N_NIVELL": "Medi ambient",
    "1ER_NIVELL": "Medi ambient",
    "": ""
  },
  {
    "CODI_EQUIPAMENT": 94075112530,
    "EQUIPAMENT": "Punt Verd de Zona - Deixalleria de Collserola",
    "SECCIO": "#",
    "TIPUS_VIA": "C",
    "NOM_CARRER": "Collserola",
    "NUM_CARRER_1": 2,
    "NUM_CARRER_2": 2,
    "CODI_BARRI": 28,
    "NUM_BARRI": "Vallcarca i els Penitents",
    "CODI_DISTRICTE": "06",
    "NOM_DISTRICTE": "Gràcia",
    "CODI_POSTAL": "08035",
    "CODI_POBLACIO": "019",
    "POBLACIO": "BARCELONA",
    "LATITUD": 41.416269,
    "LONGITUD": 2.136213,
    "X_ETRS89": 427812.811,
    "Y_ETRS89": 4585328.488,
    "X_ED50": 427904.718,
    "Y_ED50": 4585529.452,
    "TELEFON_NUM": "",
    "TELEFON_TIPUS": "No tenen telèfon",
    "TELEFON_INFO_COM": "",
    "HORARI_PERIODE_INICI": "01/01",
    "HORARI_PERIODE_FI": "31/12",
    "HORARI_DIES": 1111100,
    "HORARI_HORES_INICI": "09:00:00",
    "HORARI_HORES_FI": "13:00:00",
    "HORARI_OBSERVACIONS": "",
    "3ER_NIVELL": "Punt verd",
    "2N_NIVELL": "Medi ambient",
    "1ER_NIVELL": "Medi ambient",
    "": ""
  },
  {
    "CODI_EQUIPAMENT": 94075112530,
    "EQUIPAMENT": "Punt Verd de Zona - Deixalleria de Collserola",
    "SECCIO": "#",
    "TIPUS_VIA": "C",
    "NOM_CARRER": "Collserola",
    "NUM_CARRER_1": 2,
    "NUM_CARRER_2": 2,
    "CODI_BARRI": 28,
    "NUM_BARRI": "Vallcarca i els Penitents",
    "CODI_DISTRICTE": "06",
    "NOM_DISTRICTE": "Gràcia",
    "CODI_POSTAL": "08035",
    "CODI_POBLACIO": "019",
    "POBLACIO": "BARCELONA",
    "LATITUD": 41.416269,
    "LONGITUD": 2.136213,
    "X_ETRS89": 427812.811,
    "Y_ETRS89": 4585328.488,
    "X_ED50": 427904.718,
    "Y_ED50": 4585529.452,
    "TELEFON_NUM": "",
    "TELEFON_TIPUS": "No tenen telèfon",
    "TELEFON_INFO_COM": "",
    "HORARI_PERIODE_INICI": "01/01",
    "HORARI_PERIODE_FI": "31/12",
    "HORARI_DIES": 1111111,
    "HORARI_HORES_INICI": "08:00:00",
    "HORARI_HORES_FI": "18:30:00",
    "HORARI_OBSERVACIONS": "",
    "3ER_NIVELL": "",
    "2N_NIVELL": "Deixalleries - Punt verd de ciutat",
    "1ER_NIVELL": "Medi ambient",
    "": ""
  },
  {
    "CODI_EQUIPAMENT": 94075112530,
    "EQUIPAMENT": "Punt Verd de Zona - Deixalleria de Collserola",
    "SECCIO": "#",
    "TIPUS_VIA": "C",
    "NOM_CARRER": "Collserola",
    "NUM_CARRER_1": 2,
    "NUM_CARRER_2": 2,
    "CODI_BARRI": 28,
    "NUM_BARRI": "Vallcarca i els Penitents",
    "CODI_DISTRICTE": "06",
    "NOM_DISTRICTE": "Gràcia",
    "CODI_POSTAL": "08035",
    "CODI_POBLACIO": "019",
    "POBLACIO": "BARCELONA",
    "LATITUD": 41.416269,
    "LONGITUD": 2.136213,
    "X_ETRS89": 427812.811,
    "Y_ETRS89": 4585328.488,
    "X_ED50": 427904.718,
    "Y_ED50": 4585529.452,
    "TELEFON_NUM": "",
    "TELEFON_TIPUS": "No tenen telèfon",
    "TELEFON_INFO_COM": "",
    "HORARI_PERIODE_INICI": "01/01",
    "HORARI_PERIODE_FI": "31/12",
    "HORARI_DIES": 1111100,
    "HORARI_HORES_INICI": "09:00:00",
    "HORARI_HORES_FI": "13:00:00",
    "HORARI_OBSERVACIONS": "",
    "3ER_NIVELL": "",
    "2N_NIVELL": "Deixalleries - Punt verd de ciutat",
    "1ER_NIVELL": "Medi ambient",
    "": ""
  },
  {
    "CODI_EQUIPAMENT": 98162102313,
    "EQUIPAMENT": "Punt Verd de Zona - Deixalleria de Montjuïc",
    "SECCIO": "#",
    "TIPUS_VIA": "C",
    "NOM_CARRER": "Foc",
    "NUM_CARRER_1": 56,
    "NUM_CARRER_2": 56,
    "CODI_BARRI": 12,
    "NUM_BARRI": "la Marina del Prat Vermell",
    "CODI_DISTRICTE": "03",
    "NOM_DISTRICTE": "Sants-Montjuïc",
    "CODI_POSTAL": "08038",
    "CODI_POBLACIO": "019",
    "POBLACIO": "BARCELONA",
    "LATITUD": 41.355058,
    "LONGITUD": 2.139819,
    "X_ETRS89": 428046.695,
    "Y_ETRS89": 4578529.921,
    "X_ED50": 428138.606,
    "Y_ED50": 4578730.822,
    "TELEFON_NUM": "",
    "TELEFON_TIPUS": "No tenen telèfon",
    "TELEFON_INFO_COM": "",
    "HORARI_PERIODE_INICI": "01/01",
    "HORARI_PERIODE_FI": "31/12",
    "HORARI_DIES": 1111111,
    "HORARI_HORES_INICI": "08:00:00",
    "HORARI_HORES_FI": "18:30:00",
    "HORARI_OBSERVACIONS": "",
    "3ER_NIVELL": "",
    "2N_NIVELL": "Deixalleries - Punt verd de ciutat",
    "1ER_NIVELL": "Medi ambient",
    "": ""
  },
  {
    "CODI_EQUIPAMENT": 98162102313,
    "EQUIPAMENT": "Punt Verd de Zona - Deixalleria de Montjuïc",
    "SECCIO": "#",
    "TIPUS_VIA": "C",
    "NOM_CARRER": "Foc",
    "NUM_CARRER_1": 56,
    "NUM_CARRER_2": 56,
    "CODI_BARRI": 12,
    "NUM_BARRI": "la Marina del Prat Vermell",
    "CODI_DISTRICTE": "03",
    "NOM_DISTRICTE": "Sants-Montjuïc",
    "CODI_POSTAL": "08038",
    "CODI_POBLACIO": "019",
    "POBLACIO": "BARCELONA",
    "LATITUD": 41.355058,
    "LONGITUD": 2.139819,
    "X_ETRS89": 428046.695,
    "Y_ETRS89": 4578529.921,
    "X_ED50": 428138.606,
    "Y_ED50": 4578730.822,
    "TELEFON_NUM": "",
    "TELEFON_TIPUS": "No tenen telèfon",
    "TELEFON_INFO_COM": "",
    "HORARI_PERIODE_INICI": "01/01",
    "HORARI_PERIODE_FI": "31/12",
    "HORARI_DIES": 1111100,
    "HORARI_HORES_INICI": "09:00:00",
    "HORARI_HORES_FI": "13:00:00",
    "HORARI_OBSERVACIONS": "",
    "3ER_NIVELL": "",
    "2N_NIVELL": "Deixalleries - Punt verd de ciutat",
    "1ER_NIVELL": "Medi ambient",
    "": ""
  },
  {
    "CODI_EQUIPAMENT": 98162102313,
    "EQUIPAMENT": "Punt Verd de Zona - Deixalleria de Montjuïc",
    "SECCIO": "#",
    "TIPUS_VIA": "C",
    "NOM_CARRER": "Foc",
    "NUM_CARRER_1": 56,
    "NUM_CARRER_2": 56,
    "CODI_BARRI": 12,
    "NUM_BARRI": "la Marina del Prat Vermell",
    "CODI_DISTRICTE": "03",
    "NOM_DISTRICTE": "Sants-Montjuïc",
    "CODI_POSTAL": "08038",
    "CODI_POBLACIO": "019",
    "POBLACIO": "BARCELONA",
    "LATITUD": 41.355058,
    "LONGITUD": 2.139819,
    "X_ETRS89": 428046.695,
    "Y_ETRS89": 4578529.921,
    "X_ED50": 428138.606,
    "Y_ED50": 4578730.822,
    "TELEFON_NUM": "",
    "TELEFON_TIPUS": "No tenen telèfon",
    "TELEFON_INFO_COM": "",
    "HORARI_PERIODE_INICI": "01/01",
    "HORARI_PERIODE_FI": "31/12",
    "HORARI_DIES": 1111111,
    "HORARI_HORES_INICI": "08:00:00",
    "HORARI_HORES_FI": "18:30:00",
    "HORARI_OBSERVACIONS": "",
    "3ER_NIVELL": "Punt verd",
    "2N_NIVELL": "Medi ambient",
    "1ER_NIVELL": "Medi ambient",
    "": ""
  },
  {
    "CODI_EQUIPAMENT": 98162102313,
    "EQUIPAMENT": "Punt Verd de Zona - Deixalleria de Montjuïc",
    "SECCIO": "#",
    "TIPUS_VIA": "C",
    "NOM_CARRER": "Foc",
    "NUM_CARRER_1": 56,
    "NUM_CARRER_2": 56,
    "CODI_BARRI": 12,
    "NUM_BARRI": "la Marina del Prat Vermell",
    "CODI_DISTRICTE": "03",
    "NOM_DISTRICTE": "Sants-Montjuïc",
    "CODI_POSTAL": "08038",
    "CODI_POBLACIO": "019",
    "POBLACIO": "BARCELONA",
    "LATITUD": 41.355058,
    "LONGITUD": 2.139819,
    "X_ETRS89": 428046.695,
    "Y_ETRS89": 4578529.921,
    "X_ED50": 428138.606,
    "Y_ED50": 4578730.822,
    "TELEFON_NUM": "",
    "TELEFON_TIPUS": "No tenen telèfon",
    "TELEFON_INFO_COM": "",
    "HORARI_PERIODE_INICI": "01/01",
    "HORARI_PERIODE_FI": "31/12",
    "HORARI_DIES": 1111100,
    "HORARI_HORES_INICI": "09:00:00",
    "HORARI_HORES_FI": "13:00:00",
    "HORARI_OBSERVACIONS": "",
    "3ER_NIVELL": "Punt verd",
    "2N_NIVELL": "Medi ambient",
    "1ER_NIVELL": "Medi ambient",
    "": ""
  },
  {
    "CODI_EQUIPAMENT": 99138133135,
    "EQUIPAMENT": "Punt Verd de Zona - Deixalleria Vall d'Hebron",
    "SECCIO": "#",
    "TIPUS_VIA": "C",
    "NOM_CARRER": "Jorge Manrique",
    "NUM_CARRER_1": 2,
    "NUM_CARRER_2": 2,
    "CODI_BARRI": 41,
    "NUM_BARRI": "la Vall d'Hebron",
    "CODI_DISTRICTE": "07",
    "NOM_DISTRICTE": "Horta-Guinardó",
    "CODI_POSTAL": "08035",
    "CODI_POBLACIO": "019",
    "POBLACIO": "BARCELONA",
    "LATITUD": 41.431443,
    "LONGITUD": 2.153346,
    "X_ETRS89": 429261.108,
    "Y_ETRS89": 4586999.03,
    "X_ED50": 429353.028,
    "Y_ED50": 4587200.01,
    "TELEFON_NUM": "",
    "TELEFON_TIPUS": "No tenen telèfon",
    "TELEFON_INFO_COM": "",
    "HORARI_PERIODE_INICI": "01/01",
    "HORARI_PERIODE_FI": "31/12",
    "HORARI_DIES": "0000011",
    "HORARI_HORES_INICI": "08:00:00",
    "HORARI_HORES_FI": "18:30:00",
    "HORARI_OBSERVACIONS": "",
    "3ER_NIVELL": "",
    "2N_NIVELL": "Deixalleries - Punt verd de ciutat",
    "1ER_NIVELL": "Medi ambient",
    "": ""
  },
  {
    "CODI_EQUIPAMENT": 99138133135,
    "EQUIPAMENT": "Punt Verd de Zona - Deixalleria Vall d'Hebron",
    "SECCIO": "#",
    "TIPUS_VIA": "C",
    "NOM_CARRER": "Jorge Manrique",
    "NUM_CARRER_1": 2,
    "NUM_CARRER_2": 2,
    "CODI_BARRI": 41,
    "NUM_BARRI": "la Vall d'Hebron",
    "CODI_DISTRICTE": "07",
    "NOM_DISTRICTE": "Horta-Guinardó",
    "CODI_POSTAL": "08035",
    "CODI_POBLACIO": "019",
    "POBLACIO": "BARCELONA",
    "LATITUD": 41.431443,
    "LONGITUD": 2.153346,
    "X_ETRS89": 429261.108,
    "Y_ETRS89": 4586999.03,
    "X_ED50": 429353.028,
    "Y_ED50": 4587200.01,
    "TELEFON_NUM": "",
    "TELEFON_TIPUS": "No tenen telèfon",
    "TELEFON_INFO_COM": "",
    "HORARI_PERIODE_INICI": "01/01",
    "HORARI_PERIODE_FI": "31/12",
    "HORARI_DIES": "",
    "HORARI_HORES_INICI": "08:00:00",
    "HORARI_HORES_FI": "18:30:00",
    "HORARI_OBSERVACIONS": "",
    "3ER_NIVELL": "",
    "2N_NIVELL": "Deixalleries - Punt verd de ciutat",
    "1ER_NIVELL": "Medi ambient",
    "": ""
  },
  {
    "CODI_EQUIPAMENT": 99138133135,
    "EQUIPAMENT": "Punt Verd de Zona - Deixalleria Vall d'Hebron",
    "SECCIO": "#",
    "TIPUS_VIA": "C",
    "NOM_CARRER": "Jorge Manrique",
    "NUM_CARRER_1": 2,
    "NUM_CARRER_2": 2,
    "CODI_BARRI": 41,
    "NUM_BARRI": "la Vall d'Hebron",
    "CODI_DISTRICTE": "07",
    "NOM_DISTRICTE": "Horta-Guinardó",
    "CODI_POSTAL": "08035",
    "CODI_POBLACIO": "019",
    "POBLACIO": "BARCELONA",
    "LATITUD": 41.431443,
    "LONGITUD": 2.153346,
    "X_ETRS89": 429261.108,
    "Y_ETRS89": 4586999.03,
    "X_ED50": 429353.028,
    "Y_ED50": 4587200.01,
    "TELEFON_NUM": "",
    "TELEFON_TIPUS": "No tenen telèfon",
    "TELEFON_INFO_COM": "",
    "HORARI_PERIODE_INICI": "01/01",
    "HORARI_PERIODE_FI": "31/12",
    "HORARI_DIES": "",
    "HORARI_HORES_INICI": "08:00:00",
    "HORARI_HORES_FI": "16:00:00",
    "HORARI_OBSERVACIONS": "",
    "3ER_NIVELL": "",
    "2N_NIVELL": "Deixalleries - Punt verd de ciutat",
    "1ER_NIVELL": "Medi ambient",
    "": ""
  },
  {
    "CODI_EQUIPAMENT": 99138133135,
    "EQUIPAMENT": "Punt Verd de Zona - Deixalleria Vall d'Hebron",
    "SECCIO": "#",
    "TIPUS_VIA": "C",
    "NOM_CARRER": "Jorge Manrique",
    "NUM_CARRER_1": 2,
    "NUM_CARRER_2": 2,
    "CODI_BARRI": 41,
    "NUM_BARRI": "la Vall d'Hebron",
    "CODI_DISTRICTE": "07",
    "NOM_DISTRICTE": "Horta-Guinardó",
    "CODI_POSTAL": "08035",
    "CODI_POBLACIO": "019",
    "POBLACIO": "BARCELONA",
    "LATITUD": 41.431443,
    "LONGITUD": 2.153346,
    "X_ETRS89": 429261.108,
    "Y_ETRS89": 4586999.03,
    "X_ED50": 429353.028,
    "Y_ED50": 4587200.01,
    "TELEFON_NUM": "",
    "TELEFON_TIPUS": "No tenen telèfon",
    "TELEFON_INFO_COM": "",
    "HORARI_PERIODE_INICI": "01/01",
    "HORARI_PERIODE_FI": "31/12",
    "HORARI_DIES": 1111111,
    "HORARI_HORES_INICI": "08:00:00",
    "HORARI_HORES_FI": "16:00:00",
    "HORARI_OBSERVACIONS": "",
    "3ER_NIVELL": "",
    "2N_NIVELL": "Deixalleries - Punt verd de ciutat",
    "1ER_NIVELL": "Medi ambient",
    "": ""
  },
  {
    "CODI_EQUIPAMENT": 99138133135,
    "EQUIPAMENT": "Punt Verd de Zona - Deixalleria Vall d'Hebron",
    "SECCIO": "#",
    "TIPUS_VIA": "C",
    "NOM_CARRER": "Jorge Manrique",
    "NUM_CARRER_1": 2,
    "NUM_CARRER_2": 2,
    "CODI_BARRI": 41,
    "NUM_BARRI": "la Vall d'Hebron",
    "CODI_DISTRICTE": "07",
    "NOM_DISTRICTE": "Horta-Guinardó",
    "CODI_POSTAL": "08035",
    "CODI_POBLACIO": "019",
    "POBLACIO": "BARCELONA",
    "LATITUD": 41.431443,
    "LONGITUD": 2.153346,
    "X_ETRS89": 429261.108,
    "Y_ETRS89": 4586999.03,
    "X_ED50": 429353.028,
    "Y_ED50": 4587200.01,
    "TELEFON_NUM": "",
    "TELEFON_TIPUS": "No tenen telèfon",
    "TELEFON_INFO_COM": "",
    "HORARI_PERIODE_INICI": "01/01",
    "HORARI_PERIODE_FI": "31/12",
    "HORARI_DIES": 1111100,
    "HORARI_HORES_INICI": "09:00:00",
    "HORARI_HORES_FI": "13:00:00",
    "HORARI_OBSERVACIONS": "",
    "3ER_NIVELL": "",
    "2N_NIVELL": "Deixalleries - Punt verd de ciutat",
    "1ER_NIVELL": "Medi ambient",
    "": ""
  },
  {
    "CODI_EQUIPAMENT": 99138133135,
    "EQUIPAMENT": "Punt Verd de Zona - Deixalleria Vall d'Hebron",
    "SECCIO": "#",
    "TIPUS_VIA": "C",
    "NOM_CARRER": "Jorge Manrique",
    "NUM_CARRER_1": 2,
    "NUM_CARRER_2": 2,
    "CODI_BARRI": 41,
    "NUM_BARRI": "la Vall d'Hebron",
    "CODI_DISTRICTE": "07",
    "NOM_DISTRICTE": "Horta-Guinardó",
    "CODI_POSTAL": "08035",
    "CODI_POBLACIO": "019",
    "POBLACIO": "BARCELONA",
    "LATITUD": 41.431443,
    "LONGITUD": 2.153346,
    "X_ETRS89": 429261.108,
    "Y_ETRS89": 4586999.03,
    "X_ED50": 429353.028,
    "Y_ED50": 4587200.01,
    "TELEFON_NUM": "",
    "TELEFON_TIPUS": "No tenen telèfon",
    "TELEFON_INFO_COM": "",
    "HORARI_PERIODE_INICI": "01/01",
    "HORARI_PERIODE_FI": "31/12",
    "HORARI_DIES": "0000011",
    "HORARI_HORES_INICI": "08:00:00",
    "HORARI_HORES_FI": "18:30:00",
    "HORARI_OBSERVACIONS": "",
    "3ER_NIVELL": "Punt verd",
    "2N_NIVELL": "Medi ambient",
    "1ER_NIVELL": "Medi ambient",
    "": ""
  },
  {
    "CODI_EQUIPAMENT": 99138133135,
    "EQUIPAMENT": "Punt Verd de Zona - Deixalleria Vall d'Hebron",
    "SECCIO": "#",
    "TIPUS_VIA": "C",
    "NOM_CARRER": "Jorge Manrique",
    "NUM_CARRER_1": 2,
    "NUM_CARRER_2": 2,
    "CODI_BARRI": 41,
    "NUM_BARRI": "la Vall d'Hebron",
    "CODI_DISTRICTE": "07",
    "NOM_DISTRICTE": "Horta-Guinardó",
    "CODI_POSTAL": "08035",
    "CODI_POBLACIO": "019",
    "POBLACIO": "BARCELONA",
    "LATITUD": 41.431443,
    "LONGITUD": 2.153346,
    "X_ETRS89": 429261.108,
    "Y_ETRS89": 4586999.03,
    "X_ED50": 429353.028,
    "Y_ED50": 4587200.01,
    "TELEFON_NUM": "",
    "TELEFON_TIPUS": "No tenen telèfon",
    "TELEFON_INFO_COM": "",
    "HORARI_PERIODE_INICI": "01/01",
    "HORARI_PERIODE_FI": "31/12",
    "HORARI_DIES": "",
    "HORARI_HORES_INICI": "08:00:00",
    "HORARI_HORES_FI": "18:30:00",
    "HORARI_OBSERVACIONS": "",
    "3ER_NIVELL": "Punt verd",
    "2N_NIVELL": "Medi ambient",
    "1ER_NIVELL": "Medi ambient",
    "": ""
  },
  {
    "CODI_EQUIPAMENT": 99138133135,
    "EQUIPAMENT": "Punt Verd de Zona - Deixalleria Vall d'Hebron",
    "SECCIO": "#",
    "TIPUS_VIA": "C",
    "NOM_CARRER": "Jorge Manrique",
    "NUM_CARRER_1": 2,
    "NUM_CARRER_2": 2,
    "CODI_BARRI": 41,
    "NUM_BARRI": "la Vall d'Hebron",
    "CODI_DISTRICTE": "07",
    "NOM_DISTRICTE": "Horta-Guinardó",
    "CODI_POSTAL": "08035",
    "CODI_POBLACIO": "019",
    "POBLACIO": "BARCELONA",
    "LATITUD": 41.431443,
    "LONGITUD": 2.153346,
    "X_ETRS89": 429261.108,
    "Y_ETRS89": 4586999.03,
    "X_ED50": 429353.028,
    "Y_ED50": 4587200.01,
    "TELEFON_NUM": "",
    "TELEFON_TIPUS": "No tenen telèfon",
    "TELEFON_INFO_COM": "",
    "HORARI_PERIODE_INICI": "01/01",
    "HORARI_PERIODE_FI": "31/12",
    "HORARI_DIES": "",
    "HORARI_HORES_INICI": "08:00:00",
    "HORARI_HORES_FI": "16:00:00",
    "HORARI_OBSERVACIONS": "",
    "3ER_NIVELL": "Punt verd",
    "2N_NIVELL": "Medi ambient",
    "1ER_NIVELL": "Medi ambient",
    "": ""
  },
  {
    "CODI_EQUIPAMENT": 99138133135,
    "EQUIPAMENT": "Punt Verd de Zona - Deixalleria Vall d'Hebron",
    "SECCIO": "#",
    "TIPUS_VIA": "C",
    "NOM_CARRER": "Jorge Manrique",
    "NUM_CARRER_1": 2,
    "NUM_CARRER_2": 2,
    "CODI_BARRI": 41,
    "NUM_BARRI": "la Vall d'Hebron",
    "CODI_DISTRICTE": "07",
    "NOM_DISTRICTE": "Horta-Guinardó",
    "CODI_POSTAL": "08035",
    "CODI_POBLACIO": "019",
    "POBLACIO": "BARCELONA",
    "LATITUD": 41.431443,
    "LONGITUD": 2.153346,
    "X_ETRS89": 429261.108,
    "Y_ETRS89": 4586999.03,
    "X_ED50": 429353.028,
    "Y_ED50": 4587200.01,
    "TELEFON_NUM": "",
    "TELEFON_TIPUS": "No tenen telèfon",
    "TELEFON_INFO_COM": "",
    "HORARI_PERIODE_INICI": "01/01",
    "HORARI_PERIODE_FI": "31/12",
    "HORARI_DIES": 1111111,
    "HORARI_HORES_INICI": "08:00:00",
    "HORARI_HORES_FI": "16:00:00",
    "HORARI_OBSERVACIONS": "",
    "3ER_NIVELL": "Punt verd",
    "2N_NIVELL": "Medi ambient",
    "1ER_NIVELL": "Medi ambient",
    "": ""
  },
  {
    "CODI_EQUIPAMENT": 99138133135,
    "EQUIPAMENT": "Punt Verd de Zona - Deixalleria Vall d'Hebron",
    "SECCIO": "#",
    "TIPUS_VIA": "C",
    "NOM_CARRER": "Jorge Manrique",
    "NUM_CARRER_1": 2,
    "NUM_CARRER_2": 2,
    "CODI_BARRI": 41,
    "NUM_BARRI": "la Vall d'Hebron",
    "CODI_DISTRICTE": "07",
    "NOM_DISTRICTE": "Horta-Guinardó",
    "CODI_POSTAL": "08035",
    "CODI_POBLACIO": "019",
    "POBLACIO": "BARCELONA",
    "LATITUD": 41.431443,
    "LONGITUD": 2.153346,
    "X_ETRS89": 429261.108,
    "Y_ETRS89": 4586999.03,
    "X_ED50": 429353.028,
    "Y_ED50": 4587200.01,
    "TELEFON_NUM": "",
    "TELEFON_TIPUS": "No tenen telèfon",
    "TELEFON_INFO_COM": "",
    "HORARI_PERIODE_INICI": "01/01",
    "HORARI_PERIODE_FI": "31/12",
    "HORARI_DIES": 1111100,
    "HORARI_HORES_INICI": "09:00:00",
    "HORARI_HORES_FI": "13:00:00",
    "HORARI_OBSERVACIONS": "",
    "3ER_NIVELL": "Punt verd",
    "2N_NIVELL": "Medi ambient",
    "1ER_NIVELL": "Medi ambient",
    "": ""
  },
  {
    "CODI_EQUIPAMENT": 99400121453,
    "EQUIPAMENT": "Punt Verd de Zona - Deixalleria Fòrum",
    "SECCIO": "#",
    "TIPUS_VIA": "Av",
    "NOM_CARRER": "Litoral",
    "NUM_CARRER_1": 115,
    "NUM_CARRER_2": 115,
    "CODI_BARRI": 70,
    "NUM_BARRI": "el Besòs i el Maresme",
    "CODI_DISTRICTE": 10,
    "NOM_DISTRICTE": "Sant Martí",
    "CODI_POSTAL": "08005",
    "CODI_POBLACIO": "019",
    "POBLACIO": "BARCELONA",
    "LATITUD": 41.408466,
    "LONGITUD": 2.222254,
    "X_ETRS89": 434995.558,
    "Y_ETRS89": 4584394.145,
    "X_ED50": 435087.532,
    "Y_ED50": 4584595.103,
    "TELEFON_NUM": "",
    "TELEFON_TIPUS": "",
    "TELEFON_INFO_COM": "",
    "HORARI_PERIODE_INICI": "01/01",
    "HORARI_PERIODE_FI": "31/12",
    "HORARI_DIES": 1111111,
    "HORARI_HORES_INICI": "08:00:00",
    "HORARI_HORES_FI": "18:30:00",
    "HORARI_OBSERVACIONS": "",
    "3ER_NIVELL": "Punt verd",
    "2N_NIVELL": "Medi ambient",
    "1ER_NIVELL": "Medi ambient",
    "": ""
  },
  {
    "CODI_EQUIPAMENT": 99400121453,
    "EQUIPAMENT": "Punt Verd de Zona - Deixalleria Fòrum",
    "SECCIO": "#",
    "TIPUS_VIA": "Av",
    "NOM_CARRER": "Litoral",
    "NUM_CARRER_1": 115,
    "NUM_CARRER_2": 115,
    "CODI_BARRI": 70,
    "NUM_BARRI": "el Besòs i el Maresme",
    "CODI_DISTRICTE": 10,
    "NOM_DISTRICTE": "Sant Martí",
    "CODI_POSTAL": "08005",
    "CODI_POBLACIO": "019",
    "POBLACIO": "BARCELONA",
    "LATITUD": 41.408466,
    "LONGITUD": 2.222254,
    "X_ETRS89": 434995.558,
    "Y_ETRS89": 4584394.145,
    "X_ED50": 435087.532,
    "Y_ED50": 4584595.103,
    "TELEFON_NUM": "",
    "TELEFON_TIPUS": "",
    "TELEFON_INFO_COM": "",
    "HORARI_PERIODE_INICI": "01/01",
    "HORARI_PERIODE_FI": "31/12",
    "HORARI_DIES": 1111100,
    "HORARI_HORES_INICI": "09:00:00",
    "HORARI_HORES_FI": "13:00:00",
    "HORARI_OBSERVACIONS": "",
    "3ER_NIVELL": "Punt verd",
    "2N_NIVELL": "Medi ambient",
    "1ER_NIVELL": "Medi ambient",
    "": ""
  },
  {
    "CODI_EQUIPAMENT": 99400121453,
    "EQUIPAMENT": "Punt Verd de Zona - Deixalleria Fòrum",
    "SECCIO": "#",
    "TIPUS_VIA": "Av",
    "NOM_CARRER": "Litoral",
    "NUM_CARRER_1": 115,
    "NUM_CARRER_2": 115,
    "CODI_BARRI": 70,
    "NUM_BARRI": "el Besòs i el Maresme",
    "CODI_DISTRICTE": 10,
    "NOM_DISTRICTE": "Sant Martí",
    "CODI_POSTAL": "08005",
    "CODI_POBLACIO": "019",
    "POBLACIO": "BARCELONA",
    "LATITUD": 41.408466,
    "LONGITUD": 2.222254,
    "X_ETRS89": 434995.558,
    "Y_ETRS89": 4584394.145,
    "X_ED50": 435087.532,
    "Y_ED50": 4584595.103,
    "TELEFON_NUM": "",
    "TELEFON_TIPUS": "",
    "TELEFON_INFO_COM": "",
    "HORARI_PERIODE_INICI": "01/01",
    "HORARI_PERIODE_FI": "31/12",
    "HORARI_DIES": 1111111,
    "HORARI_HORES_INICI": "08:00:00",
    "HORARI_HORES_FI": "18:30:00",
    "HORARI_OBSERVACIONS": "",
    "3ER_NIVELL": "",
    "2N_NIVELL": "Deixalleries - Punt verd de ciutat",
    "1ER_NIVELL": "Medi ambient",
    "": ""
  },
  {
    "CODI_EQUIPAMENT": 99400121453,
    "EQUIPAMENT": "Punt Verd de Zona - Deixalleria Fòrum",
    "SECCIO": "#",
    "TIPUS_VIA": "Av",
    "NOM_CARRER": "Litoral",
    "NUM_CARRER_1": 115,
    "NUM_CARRER_2": 115,
    "CODI_BARRI": 70,
    "NUM_BARRI": "el Besòs i el Maresme",
    "CODI_DISTRICTE": 10,
    "NOM_DISTRICTE": "Sant Martí",
    "CODI_POSTAL": "08005",
    "CODI_POBLACIO": "019",
    "POBLACIO": "BARCELONA",
    "LATITUD": 41.408466,
    "LONGITUD": 2.222254,
    "X_ETRS89": 434995.558,
    "Y_ETRS89": 4584394.145,
    "X_ED50": 435087.532,
    "Y_ED50": 4584595.103,
    "TELEFON_NUM": "",
    "TELEFON_TIPUS": "",
    "TELEFON_INFO_COM": "",
    "HORARI_PERIODE_INICI": "01/01",
    "HORARI_PERIODE_FI": "31/12",
    "HORARI_DIES": 1111100,
    "HORARI_HORES_INICI": "09:00:00",
    "HORARI_HORES_FI": "13:00:00",
    "HORARI_OBSERVACIONS": "",
    "3ER_NIVELL": "",
    "2N_NIVELL": "Deixalleries - Punt verd de ciutat",
    "1ER_NIVELL": "Medi ambient",
    "": ""
  }
]