{
    "flow": [
        {
            "create_in_hive": {
                "sql_1": "CREATE TABLE IF NOT EXISTS вв (        actual_date string,        вава,        ва double,        ва_pct double ) PARTITIONED BY (`snap_date` string) STORED AS PARQUET"
            },
            "processing": {
                "columns": "ав",
                "input_custom_prepare_vector": "na",
                "input_fill_na": "1",
                "input_missing_na_value": "-1000000000",
                "model_missing_na_value": "-1000000000",
                "output_column_name": "ва",
                "output_index": "0",
                "output_scalar": "0"
            },
            "read_from_hive": {
                "sql_1": "SELECT ввы, ав FROM ааа"
            },
            "write_to_hive": {
                "sql_1": "INSERT OVERWRITE TABLE вв  PARTITION (SNAP_DATE = '$outer_start_prev_week')  SELECT CURRENT_DATE() AS actual_date,        вава,        ва,        ntile(100) over (order by ва) as ва_pct FROM temp"
            }
        }
    ],
    "metadata": {
        "algorithm": {
            "type": "xgboost",
            "version": "0.90"
        },
        "entity_name": "test_after_merge_vlatest_prod",
        "entity_shared_id": "test_after_merge_vlatest_prod",
        "entity_version": "1.0.0",
        "project_name": "test_after_merge_vlatest_prod",
        "project_shared_id": "test_after_merge_vlatest_prod",
        "project_version": "1.0.0"
    }
}