<?xml version="1.0" encoding="UTF-8"?>
<bpmn:definitions xmlns:bpmn="http://www.omg.org/spec/BPMN/20100524/MODEL" xmlns:bpmndi="http://www.omg.org/spec/BPMN/20100524/DI" xmlns:dc="http://www.omg.org/spec/DD/20100524/DC" xmlns:di="http://www.omg.org/spec/DD/20100524/DI" xmlns:camunda="http://camunda.org/schema/1.0/bpmn" xmlns:xsi="http://www.w3.org/2001/XMLSchema-instance" id="definitions_1xz0zfm" targetNamespace="http://bpmn.io/schema/bpmn" exporter="Camunda Modeler" exporterVersion="4.2.0">
  <bpmn:process id="generating_config_and_start_windml" name="Создание и конфигурационного файла и запуск WindML" isExecutable="true">
    <bpmn:documentation>initprod</bpmn:documentation>
    <bpmn:laneSet id="laneset_1bo72q6">
      <bpmn:lane id="lane_0p0csk8" name="po">
        <bpmn:flowNodeRef>activity_0cvrq12u</bpmn:flowNodeRef>
        <bpmn:flowNodeRef>activity_00u372bp</bpmn:flowNodeRef>
        <bpmn:flowNodeRef>create_config_file_and_commit_on_git</bpmn:flowNodeRef>
        <bpmn:flowNodeRef>sumk_deployment</bpmn:flowNodeRef>
        <bpmn:flowNodeRef>gateway_1lj3w9e</bpmn:flowNodeRef>
        <bpmn:flowNodeRef>fill_sumk_windml_attributes</bpmn:flowNodeRef>
        <bpmn:flowNodeRef>windml_fill_attributes_inprod</bpmn:flowNodeRef>
        <bpmn:flowNodeRef>activity_1tg09kr</bpmn:flowNodeRef>
        <bpmn:flowNodeRef>check_filles_attributes_for_sql</bpmn:flowNodeRef>
        <bpmn:flowNodeRef>gateway_18t7skq</bpmn:flowNodeRef>
        <bpmn:flowNodeRef>windml_launch</bpmn:flowNodeRef>
        <bpmn:flowNodeRef>endevent_1q12grf</bpmn:flowNodeRef>
        <bpmn:flowNodeRef>pickle_path</bpmn:flowNodeRef>
        <bpmn:flowNodeRef>startevent_1</bpmn:flowNodeRef>
        <bpmn:flowNodeRef>activity_167tln2</bpmn:flowNodeRef>
        <bpmn:flowNodeRef>Activity_1eiuvc6</bpmn:flowNodeRef>
      </bpmn:lane>
    </bpmn:laneSet>
    <bpmn:startEvent id="startevent_1" name="Старт">
      <bpmn:outgoing>sequenceflow_02nggno</bpmn:outgoing>
    </bpmn:startEvent>
    <bpmn:sequenceFlow id="sequenceflow_02nggno" sourceRef="startevent_1" targetRef="pickle_path" />
    <bpmn:userTask id="pickle_path" name="Указание пути до бинарного файла модели">
      <bpmn:extensionElements>
        <camunda:inputOutput>
          <camunda:outputParameter name="pickle_model_dev">${pickle_model_dev}</camunda:outputParameter>
        </camunda:inputOutput>
      </bpmn:extensionElements>
      <bpmn:incoming>sequenceflow_02nggno</bpmn:incoming>
      <bpmn:outgoing>Flow_10pq490</bpmn:outgoing>
    </bpmn:userTask>
    <bpmn:endEvent id="endevent_1q12grf" name="Шаг &#34;Запуск модели на Pre-Prod&#34;">
      <bpmn:incoming>flow_0j6scah</bpmn:incoming>
    </bpmn:endEvent>
    <bpmn:sequenceFlow id="flow_0j6scah" sourceRef="activity_0cvrq12u" targetRef="endevent_1q12grf" />
    <bpmn:callActivity id="activity_0cvrq12u" name="Переход на следующую диаграмму" calledElement="new_instance_tech_step">
      <bpmn:extensionElements>
        <camunda:in sourceExpression="${ execution.getProcessInstanceId() }" target="instance" />
        <camunda:in businessKey="#{execution.processBusinessKey}" />
        <camunda:in sourceExpression="${choice}" target="choice" />
        <camunda:in sourceExpression="${&#34;windml.model.run&#34;}" target="default_path" />
      </bpmn:extensionElements>
      <bpmn:incoming>flow_13w3ezv</bpmn:incoming>
      <bpmn:outgoing>flow_0j6scah</bpmn:outgoing>
    </bpmn:callActivity>
    <bpmn:sequenceFlow id="flow_13w3ezv" sourceRef="activity_00u372bp" targetRef="activity_0cvrq12u" />
    <bpmn:userTask id="activity_00u372bp" name="Переход по стандартному сценарию (Запуск модели на Pre-Prod)">
      <bpmn:extensionElements>
        <camunda:inputOutput>
          <camunda:outputParameter name="choice">${choice}</camunda:outputParameter>
        </camunda:inputOutput>
      </bpmn:extensionElements>
      <bpmn:incoming>Flow_0kb8g4c</bpmn:incoming>
      <bpmn:outgoing>flow_13w3ezv</bpmn:outgoing>
    </bpmn:userTask>
    <bpmn:sequenceFlow id="flow_1wrtv0e" sourceRef="create_config_file_and_commit_on_git" targetRef="windml_launch" />
    <bpmn:callActivity id="create_config_file_and_commit_on_git" name="Создание конфигурационного файла Windml и отправка на Git" calledElement="git.file.create">
      <bpmn:documentation>initprod</bpmn:documentation>
      <bpmn:extensionElements>
        <camunda:in businessKey="#{execution.processBusinessKey}" />
        <camunda:in source="${&#34;git.file.create&#34;}" target="dafault_path" />
        <camunda:in sourceExpression="${ execution.getProcessInstanceId() }" target="instance" />
      </bpmn:extensionElements>
      <bpmn:incoming>flow_0ucd291</bpmn:incoming>
      <bpmn:outgoing>flow_1wrtv0e</bpmn:outgoing>
    </bpmn:callActivity>
    <bpmn:userTask id="sumk_deployment" name="Планируется ли выгрузка в СУМК?">
      <bpmn:extensionElements>
        <camunda:inputOutput>
          <camunda:outputParameter name="sumk_approve">${sumk_approve}</camunda:outputParameter>
        </camunda:inputOutput>
      </bpmn:extensionElements>
      <bpmn:incoming>Flow_1i67cck</bpmn:incoming>
      <bpmn:outgoing>Flow_046znwf</bpmn:outgoing>
    </bpmn:userTask>
    <bpmn:sequenceFlow id="Flow_046znwf" sourceRef="sumk_deployment" targetRef="gateway_1lj3w9e" />
    <bpmn:exclusiveGateway id="gateway_1lj3w9e">
      <bpmn:incoming>Flow_046znwf</bpmn:incoming>
      <bpmn:outgoing>flow_1xprdyj</bpmn:outgoing>
      <bpmn:outgoing>flow_0gdosme</bpmn:outgoing>
    </bpmn:exclusiveGateway>
    <bpmn:sequenceFlow id="flow_1xprdyj" name="Нет" sourceRef="gateway_1lj3w9e" targetRef="check_filles_attributes_for_sql">
      <bpmn:conditionExpression xsi:type="bpmn:tFormalExpression">${sumk_approve == 'Нет'}</bpmn:conditionExpression>
    </bpmn:sequenceFlow>
    <bpmn:sequenceFlow id="flow_0gdosme" name="Да" sourceRef="gateway_1lj3w9e" targetRef="fill_sumk_windml_attributes">
      <bpmn:conditionExpression xsi:type="bpmn:tFormalExpression">${sumk_approve == 'Да'}</bpmn:conditionExpression>
    </bpmn:sequenceFlow>
    <bpmn:userTask id="fill_sumk_windml_attributes" name="Заполнение атрибутов для выгрузки в СУМК">
      <bpmn:extensionElements>
        <camunda:inputOutput>
          <camunda:outputParameter name="windml_export_to_sumk_input_table">${windml_export_to_sumk_input_table}</camunda:outputParameter>
          <camunda:outputParameter name="windml_export_to_sumk_where_clause">${windml_export_to_sumk_where_clause}</camunda:outputParameter>
          <camunda:outputParameter name="windml_export_to_sumk_prob">${windml_export_to_sumk_prob}</camunda:outputParameter>
          <camunda:outputParameter name="windml_export_to_sumk_snap_date">${windml_export_to_sumk_snap_date}</camunda:outputParameter>
          <camunda:outputParameter name="windml_export_to_sumk_filial_id">${windml_export_to_sumk_filial_id}</camunda:outputParameter>
        </camunda:inputOutput>
      </bpmn:extensionElements>
      <bpmn:incoming>flow_0gdosme</bpmn:incoming>
      <bpmn:outgoing>Flow_0d7pbus</bpmn:outgoing>
    </bpmn:userTask>
    <bpmn:sequenceFlow id="Flow_0d7pbus" sourceRef="fill_sumk_windml_attributes" targetRef="check_filles_attributes_for_sql" />
    <bpmn:sequenceFlow id="flow_0ucd291" sourceRef="windml_fill_attributes_inprod" targetRef="create_config_file_and_commit_on_git" />
    <bpmn:sequenceFlow id="flow_0st7zsc" sourceRef="activity_1tg09kr" targetRef="windml_fill_attributes_inprod" />
    <bpmn:userTask id="windml_fill_attributes_inprod" name="Заполнение конфигурационного файла типовой задачи">
      <bpmn:extensionElements>
        <camunda:inputOutput>
          <camunda:outputParameter name="windml_type">${windml_type}</camunda:outputParameter>
          <camunda:outputParameter name="windml_sql_1">${windml_sql_1}</camunda:outputParameter>
          <camunda:outputParameter name="windml_output_column_name">${windml_output_column_name}</camunda:outputParameter>
          <camunda:outputParameter name="windml_output_scalar">${windml_output_scalar}</camunda:outputParameter>
          <camunda:outputParameter name="windml_output_index">${windml_output_index}</camunda:outputParameter>
          <camunda:outputParameter name="windml_input_fill_na">${windml_input_fill_na}</camunda:outputParameter>
          <camunda:outputParameter name="windml_input_missing_na_value">${windml_input_missing_na_value}</camunda:outputParameter>
          <camunda:outputParameter name="windml_input_custom_prepare_vector">${windml_input_custom_prepare_vector}</camunda:outputParameter>
          <camunda:outputParameter name="windml_model_missing_na_value">${windml_model_missing_na_value}</camunda:outputParameter>
          <camunda:outputParameter name="windml_sql_2">${windml_sql_2}</camunda:outputParameter>
          <camunda:outputParameter name="windml_sql_3">${windml_sql_3}</camunda:outputParameter>
          <camunda:outputParameter name="windml_source_sql">${windml_source_sql}</camunda:outputParameter>
          <camunda:outputParameter name="windml_validation">${windml_validation}</camunda:outputParameter>
          <camunda:outputParameter name="windml_export_to_sumk_input_table">${windml_export_to_sumk_input_table}</camunda:outputParameter>
          <camunda:outputParameter name="windml_export_to_sumk_where_clause">${windml_export_to_sumk_where_clause}</camunda:outputParameter>
          <camunda:outputParameter name="windml_export_to_sumk_prob">${windml_export_to_sumk_prob}</camunda:outputParameter>
          <camunda:outputParameter name="windml_export_to_sumk_snap_date">${windml_export_to_sumk_snap_date}</camunda:outputParameter>
          <camunda:outputParameter name="windml_export_to_sumk_filial_id">${windml_export_to_sumk_filial_id}</camunda:outputParameter>
          <camunda:outputParameter name="windml_features">${windml_features}</camunda:outputParameter>
          <camunda:outputParameter name="windml_sql_create">${windml_sql_create}</camunda:outputParameter>
          <camunda:outputParameter name="windml_use_oracle">${windml_use_oracle}</camunda:outputParameter>
        </camunda:inputOutput>
      </bpmn:extensionElements>
      <bpmn:incoming>flow_0st7zsc</bpmn:incoming>
      <bpmn:incoming>flow_0y8yfpu</bpmn:incoming>
      <bpmn:outgoing>flow_0ucd291</bpmn:outgoing>
    </bpmn:userTask>
    <bpmn:serviceTask id="activity_1tg09kr" name="Генерация sql-запросов" camunda:asyncBefore="true" camunda:type="external" camunda:topic="sync-windml">
      <bpmn:extensionElements>
        <camunda:inputOutput>
          <camunda:inputParameter name="method">windml.sql.build</camunda:inputParameter>
        </camunda:inputOutput>
      </bpmn:extensionElements>
      <bpmn:incoming>Flow_1fzaat6</bpmn:incoming>
      <bpmn:outgoing>flow_0st7zsc</bpmn:outgoing>
    </bpmn:serviceTask>
    <bpmn:sequenceFlow id="flow_0ywtgcm" sourceRef="windml_launch" targetRef="gateway_18t7skq" />
    <bpmn:sequenceFlow id="Flow_1fzaat6" sourceRef="check_filles_attributes_for_sql" targetRef="activity_1tg09kr" />
    <bpmn:userTask id="check_filles_attributes_for_sql" name="Проверка, заполнены ли атрибуты для генерации SQL">
      <bpmn:extensionElements>
        <camunda:inputOutput>
          <camunda:outputParameter name="table_name">${table_name}</camunda:outputParameter>
          <camunda:outputParameter name="out_table_name_hive">${out_table_name_hive}</camunda:outputParameter>
          <camunda:outputParameter name="date_for_partition">${date_for_partition}</camunda:outputParameter>
          <camunda:outputParameter name="windml_features">${windml_features}</camunda:outputParameter>
          <camunda:outputParameter name="windml_other_input_columns">${windml_other_input_columns}</camunda:outputParameter>
          <camunda:outputParameter name="windml_output_columns">${windml_output_columns}</camunda:outputParameter>
          <camunda:outputParameter name="windml_output_column_name">${windml_output_column_name}</camunda:outputParameter>
          <camunda:outputParameter name="out_table_name_oracle">${out_table_name_oracle}</camunda:outputParameter>
          <camunda:outputParameter name="windml_use_oracle">${windml_use_oracle}</camunda:outputParameter>
        </camunda:inputOutput>
      </bpmn:extensionElements>
      <bpmn:incoming>flow_1xprdyj</bpmn:incoming>
      <bpmn:incoming>Flow_0d7pbus</bpmn:incoming>
      <bpmn:outgoing>Flow_1fzaat6</bpmn:outgoing>
    </bpmn:userTask>
    <bpmn:exclusiveGateway id="gateway_18t7skq" default="flow_0y8yfpu">
      <bpmn:incoming>flow_0ywtgcm</bpmn:incoming>
      <bpmn:outgoing>flow_0y8yfpu</bpmn:outgoing>
      <bpmn:outgoing>Flow_0kb8g4c</bpmn:outgoing>
    </bpmn:exclusiveGateway>
    <bpmn:callActivity id="windml_launch" name="Запуск WindML" calledElement="gitlab_windml_ci_cd">
      <bpmn:documentation>initprod</bpmn:documentation>
      <bpmn:extensionElements>
        <camunda:out source="is_windml_launch_successfull" target="is_windml_launch_successfull" />
        <camunda:in sourceExpression="${ execution.getProcessInstanceId() }" target="instance" />
      </bpmn:extensionElements>
      <bpmn:incoming>flow_1wrtv0e</bpmn:incoming>
      <bpmn:outgoing>flow_0ywtgcm</bpmn:outgoing>
    </bpmn:callActivity>
    <bpmn:sequenceFlow id="flow_0y8yfpu" name="Нет" sourceRef="gateway_18t7skq" targetRef="windml_fill_attributes_inprod" />
    <bpmn:callActivity id="activity_167tln2" name="Копирование файла модели из dev-rep в prod-rep" calledElement="git.copy">
      <bpmn:documentation>initprod</bpmn:documentation>
      <bpmn:extensionElements>
        <camunda:in businessKey="#{execution.processBusinessKey}" />
        <camunda:in source="${&#34;git.copy&#34;}" target="dafault_path" />
        <camunda:in sourceExpression="${ execution.getProcessInstanceId() }" target="instance" />
      </bpmn:extensionElements>
      <bpmn:incoming>Flow_10pq490</bpmn:incoming>
      <bpmn:outgoing>Flow_14n8pip</bpmn:outgoing>
    </bpmn:callActivity>
    <bpmn:sequenceFlow id="Flow_0kb8g4c" name="Да" sourceRef="gateway_18t7skq" targetRef="activity_00u372bp">
      <bpmn:conditionExpression xsi:type="bpmn:tFormalExpression">${is_windml_launch_successfull == true}</bpmn:conditionExpression>
    </bpmn:sequenceFlow>
    <bpmn:sequenceFlow id="Flow_10pq490" sourceRef="pickle_path" targetRef="activity_167tln2" />
    <bpmn:callActivity id="Activity_1eiuvc6" name="Runner enable" calledElement="gitlab.runner.enable">
      <bpmn:extensionElements>
        <camunda:in sourceExpression="${ execution.getProcessInstanceId() }" target="instance" />
      </bpmn:extensionElements>
      <bpmn:incoming>Flow_14n8pip</bpmn:incoming>
      <bpmn:outgoing>Flow_1i67cck</bpmn:outgoing>
    </bpmn:callActivity>
    <bpmn:sequenceFlow id="Flow_1i67cck" sourceRef="Activity_1eiuvc6" targetRef="sumk_deployment" />
    <bpmn:sequenceFlow id="Flow_14n8pip" sourceRef="activity_167tln2" targetRef="Activity_1eiuvc6" />
    <bpmn:textAnnotation id="textannotation_1kzh20o">
      <bpmn:text>1)БФТ на продуктивизацию
2)Атрибуты и сущности Wiki
3)БФТ на витрину для моделирования
4)БФТ на витрину для мониторинга
5)БФТ на витрину для переобучения</bpmn:text>
    </bpmn:textAnnotation>
    <bpmn:association id="association_1u47qxw" sourceRef="startevent_1" targetRef="textannotation_1kzh20o" />
  </bpmn:process>
  <bpmndi:BPMNDiagram id="bpmndiagram_1">
    <bpmndi:BPMNPlane id="bpmnplane_1" bpmnElement="generating_config_and_start_windml">
      <bpmndi:BPMNShape id="lane_0p0csk8_di" bpmnElement="lane_0p0csk8" isHorizontal="true">
        <dc:Bounds x="160" y="40" width="2210" height="360" />
      </bpmndi:BPMNShape>
      <bpmndi:BPMNEdge id="Flow_10pq490_di" bpmnElement="Flow_10pq490">
        <di:waypoint x="450" y="240" />
        <di:waypoint x="500" y="240" />
      </bpmndi:BPMNEdge>
      <bpmndi:BPMNEdge id="Flow_0kb8g4c_di" bpmnElement="Flow_0kb8g4c">
        <di:waypoint x="1825" y="240" />
        <di:waypoint x="1900" y="240" />
        <bpmndi:BPMNLabel>
          <dc:Bounds x="1855" y="222" width="15" height="14" />
        </bpmndi:BPMNLabel>
      </bpmndi:BPMNEdge>
      <bpmndi:BPMNEdge id="Flow_0y8yfpu_di" bpmnElement="flow_0y8yfpu">
        <di:waypoint x="1800" y="215" />
        <di:waypoint x="1800" y="140" />
        <di:waypoint x="1420" y="140" />
        <di:waypoint x="1420" y="200" />
        <bpmndi:BPMNLabel>
          <dc:Bounds x="1601" y="122" width="19" height="14" />
        </bpmndi:BPMNLabel>
      </bpmndi:BPMNEdge>
      <bpmndi:BPMNEdge id="Flow_1fzaat6_di" bpmnElement="Flow_1fzaat6">
        <di:waypoint x="1210" y="240" />
        <di:waypoint x="1240" y="240" />
      </bpmndi:BPMNEdge>
      <bpmndi:BPMNEdge id="Flow_0ywtgcm_di" bpmnElement="flow_0ywtgcm">
        <di:waypoint x="1730" y="240" />
        <di:waypoint x="1775" y="240" />
      </bpmndi:BPMNEdge>
      <bpmndi:BPMNEdge id="Flow_0st7zsc_di" bpmnElement="flow_0st7zsc">
        <di:waypoint x="1340" y="240" />
        <di:waypoint x="1370" y="240" />
      </bpmndi:BPMNEdge>
      <bpmndi:BPMNEdge id="Flow_0ucd291_di" bpmnElement="flow_0ucd291">
        <di:waypoint x="1470" y="240" />
        <di:waypoint x="1500" y="240" />
      </bpmndi:BPMNEdge>
      <bpmndi:BPMNEdge id="Flow_0d7pbus_di" bpmnElement="Flow_0d7pbus">
        <di:waypoint x="1050" y="111" />
        <di:waypoint x="1160" y="111" />
        <di:waypoint x="1160" y="200" />
      </bpmndi:BPMNEdge>
      <bpmndi:BPMNEdge id="Flow_0gdosme_di" bpmnElement="flow_0gdosme">
        <di:waypoint x="1000" y="215" />
        <di:waypoint x="1000" y="151" />
        <bpmndi:BPMNLabel>
          <dc:Bounds x="1008" y="180" width="15" height="14" />
        </bpmndi:BPMNLabel>
      </bpmndi:BPMNEdge>
      <bpmndi:BPMNEdge id="Flow_1xprdyj_di" bpmnElement="flow_1xprdyj">
        <di:waypoint x="1025" y="240" />
        <di:waypoint x="1110" y="240" />
        <bpmndi:BPMNLabel>
          <dc:Bounds x="1059" y="222" width="19" height="14" />
        </bpmndi:BPMNLabel>
      </bpmndi:BPMNEdge>
      <bpmndi:BPMNEdge id="Flow_046znwf_di" bpmnElement="Flow_046znwf">
        <di:waypoint x="920" y="240" />
        <di:waypoint x="975" y="240" />
      </bpmndi:BPMNEdge>
      <bpmndi:BPMNEdge id="flow_1wrtv0e_di" bpmnElement="flow_1wrtv0e">
        <di:waypoint x="1600" y="240" />
        <di:waypoint x="1630" y="240" />
      </bpmndi:BPMNEdge>
      <bpmndi:BPMNEdge id="flow_13w3ezv_di" bpmnElement="flow_13w3ezv">
        <di:waypoint x="2000" y="240" />
        <di:waypoint x="2040" y="240" />
      </bpmndi:BPMNEdge>
      <bpmndi:BPMNEdge id="flow_0j6scah_di" bpmnElement="flow_0j6scah">
        <di:waypoint x="2140" y="240" />
        <di:waypoint x="2202" y="240" />
      </bpmndi:BPMNEdge>
      <bpmndi:BPMNEdge id="sequenceflow_02nggno_di" bpmnElement="sequenceflow_02nggno">
        <di:waypoint x="278" y="240" />
        <di:waypoint x="350" y="240" />
      </bpmndi:BPMNEdge>
      <bpmndi:BPMNEdge id="Flow_1i67cck_di" bpmnElement="Flow_1i67cck">
        <di:waypoint x="760" y="240" />
        <di:waypoint x="820" y="240" />
      </bpmndi:BPMNEdge>
      <bpmndi:BPMNEdge id="Flow_14n8pip_di" bpmnElement="Flow_14n8pip">
        <di:waypoint x="600" y="240" />
        <di:waypoint x="660" y="240" />
      </bpmndi:BPMNEdge>
      <bpmndi:BPMNShape id="_bpmnshape_startevent_2" bpmnElement="startevent_1">
        <dc:Bounds x="242" y="222" width="36" height="36" />
        <bpmndi:BPMNLabel>
          <dc:Bounds x="246" y="265" width="30" height="14" />
        </bpmndi:BPMNLabel>
      </bpmndi:BPMNShape>
      <bpmndi:BPMNShape id="activity_0dbnbls_di" bpmnElement="pickle_path">
        <dc:Bounds x="350" y="200" width="100" height="80" />
      </bpmndi:BPMNShape>
      <bpmndi:BPMNShape id="endevent_1q12grf_di" bpmnElement="endevent_1q12grf">
        <dc:Bounds x="2202" y="222" width="36" height="36" />
        <bpmndi:BPMNLabel>
          <dc:Bounds x="2183" y="265" width="78" height="40" />
        </bpmndi:BPMNLabel>
      </bpmndi:BPMNShape>
      <bpmndi:BPMNShape id="activity_08eflss_di" bpmnElement="activity_0cvrq12u">
        <dc:Bounds x="2040" y="200" width="100" height="80" />
      </bpmndi:BPMNShape>
      <bpmndi:BPMNShape id="activity_0n3tgy2_di" bpmnElement="activity_00u372bp">
        <dc:Bounds x="1900" y="200" width="100" height="80" />
      </bpmndi:BPMNShape>
      <bpmndi:BPMNShape id="activity_0143xw8_di" bpmnElement="create_config_file_and_commit_on_git">
        <dc:Bounds x="1500" y="200" width="100" height="80" />
      </bpmndi:BPMNShape>
      <bpmndi:BPMNShape id="Activity_1rel7or_di" bpmnElement="sumk_deployment">
        <dc:Bounds x="820" y="200" width="100" height="80" />
      </bpmndi:BPMNShape>
      <bpmndi:BPMNShape id="Gateway_1lj3w9e_di" bpmnElement="gateway_1lj3w9e" isMarkerVisible="true">
        <dc:Bounds x="975" y="215" width="50" height="50" />
      </bpmndi:BPMNShape>
      <bpmndi:BPMNShape id="Activity_1buxka5_di" bpmnElement="fill_sumk_windml_attributes">
        <dc:Bounds x="950" y="71" width="100" height="80" />
      </bpmndi:BPMNShape>
      <bpmndi:BPMNShape id="Activity_1fatv20_di" bpmnElement="windml_fill_attributes_inprod">
        <dc:Bounds x="1370" y="200" width="100" height="80" />
      </bpmndi:BPMNShape>
      <bpmndi:BPMNShape id="Activity_1q5mrau_di" bpmnElement="activity_1tg09kr">
        <dc:Bounds x="1240" y="200" width="100" height="80" />
      </bpmndi:BPMNShape>
      <bpmndi:BPMNShape id="Activity_1hqhubk_di" bpmnElement="check_filles_attributes_for_sql">
        <dc:Bounds x="1110" y="200" width="100" height="80" />
      </bpmndi:BPMNShape>
      <bpmndi:BPMNShape id="Gateway_18t7skq_di" bpmnElement="gateway_18t7skq" isMarkerVisible="true">
        <dc:Bounds x="1775" y="215" width="50" height="50" />
      </bpmndi:BPMNShape>
      <bpmndi:BPMNShape id="Activity_1v59xod_di" bpmnElement="windml_launch">
        <dc:Bounds x="1630" y="200" width="100" height="80" />
      </bpmndi:BPMNShape>
      <bpmndi:BPMNShape id="textannotation_1kzh20o_di" bpmnElement="textannotation_1kzh20o">
        <dc:Bounds x="170" y="70" width="270" height="81" />
      </bpmndi:BPMNShape>
      <bpmndi:BPMNShape id="Activity_167tln2_di" bpmnElement="activity_167tln2">
        <dc:Bounds x="500" y="200" width="100" height="80" />
      </bpmndi:BPMNShape>
      <bpmndi:BPMNShape id="Activity_17cdghr_di" bpmnElement="Activity_1eiuvc6">
        <dc:Bounds x="660" y="200" width="100" height="80" />
      </bpmndi:BPMNShape>
      <bpmndi:BPMNEdge id="association_1u47qxw_di" bpmnElement="association_1u47qxw">
        <di:waypoint x="266" y="223" />
        <di:waypoint x="295" y="151" />
      </bpmndi:BPMNEdge>
    </bpmndi:BPMNPlane>
  </bpmndi:BPMNDiagram>
</bpmn:definitions>
