{
    "flow": [
        {
            "create_in_hive": {
                "sql_1": "CREATE TABLE IF NOT EXISTS dm.a_udm_weekly (        actual_date string,        a,        a double,        snap_date string )"
            },
            "processing": {
                "columns": "a",
                "input_custom_prepare_vector": "a",
                "input_fill_na": "0",
                "input_missing_na_value": "a",
                "model_missing_na_value": "фффффффффффффффффффф",
                "output_column_name": "a",
                "output_index": "a",
                "output_scalar": "1"
            },
            "read_from_hive": {
                "sql_1": "SELECT a, a FROM dm.a_udm_weekly;"
            },
            "write_to_hive": {
                "sql_1": "INSERT OVERWRITE TABLE dm.a_udm_weekly  PARTITION (SNAP_DATE = '$outer_start_prev_week')  SELECT CURRENT_DATE() AS actual_date        , a        , a FROM temp;"
            },
            "write_to_oracle": {
                "sql_1": "CREATE TABLE IF NOT EXISTS dm.a_udm_weekly   (     ACTUAL_DATE DATE NOT NULL     , MSISDN STRING NOT NULL     , SK_SUBS_ID NUMBER(*, 0) NOT NULL     , BULLING_FILIAL_ID NUMBER NOT NULL     , PKU_DEFAULT_NEW_PROB NUMBER NOT NULL     , PCT NUMBER NOT NULL     , SNAP_DATE DATE NOT NULL     , FILIAL_ID NUMBER NOT NULL     )  PARTITION BY RANGE (SNAP_DATE) INTERVAL NUMTODSINTERVAL(1, 'DAY'))  (     PARTITION PO VALUES LESS THEN(TO_DATE('partition_date', 'YYYY-MM-DD'))     )      COMPRESS PCTFREE 0;  ALTER TABLE dm.a_udm_weekly DROP PARTITION FOR (TO_DATE('$OUTER_START_PREV_WEEK', 'YYYY-MM-DD'));"
            }
        }
    ],
    "metadata": {
        "algorithm": {
            "type": "xgbregressor",
            "version": "0.9"
        },
        "entity_name": "git_copy_test_6_vlatest_prod",
        "entity_shared_id": "git_copy_test_6_vlatest_prod",
        "entity_version": "1.0.0",
        "project_name": "git_copy_test_6_vlatest_prod",
        "project_shared_id": "git_copy_test_6_vlatest_prod",
        "project_version": "1.0.0"
    }
}