{
    "flows": [
        {
            "create_in_hive": {
                "sql_1": "CREATE TABLE IF NOT EXISTS dm.a_udm_weekly (        actual_date string,        sk_subs_id bigint,        test double,        test_pct double ) PARTITIONED BY (`snap_date` string) STORED AS PARQUET"
            },
            "processing": {
                "columns": "a,b,c",
                "input_custom_prepare_vector": "na",
                "input_fill_na": "1",
                "input_missing_na_value": "-1000000000",
                "model_missing_na_value": "-1000000000",
                "output_column_name": "test",
                "output_index": "0",
                "output_scalar": "0"
            },
            "read_from_hive": {
                "sql_1": "SELECT filial_id, sk_subs_id, a,b,c FROM dm.a_udm_weekly"
            },
            "write_to_hive": {
                "sql_1": "INSERT OVERWRITE TABLE dm.a_udm_weekly  PARTITION (SNAP_DATE = '$outer_start_prev_week')  SELECT CURRENT_DATE() AS actual_date,        sk_subs_id,        test,        ntile(100) over (order by test) as test_pct FROM temp"
            }
        }
    ],
    "metadata": {
        "entities": [
            {
                "algorithm": {
                    "type": "xgboost",
                    "version": "0.90"
                },
                "pipeline_shared_id": "andrey1000_1_vlatest_prod",
                "pipeline_version": "1.0.0",
                "project_name": "andrey1000_1_vlatest_prod"
            }
        ],
        "project": {
            "project_name": "andrey1000_1_vlatest_prod",
            "project_shared_id": "andrey1000_1_vlatest_prod",
            "project_tracker_tasks": [
                {
                    "type": "main"
                }
            ],
            "project_version": "1.0.0",
            "project_wiki": [
                {
                    "type": "main",
                    "url": "https://modelops.atlassian.net/wiki/display/PROJ/Модель: andrey1000_1-vlatest.Шаблон страницы сущности"
                },
                {
                    "type": "support",
                    "url": "https://modelops.atlassian.net/wiki/display/PROJ/Модель: andrey1000_1-vlatest.Шаблон страницы сущности"
                }
            ]
        }
    },
    "version": "2.0.0"
}