Pin Number,Pin ID,Custom Name,Function,Mode, Direction,Latch,Pull Up,Pull Down,Drive Strength
1,PA00,,Available,,,,,,NORMAL
2,PA01,,Available,,,,,,NORMAL
3,PA02,,Available,,,,,,NORMAL
4,PA03,,Available,,,,,,NORMAL
5,PB04,AIN1,ADC_AIN12,Analog,High Impedance,n/a,,,NORMAL
6,PB05,AIN2,ADC_AIN13,Analog,High Impedance,n/a,,,NORMAL
9,PB06,AIN3,ADC_AIN14,Analog,High Impedance,n/a,,,NORMAL
10,PB07,AIN4,ADC_AIN15,Analog,High Impedance,n/a,,,NORMAL
11,PB08,,Available,,,,,,NORMAL
12,PB09,,Available,,,,,,NORMAL
13,PA04,,Available,,,,,,NORMAL
14,PA05,,Available,,,,,,NORMAL
15,PA06,,Available,,,,,,NORMAL
16,PA07,,Available,,,,,,NORMAL
17,PA08,,Available,,,,,,NORMAL
18,PA09,,Available,,,,,,NORMAL
19,PA10,,Available,,,,,,NORMAL
20,PA11,,Available,,,,,,NORMAL
23,PB10,,Available,,,,,,NORMAL
24,PB11,,Available,,,,,,NORMAL
25,PB12,CDC_USART_TX,SERCOM4_PAD0,Digital,High Impedance,n/a,No,No,NORMAL
26,PB13,CDC_USART_RX,SERCOM4_PAD1,Digital,High Impedance,n/a,No,No,NORMAL
27,PB14,,Available,,,,,,NORMAL
28,PB15,,Available,,,,,,NORMAL
29,PA12,CLICK_USART_TX,SERCOM2_PAD0,Digital,High Impedance,n/a,No,No,NORMAL
30,PA13,CLICK_USART_RX,SERCOM2_PAD1,Digital,High Impedance,n/a,No,No,NORMAL
31,PA14,LED5_BLUE,TC4_WO0,Digital,High Impedance,n/a,No,No,NORMAL
32,PA15,LED5_RED,TC4_WO1,Digital,High Impedance,n/a,No,No,NORMAL
35,PA16,,Available,,,,,,NORMAL
36,PA17,,Available,,,,,,NORMAL
37,PA18,,Available,,,,,,NORMAL
38,PA19,,Available,,,,,,NORMAL
39,PB16,LOCUHEADER_I2C_SDA,SERCOM5_PAD0,Digital,High Impedance,n/a,No,No,NORMAL
40,PB17,LOCUHEADER_I2C_SCL,SERCOM5_PAD1,Digital,High Impedance,n/a,No,No,NORMAL
41,PA20,LED5_GREEN,TC3_WO0,Digital,High Impedance,n/a,No,No,NORMAL
42,PA21,,Available,,,,,,NORMAL
43,PA22,,Available,,,,,,NORMAL
44,PA23,,Available,,,,,,NORMAL
45,PA24,,Available,,,,,,NORMAL
46,PA25,,Available,,,,,,NORMAL
49,PB22,BTN1,EIC_EXTINT6,Digital,High Impedance,n/a,No,No,NORMAL
50,PB23,BTN2,EIC_EXTINT7,Digital,High Impedance,n/a,No,No,NORMAL
51,PA27,BTN3,EIC_EXTINT15,Digital,High Impedance,n/a,No,No,NORMAL
57,PA30,,Available,,,,,,NORMAL
58,PA31,,Available,,,,,,NORMAL
59,PB30,LED1,TCC0_WO0,Digital,High Impedance,n/a,No,No,NORMAL
60,PB31,LED2,TCC0_WO1,Digital,High Impedance,n/a,No,No,NORMAL
61,PB00,LED3,GPIO,Digital,Out,Low,,,NORMAL
62,PB01,LED4,GPIO,Digital,Out,Low,,,NORMAL
63,PB02,,Available,,,,,,NORMAL
64,PB03,,Available,,,,,,NORMAL
