(footprint "SOT23" (version 20211014) (generator pcbnew)
  (layer "F.Cu")
  (tedit 0)
  (descr "<b>SOT-23</b>")
  (fp_text reference "REF**" (at -1.905 -1.905) (layer "F.SilkS")
    (effects (font (size 1.1684 1.1684) (thickness 0.1016)) (justify left bottom))
    (tstamp 34422ec2-bb50-4bbb-a4a4-7a3f5b6d8879)
  )
  (fp_text value ">VALUE" (at -1.905 3.175) (layer "F.Fab")
    (effects (font (size 1.1684 1.1684) (thickness 0.1016)) (justify left bottom))
    (tstamp ae41b58c-ce10-4f03-9c86-87ede9d4ddab)
  )
  (fp_line (start 1.4224 0.6604) (end -1.4224 0.6604) (layer "F.Fab") (width 0.1524) (tstamp 1054bd19-5fba-4854-a1d1-32197cbed08d))
  (fp_line (start -1.4224 0.6604) (end -1.4224 -0.6604) (layer "F.Fab") (width 0.1524) (tstamp 2ecfe96e-fc7a-4d87-a3a3-a805b8083096))
  (fp_line (start -1.4224 -0.6604) (end 1.4224 -0.6604) (layer "F.Fab") (width 0.1524) (tstamp 6ae70025-924a-4cd4-b553-312b94583d7b))
  (fp_line (start 1.4224 -0.6604) (end 1.4224 0.6604) (layer "F.Fab") (width 0.1524) (tstamp 8a9d57b8-ea35-4510-b5ca-fdeef1d85621))
  (fp_poly (pts
      (xy -1.1684 1.2954)
      (xy -0.7112 1.2954)
      (xy -0.7112 0.7112)
      (xy -1.1684 0.7112)
    ) (layer "F.Fab") (width 0) (fill solid) (tstamp 03b45e89-ccf3-479e-92ef-dcdb6763320c))
  (fp_poly (pts
      (xy 0.7112 1.2954)
      (xy 1.1684 1.2954)
      (xy 1.1684 0.7112)
      (xy 0.7112 0.7112)
    ) (layer "F.Fab") (width 0) (fill solid) (tstamp 7a89076b-5f5c-4321-bb1d-800db03bd9b3))
  (fp_poly (pts
      (xy -0.2286 -0.7112)
      (xy 0.2286 -0.7112)
      (xy 0.2286 -1.2954)
      (xy -0.2286 -1.2954)
    ) (layer "F.Fab") (width 0) (fill solid) (tstamp a0d98f60-27a2-4fdf-acac-045282a527b8))
  (pad "1" smd rect (at -0.95 1.1) (size 1 1.4) (layers "F.Cu" "F.Paste" "F.Mask")
    (solder_mask_margin 0.1016) (tstamp 080450a8-dbd2-45c6-bcdd-a8fb2c1c829e))
  (pad "2" smd rect (at 0.95 1.1) (size 1 1.4) (layers "F.Cu" "F.Paste" "F.Mask")
    (solder_mask_margin 0.1016) (tstamp 20ece5e3-fed5-4d11-9f60-29bb8e6ecb60))
  (pad "3" smd rect (at 0 -1.1) (size 1 1.4) (layers "F.Cu" "F.Paste" "F.Mask")
    (solder_mask_margin 0.1016) (tstamp 977df171-685a-4d55-8293-a53aca85310c))
)
