{
  "$schema": "https://json-schema.org/draft/2020-12/schema",
  "$id": "https://example.com/product.schema.json",
  "title": "Baofeng UV5R",
  "description": "Radio settinggs schema.",
  "type": "object",
  "properties": {
    "sql": {
      "type": "integer",
      "description": "Squelch level",
      "memoryAddress": "0x0E21",
      "minimum": 0,
      "maximum": 9
    },
    "step": {
      "type": "string",
      "description": "Frequency step",
      "memoryAddress": "0x0E21",
      "enum": [
        "2.5K",
        "5.0K",
        "6.25K",
        "10.0K",
        "12.5K",
        "20K",
        "25K",
        "50K"
      ]
    },
    "txp": {
      "type": "string",
      "description": "Transmit power",
      "memoryAddress": "0x0E22",
      "enum": [
        "LOW",
        "HIGH"
      ]
    },
    "save": {
      "type": "integer",
      "memoryAddress": "0x0E23",
      "minimum": 0,
      "maximum": 4
    },
    "vox": {
      "type": "number",
      "memoryAddress": "0x0E24",
      "minimum": 0,
      "maximum": 10
    },
    "wn": {
      "type": "string",
      "description": "Wideband / narrowband",
      "memoryAddress": "0x0E25",
      "enum": [
        "WIDE",
        "NARROW"
      ]
    },
    "abr": {
      "type": "number",
      "description": "Display illumination in seconds",
      "memoryAddress": "0x0E26",
      "minimum": 0,
      "maximum": 5
    },
    "tdr": {
      "type": "boolean",
      "description": "Dual watch reception",
      "memoryAddress": "0x0E27"
    },
    "beep": {
      "type": "boolean",
      "description": "Keypad beep",
      "memoryAddress": "0x0E28"
    },
    "tot": {
      "type": "integer",
      "description": "Transimssion timer",
      "memoryAddress": "0x0E29",
      "enum": [
        0,
        15,
        30,
        45,
        60,
        75,
        90,
        105,
        120,
        135,
        150,
        165,
        180,
        195,
        210,
        225,
        240,
        255,
        270,
        285,
        300,
        315,
        330,
        345,
        360,
        375,
        390,
        405,
        420,
        435,
        450,
        465,
        480,
        495,
        510,
        525,
        540,
        555,
        570,
        585,
        600
      ]
    },
    "rdcs": {
      "type": "integer",
      "description": "Receive DCS",
      "memoryAddress": "0x0E2A",
      "enum": [
        0,
        23,
        25,
        26,
        31,
        32,
        36,
        43,
        47,
        51,
        53,
        54,
        65,
        71,
        72,
        73,
        74,
        114,
        115,
        116,
        122,
        125,
        131,
        132,
        134,
        143,
        145,
        152,
        155,
        156,
        162,
        165,
        172,
        174,
        205,
        212,
        223,
        225,
        226,
        243,
        244,
        245,
        246,
        251,
        252,
        255,
        261,
        263,
        265,
        266,
        271,
        274,
        306,
        311,
        315,
        325,
        331,
        332,
        343,
        346,
        351,
        356,
        364,
        365,
        371,
        411,
        412,
        413,
        423,
        431,
        432,
        445,
        446,
        452,
        454,
        455,
        462,
        464,
        465,
        466,
        503,
        506,
        516,
        523,
        526,
        532,
        546,
        565,
        606,
        612,
        624,
        627,
        631,
        632,
        654,
        662,
        664,
        703,
        712,
        723,
        731,
        732,
        734,
        743,
        754
      ]
    },
    "rctcs": {
      "type": "number",
      "description": "Receive CTCSS",
      "memoryAddress": "0x0E2B",
      "enum": [
        0,
        67.0,
        69.3,
        71.9,
        74.4,
        77.0,
        79.7,
        82.5,
        85.4,
        88.5,
        91.5,
        94.8,
        97.4,
        100.0,
        103.5,
        107.2,
        110.9,
        114.8,
        118.8,
        123.0,
        127.3,
        131.8,
        136.5,
        141.3,
        146.2,
        2150.0,
        151.4,
        156.7,
        159.8,
        162.2,
        165.5,
        167.9,
        171.3,
        173.8,
        177.3,
        179.9,
        183.5,
        186.2,
        189.9,
        192.8,
        196.6,
        199.5,
        203.5,
        206.5,
        210.7,
        218.1,
        225.7,
        229.1,
        233.6,
        241.8,
        250.3,
        254.1
      ]
    },
    "tdcs": {
      "type": "integer",
      "description": "Transmit DCS",
      "memoryAddress": "0x0E2C",
      "enum": [
        0,
        23,
        25,
        26,
        31,
        32,
        36,
        43,
        47,
        51,
        53,
        54,
        65,
        71,
        72,
        73,
        74,
        114,
        115,
        116,
        122,
        125,
        131,
        132,
        134,
        143,
        145,
        152,
        155,
        156,
        162,
        165,
        172,
        174,
        205,
        212,
        223,
        225,
        226,
        243,
        244,
        245,
        246,
        251,
        252,
        255,
        261,
        263,
        265,
        266,
        271,
        274,
        306,
        311,
        315,
        325,
        331,
        332,
        343,
        346,
        351,
        356,
        364,
        365,
        371,
        411,
        412,
        413,
        423,
        431,
        432,
        445,
        446,
        452,
        454,
        455,
        462,
        464,
        465,
        466,
        503,
        506,
        516,
        523,
        526,
        532,
        546,
        565,
        606,
        612,
        624,
        627,
        631,
        632,
        654,
        662,
        664,
        703,
        712,
        723,
        731,
        732,
        734,
        743,
        754
      ]
    },
    "tctcs": {
      "type": "number",
      "description": "Transmit CTCSS",
      "memoryAddress": "0x0E2D",
      "enum": [
        0,
        67.0,
        69.3,
        71.9,
        74.4,
        77.0,
        79.7,
        82.5,
        85.4,
        88.5,
        91.5,
        94.8,
        97.4,
        100.0,
        103.5,
        107.2,
        110.9,
        114.8,
        118.8,
        123.0,
        127.3,
        131.8,
        136.5,
        141.3,
        146.2,
        2150.0,
        151.4,
        156.7,
        159.8,
        162.2,
        165.5,
        167.9,
        171.3,
        173.8,
        177.3,
        179.9,
        183.5,
        186.2,
        189.9,
        192.8,
        196.6,
        199.5,
        203.5,
        206.5,
        210.7,
        218.1,
        225.7,
        229.1,
        233.6,
        241.8,
        250.3,
        254.1
      ]
    },
    "voice": {
      "type": "string",
      "description": "Voice prompt",
      "memoryAddress": "0x0E2E",
      "enum": [
        "OFF",
        "English",
        "Chinese"
      ]
    },
    "aniId": {
      "type": "number",
      "description": "Automatic number identification of the radio",
      "memoryAddress": "0x0E2F"
    },
    "dtmfst": {
      "type": "string",
      "description": "DTMF transmit tone",
      "memoryAddress": "0x0E30",
      "enum": [
        "OFF",
        "DT-ST",
        "ANI-ST",
        "DT+ANI"
      ]
    },
    "scode": {
      "type": "number",
      "description": "Signal code",
      "memoryAddress": "0x0E31"
    },
    "screv": {
      "type": "string",
      "description": "Scan resume method",
      "memoryAddress": "0x0E32",
      "enum": [
        "TO",
        "CO",
        "SE"
      ]
    },
    "pttId": {
      "type": "string",
      "description": "Push to talk ID",
      "memoryAddress": "0x0E33",
      "enum": [
        "OFF",
        "BOT",
        "EOT",
        "BOTH"
      ]
    },
    "pttLt": {
      "type": "integer",
      "description": "Signal code sending delay in ms",
      "memoryAddress": "0x0E34",
      "minimum": 0,
      "maximum": 30
    },
    "mdfa": {
      "type": "string",
      "description": "Channel A display",
      "memoryAddress": "0x0E35",
      "enum": [
        "CH",
        "NAME",
        "FREQ"
      ]
    },
    "mdfb": {
      "type": "string",
      "description": "Channel B display",
      "memoryAddress": "0x0E36",
      "enum": [
        "CH",
        "NAME",
        "FREQ"
      ]
    },
    "bcl": {
      "type": "boolean",
      "description": "Busy channel lockout",
      "memoryAddress": "0x0E37"
    },
    "autolk": {
      "type": "boolean",
      "description": "Automatically lock keypad",
      "memoryAddress": "0x0E38"
    },
    "sftd": {
      "type": "string",
      "description": "Frequency shift direction",
      "memoryAddress": "0x0E39",
      "enum": [
        "OFF",
        "PLUS",
        "MINUS"
      ]
    },
    "offset": {
      "type": "number",
      "description": "Frequency offset",
      "memoryAddress": "0x0E61",
      "minimum": 0,
      "maximum": 69.99
    },
    "memch": {
      "type": "integer",
      "description": "Store memory channel",
      "minimum": 0,
      "maximum": 127
    },
    "delch": {
      "type": "integer",
      "description": "Delete memory channel",
      "minimum": 0,
      "maximum": 127
    },
    "wtled": {
      "type": "string",
      "description": "Stand-by display color",
      "memoryAddress": "0x0E3D",
      "enum": [
        "OFF",
        "BLUE",
        "ORANGE",
        "PURPLE"
      ]
    },
    "rxled": {
      "type": "string",
      "description": "Receive display color",
      "memoryAddress": "0x0E3E",
      "enum": [
        "OFF",
        "BLUE",
        "ORANGE",
        "PURPLE"
      ]
    },
    "txled": {
      "type": "string",
      "description": "Transmit display color",
      "memoryAddress": "0x0E3F",
      "enum": [
        "OFF",
        "BLUE",
        "ORANGE",
        "PURPLE"
      ]
    },
    "almod": {
      "type": "string",
      "description": "Alarm mode",
      "memoryAddress": "0x0E40",
      "enum": [
        "SITE",
        "TONE",
        "CODE"
      ]
    },
    "band": {
      "type": "string",
      "description": "Band selection",
      "memoryAddress": "0x0E41",
      "enum": [
        "VHF",
        "UHF"
      ]
    },
    "tdrab": {
      "type": "string",
      "description": "Transmit selection while in dual watch",
      "memoryAddress": "0x0E42",
      "enum": [
        "OFF",
        "A",
        "B"
      ]
    },
    "ste": {
      "type": "boolean",
      "description": "Tail tone elimination",
      "memoryAddress": "0x0E43"
    },
    "rpste": {
      "type": "integer",
      "description": "Tail tone elimination in communication through repeater",
      "memoryAddress": "0x0E44",
      "minimum": 0,
      "maximum": 10
    },
    "rptrl": {
      "type": "integer",
      "description": "Delay of tail tone of repeater",
      "memoryAddress": "0x0E45",
      "minimum": 0,
      "maximum": 10
    },
    "ponmsg": {
      "type": "string",
      "description": "Boot display",
      "memoryAddress": "0x0E46",
      "enum": [
        "FULL",
        "MGS"
      ]
    },
    "roger": {
      "type": "boolean",
      "description": "Tone at end of transmission"
    },
    "reset": {
      "type": "boolean",
      "description": "Restore to defaults",
      "memoryAddress": "0x0E47"
    }
  }
}