{
  "settings": {},
  "channels": [
    {
      "channelNumber": 0,
      "radioChannel": {
        "name": "",
        "transmitFrequency": 1624000,
        "transmitTone": {
          "tone": 0,
          "type": 1
        },
        "receiveFrequency": 1624000,
        "receiveTone": {
          "tone": 0,
          "type": 1
        }
      },
      "settings": {
        "transmitPower": 1
      }
    },
    {
      "channelNumber": 1,
      "radioChannel": {
        "name": "",
        "transmitFrequency": 4625620,
        "transmitTone": {
          "tone": 0,
          "type": 1
        },
        "receiveFrequency": 504625620,
        "receiveTone": {
          "tone": 0,
          "type": 1
        }
      },
      "settings": {
        "transmitPower": 1
      }
    },
    {
      "channelNumber": 2,
      "radioChannel": {
        "name": "",
        "transmitFrequency": 4625870,
        "transmitTone": {
          "tone": 0,
          "type": 1
        },
        "receiveFrequency": 504625870,
        "receiveTone": {
          "tone": 0,
          "type": 1
        }
      },
      "settings": {
        "transmitPower": 1
      }
    },
    {
      "channelNumber": 3,
      "radioChannel": {
        "name": "",
        "transmitFrequency": 4626120,
        "transmitTone": {
          "tone": 0,
          "type": 1
        },
        "receiveFrequency": 504626120,
        "receiveTone": {
          "tone": 0,
          "type": 1
        }
      },
      "settings": {
        "transmitPower": 1
      }
    },
    {
      "channelNumber": 4,
      "radioChannel": {
        "name": "",
        "transmitFrequency": 162400000,
        "transmitTone": {
          "tone": 0,
          "type": 1
        },
        "receiveFrequency": 162400000,
        "receiveTone": {
          "tone": 0,
          "type": 1
        }
      },
      "settings": {
        "transmitPower": 5
      }
    },
    {
      "channelNumber": 5,
      "radioChannel": {
        "name": "",
        "transmitFrequency": 462562500,
        "transmitTone": {
          "tone": 0,
          "type": 1
        },
        "receiveFrequency": 462562500,
        "receiveTone": {
          "tone": 0,
          "type": 1
        }
      },
      "settings": {
        "transmitPower": 5
      }
    },
    {
      "channelNumber": 6,
      "radioChannel": {
        "name": "",
        "transmitFrequency": 462587500,
        "transmitTone": {
          "tone": 0,
          "type": 1
        },
        "receiveFrequency": 462587500,
        "receiveTone": {
          "tone": 0,
          "type": 1
        }
      },
      "settings": {
        "transmitPower": 5
      }
    },
    {
      "channelNumber": 7,
      "radioChannel": {
        "name": "",
        "transmitFrequency": 462612500,
        "transmitTone": {
          "tone": 0,
          "type": 1
        },
        "receiveFrequency": 462612500,
        "receiveTone": {
          "tone": 0,
          "type": 1
        }
      },
      "settings": {
        "transmitPower": 5
      }
    },
    {
      "channelNumber": 8,
      "radioChannel": {
        "name": "",
        "transmitFrequency": 462637500,
        "transmitTone": {
          "tone": 0,
          "type": 1
        },
        "receiveFrequency": 462637500,
        "receiveTone": {
          "tone": 0,
          "type": 1
        }
      },
      "settings": {
        "transmitPower": 5
      }
    },
    {
      "channelNumber": 9,
      "radioChannel": {
        "name": "",
        "transmitFrequency": 462662500,
        "transmitTone": {
          "tone": 0,
          "type": 1
        },
        "receiveFrequency": 462662500,
        "receiveTone": {
          "tone": 0,
          "type": 1
        }
      },
      "settings": {
        "transmitPower": 5
      }
    },
    {
      "channelNumber": 10,
      "radioChannel": {
        "name": "",
        "transmitFrequency": 462687500,
        "transmitTone": {
          "tone": 0,
          "type": 1
        },
        "receiveFrequency": 462687500,
        "receiveTone": {
          "tone": 0,
          "type": 1
        }
      },
      "settings": {
        "transmitPower": 5
      }
    },
    {
      "channelNumber": 11,
      "radioChannel": {
        "name": "",
        "transmitFrequency": 462712500,
        "transmitTone": {
          "tone": 0,
          "type": 1
        },
        "receiveFrequency": 462712500,
        "receiveTone": {
          "tone": 0,
          "type": 1
        }
      },
      "settings": {
        "transmitPower": 5
      }
    },
    {
      "channelNumber": 12,
      "radioChannel": {
        "name": "",
        "transmitFrequency": 467562500,
        "transmitTone": {
          "tone": 0,
          "type": 1
        },
        "receiveFrequency": 467562500,
        "receiveTone": {
          "tone": 0,
          "type": 1
        }
      },
      "settings": {
        "transmitPower": 5
      }
    },
    {
      "channelNumber": 13,
      "radioChannel": {
        "name": "",
        "transmitFrequency": 467587500,
        "transmitTone": {
          "tone": 0,
          "type": 1
        },
        "receiveFrequency": 467587500,
        "receiveTone": {
          "tone": 0,
          "type": 1
        }
      },
      "settings": {
        "transmitPower": 5
      }
    },
    {
      "channelNumber": 14,
      "radioChannel": {
        "name": "",
        "transmitFrequency": 467612500,
        "transmitTone": {
          "tone": 0,
          "type": 1
        },
        "receiveFrequency": 467612500,
        "receiveTone": {
          "tone": 0,
          "type": 1
        }
      },
      "settings": {
        "transmitPower": 5
      }
    },
    {
      "channelNumber": 15,
      "radioChannel": {
        "name": "",
        "transmitFrequency": 467637500,
        "transmitTone": {
          "tone": 0,
          "type": 1
        },
        "receiveFrequency": 467637500,
        "receiveTone": {
          "tone": 0,
          "type": 1
        }
      },
      "settings": {
        "transmitPower": 5
      }
    },
    {
      "channelNumber": 16,
      "radioChannel": {
        "name": "",
        "transmitFrequency": 467662500,
        "transmitTone": {
          "tone": 0,
          "type": 1
        },
        "receiveFrequency": 467662500,
        "receiveTone": {
          "tone": 0,
          "type": 1
        }
      },
      "settings": {
        "transmitPower": 5
      }
    }
  ]
}