{
  "applications": "*",
  "changelogDate": "20231030161623",
  "dto": "no",
  "embedded": false,
  "entityTableName": "product",
  "fields": [
    {
      "fieldName": "name",
      "fieldType": "String",
      "fieldValidateRules": ["required"]
    },
    {
      "fieldName": "description",
      "fieldType": "String"
    },
    {
      "fieldName": "price",
      "fieldType": "BigDecimal",
      "fieldValidateRules": ["required", "min"],
      "fieldValidateRulesMin": "0"
    },
    {
      "fieldName": "productSize",
      "fieldType": "Size",
      "fieldValidateRules": ["required"],
      "fieldValues": "S,M,L,XL,XXL"
    },
    {
      "fieldName": "image",
      "fieldType": "byte[]",
      "fieldTypeBlobContent": "image"
    }
  ],
  "fluentMethods": true,
  "javadoc": "Product sold by the Online store",
  "jpaMetamodelFiltering": false,
  "name": "Product",
  "pagination": "pagination",
  "readOnly": false,
  "relationships": [
    {
      "otherEntityField": "name",
      "otherEntityName": "productCategory",
      "otherEntityRelationshipName": "product",
      "relationshipName": "productCategory",
      "relationshipType": "many-to-one",
      "relationshipValidateRules": "required"
    }
  ],
  "service": "serviceClass"
}
