{
	"info": {
		"_postman_id": "d8607fa1-eb1c-47f0-a400-9497788df220",
		"name": "jpa-using-mongodb",
		"schema": "https://schema.getpostman.com/json/collection/v2.1.0/collection.json"
	},
	"item": [
		{
			"name": "crud",
			"item": [
				{
					"name": "Get All Todos",
					"request": {
						"method": "GET",
						"header": [],
						"url": {
							"raw": "http://127.0.0.1:8080/crud/todos",
							"protocol": "http",
							"host": [
								"127",
								"0",
								"0",
								"1"
							],
							"port": "8080",
							"path": [
								"crud",
								"todos"
							]
						}
					},
					"response": []
				},
				{
					"name": "Get By Id",
					"request": {
						"method": "GET",
						"header": [],
						"url": {
							"raw": "http://127.0.0.1:8080/crud/todos/607a9c59a739325ca7911ac8",
							"protocol": "http",
							"host": [
								"127",
								"0",
								"0",
								"1"
							],
							"port": "8080",
							"path": [
								"crud",
								"todos",
								"607a9c59a739325ca7911ac8"
							]
						}
					},
					"response": []
				},
				{
					"name": "Delete By Id",
					"request": {
						"method": "DELETE",
						"header": [],
						"url": {
							"raw": "http://127.0.0.1:8080/crud/todos/60733d91ab70387a9684ce72",
							"protocol": "http",
							"host": [
								"127",
								"0",
								"0",
								"1"
							],
							"port": "8080",
							"path": [
								"crud",
								"todos",
								"60733d91ab70387a9684ce72"
							]
						}
					},
					"response": []
				},
				{
					"name": "Save Todo",
					"request": {
						"method": "POST",
						"header": [
							{
								"key": "Content-Type",
								"value": "application/json"
							}
						],
						"body": {
							"mode": "raw",
							"raw": "{\n\t\"todo\":null,\n\t\"description\":null\n}"
						},
						"url": {
							"raw": "http://127.0.0.1:8080/crud/todos",
							"protocol": "http",
							"host": [
								"127",
								"0",
								"0",
								"1"
							],
							"port": "8080",
							"path": [
								"crud",
								"todos"
							]
						}
					},
					"response": []
				},
				{
					"name": "Update(PUT) Todo",
					"request": {
						"method": "PUT",
						"header": [
							{
								"key": "Content-Type",
								"value": "application/json"
							}
						],
						"body": {
							"mode": "raw",
							"raw": "{\n\t\"todo\":\"PR#12-new\",\n\t\"description\":\"PR description 12-new\"\n}"
						},
						"url": {
							"raw": "http://127.0.0.1:8080/crud/todos/60733d91ab70387a9684ce72",
							"protocol": "http",
							"host": [
								"127",
								"0",
								"0",
								"1"
							],
							"port": "8080",
							"path": [
								"crud",
								"todos",
								"60733d91ab70387a9684ce72"
							]
						}
					},
					"response": []
				},
				{
					"name": "Update(PATCH) Todo copy",
					"request": {
						"method": "PATCH",
						"header": [
							{
								"key": "Content-Type",
								"value": "application/json"
							}
						],
						"body": {
							"mode": "raw",
							"raw": "{\n\t\"todo\":\"PR#12-new-new\",\n\t\"description\":\"PR description 12-new-new\"\n}"
						},
						"url": {
							"raw": "http://127.0.0.1:8080/crud/todos/60733d91ab70387a9684ce",
							"protocol": "http",
							"host": [
								"127",
								"0",
								"0",
								"1"
							],
							"port": "8080",
							"path": [
								"crud",
								"todos",
								"60733d91ab70387a9684ce"
							]
						}
					},
					"response": []
				}
			]
		},
		{
			"name": "Get using @Query",
			"item": [
				{
					"name": "Get By Multiple ids",
					"request": {
						"method": "GET",
						"header": [],
						"url": {
							"raw": "http://127.0.0.1:8080/query/todos/in?ids=607aab158f00b13e93233782,607aab158f00b13e93233783",
							"protocol": "http",
							"host": [
								"127",
								"0",
								"0",
								"1"
							],
							"port": "8080",
							"path": [
								"query",
								"todos",
								"in"
							],
							"query": [
								{
									"key": "ids",
									"value": "607aab158f00b13e93233782,607aab158f00b13e93233783"
								}
							]
						}
					},
					"response": []
				},
				{
					"name": "Get By exact Id",
					"request": {
						"method": "GET",
						"header": [],
						"url": {
							"raw": "http://127.0.0.1:8080/query/todos/607aa1db825b4674a187adb3",
							"protocol": "http",
							"host": [
								"127",
								"0",
								"0",
								"1"
							],
							"port": "8080",
							"path": [
								"query",
								"todos",
								"607aa1db825b4674a187adb3"
							]
						}
					},
					"response": []
				},
				{
					"name": "Get By like todo string(case-insensitive)",
					"request": {
						"method": "GET",
						"header": [],
						"url": {
							"raw": "http://127.0.0.1:8080/query/todos/like/case-insensitive?str=tEsT",
							"protocol": "http",
							"host": [
								"127",
								"0",
								"0",
								"1"
							],
							"port": "8080",
							"path": [
								"query",
								"todos",
								"like",
								"case-insensitive"
							],
							"query": [
								{
									"key": "str",
									"value": "tEsT"
								}
							]
						}
					},
					"response": []
				},
				{
					"name": "Get By like todo string(case-sensitive)",
					"request": {
						"method": "GET",
						"header": [],
						"url": {
							"raw": "http://127.0.0.1:8080/query/todos/like/case-sensitive?str=teS",
							"protocol": "http",
							"host": [
								"127",
								"0",
								"0",
								"1"
							],
							"port": "8080",
							"path": [
								"query",
								"todos",
								"like",
								"case-sensitive"
							],
							"query": [
								{
									"key": "str",
									"value": "teS"
								}
							]
						}
					},
					"response": []
				},
				{
					"name": "Get By like todo int32-and-string(case-sensitive)",
					"request": {
						"method": "GET",
						"header": [],
						"url": {
							"raw": "http://127.0.0.1:8080/query/todos/like/integer-and-string/case-sensitive?field=todo&searchStr=100",
							"protocol": "http",
							"host": [
								"127",
								"0",
								"0",
								"1"
							],
							"port": "8080",
							"path": [
								"query",
								"todos",
								"like",
								"integer-and-string",
								"case-sensitive"
							],
							"query": [
								{
									"key": "field",
									"value": "todo"
								},
								{
									"key": "searchStr",
									"value": "100"
								}
							]
						}
					},
					"response": []
				},
				{
					"name": "Get All Todos",
					"request": {
						"method": "GET",
						"header": [],
						"url": {
							"raw": "http://127.0.0.1:8080/query/todos",
							"protocol": "http",
							"host": [
								"127",
								"0",
								"0",
								"1"
							],
							"port": "8080",
							"path": [
								"query",
								"todos"
							]
						}
					},
					"response": []
				}
			]
		},
		{
			"name": "Get Using MongoTemplate",
			"item": [
				{
					"name": "[OR]Get By exact Id OR active status",
					"request": {
						"method": "GET",
						"header": [],
						"url": {
							"raw": "http://127.0.0.1:8080/mongo-template/or/todos/607b0db065e37028c9efd005",
							"protocol": "http",
							"host": [
								"127",
								"0",
								"0",
								"1"
							],
							"port": "8080",
							"path": [
								"mongo-template",
								"or",
								"todos",
								"607b0db065e37028c9efd005"
							]
						}
					},
					"response": []
				},
				{
					"name": "[AND]Get By exact Id",
					"request": {
						"method": "GET",
						"header": [],
						"url": {
							"raw": "http://127.0.0.1:8080/mongo-template/and/todos/607b071d9d2126080ff9021e",
							"protocol": "http",
							"host": [
								"127",
								"0",
								"0",
								"1"
							],
							"port": "8080",
							"path": [
								"mongo-template",
								"and",
								"todos",
								"607b071d9d2126080ff9021e"
							]
						}
					},
					"response": []
				},
				{
					"name": "[AND-OR]Get",
					"request": {
						"method": "GET",
						"header": [],
						"url": {
							"raw": "http://127.0.0.1:8080/mongo-template/and-or/todos?ids=607b14e8704ff01bcec1b56f,607b14e8704ff01bcec1b571",
							"protocol": "http",
							"host": [
								"127",
								"0",
								"0",
								"1"
							],
							"port": "8080",
							"path": [
								"mongo-template",
								"and-or",
								"todos"
							],
							"query": [
								{
									"key": "ids",
									"value": "607b14e8704ff01bcec1b56f,607b14e8704ff01bcec1b571"
								}
							]
						}
					},
					"response": []
				},
				{
					"name": "Get All Todos",
					"request": {
						"method": "GET",
						"header": [],
						"url": {
							"raw": "http://127.0.0.1:8080/mongo-template/todos",
							"protocol": "http",
							"host": [
								"127",
								"0",
								"0",
								"1"
							],
							"port": "8080",
							"path": [
								"mongo-template",
								"todos"
							]
						}
					},
					"response": []
				}
			]
		},
		{
			"name": "example-executor",
			"item": [
				{
					"name": "using default-example-matcher",
					"request": {
						"method": "POST",
						"header": [
							{
								"key": "Content-Type",
								"value": "application/json"
							}
						],
						"body": {
							"mode": "raw",
							"raw": "{\n    \"todo\": \"test-todo-1001\",\n    \"completed\":false,\n    \"status\": {\n            \"id\": 2,\n            \"status\": \"ACTIVE\"\n        }\n}"
						},
						"url": {
							"raw": "http://127.0.0.1:8080/example-executor/todos/default-example-matcher",
							"protocol": "http",
							"host": [
								"127",
								"0",
								"0",
								"1"
							],
							"port": "8080",
							"path": [
								"example-executor",
								"todos",
								"default-example-matcher"
							]
						}
					},
					"response": []
				},
				{
					"name": "using custom-example-matcher",
					"request": {
						"method": "POST",
						"header": [
							{
								"key": "Content-Type",
								"value": "application/json"
							}
						],
						"body": {
							"mode": "raw",
							"raw": "{\n    \"todo\": \"tesT-toDO-1001\"\n}"
						},
						"url": {
							"raw": "http://127.0.0.1:8080/example-executor/todos/custom-example-matcher",
							"protocol": "http",
							"host": [
								"127",
								"0",
								"0",
								"1"
							],
							"port": "8080",
							"path": [
								"example-executor",
								"todos",
								"custom-example-matcher"
							]
						}
					},
					"response": []
				}
			]
		},
		{
			"name": "query-dsl",
			"item": [
				{
					"name": "Get By exact Id",
					"request": {
						"method": "GET",
						"header": [],
						"url": {
							"raw": "http://127.0.0.1:8080/query-dsl/todos/607d41a826c1185f8911808f",
							"protocol": "http",
							"host": [
								"127",
								"0",
								"0",
								"1"
							],
							"port": "8080",
							"path": [
								"query-dsl",
								"todos",
								"607d41a826c1185f8911808f"
							]
						}
					},
					"response": []
				},
				{
					"name": "Get All",
					"request": {
						"method": "GET",
						"header": [],
						"url": {
							"raw": "http://127.0.0.1:8080/query-dsl/todos",
							"protocol": "http",
							"host": [
								"127",
								"0",
								"0",
								"1"
							],
							"port": "8080",
							"path": [
								"query-dsl",
								"todos"
							]
						}
					},
					"response": []
				},
				{
					"name": "Get By exact Id AND todo str",
					"request": {
						"method": "GET",
						"header": [],
						"url": {
							"raw": "http://127.0.0.1:8080/query-dsl/and/todos/607dcd0688f87d381ea928e5?str=ToDO",
							"protocol": "http",
							"host": [
								"127",
								"0",
								"0",
								"1"
							],
							"port": "8080",
							"path": [
								"query-dsl",
								"and",
								"todos",
								"607dcd0688f87d381ea928e5"
							],
							"query": [
								{
									"key": "str",
									"value": "ToDO"
								}
							]
						}
					},
					"response": []
				},
				{
					"name": "Get By exact Id OR todo str",
					"request": {
						"method": "GET",
						"header": [],
						"url": {
							"raw": "http://127.0.0.1:8080/query-dsl/or/todos/607dcd0688f87d381ea928e5?str=ToDO",
							"protocol": "http",
							"host": [
								"127",
								"0",
								"0",
								"1"
							],
							"port": "8080",
							"path": [
								"query-dsl",
								"or",
								"todos",
								"607dcd0688f87d381ea928e5"
							],
							"query": [
								{
									"key": "str",
									"value": "ToDO"
								}
							]
						}
					},
					"response": []
				},
				{
					"name": "Get By exact Id AND - OR todo str",
					"request": {
						"method": "GET",
						"header": [],
						"url": {
							"raw": "http://127.0.0.1:8080/query-dsl/and-or/todos/607e60f87232541b18dbb06c?str=ToDO",
							"protocol": "http",
							"host": [
								"127",
								"0",
								"0",
								"1"
							],
							"port": "8080",
							"path": [
								"query-dsl",
								"and-or",
								"todos",
								"607e60f87232541b18dbb06c"
							],
							"query": [
								{
									"key": "str",
									"value": "ToDO"
								}
							]
						}
					},
					"response": []
				}
			]
		}
	]
}