{
	"info": {
		"_postman_id": "845b20f1-2925-4069-b186-d143c41a2857",
		"name": "sfg",
		"schema": "https://schema.getpostman.com/json/collection/v2.1.0/collection.json"
	},
	"item": [
		{
			"name": "s03- http-basic-auth",
			"item": [
				{
					"name": "Get ",
					"request": {
						"method": "GET",
						"header": [
							{
								"key": "Authorization",
								"value": "Basic YWRtaW46YWRtaW4=",
								"type": "text",
								"disabled": true
							}
						],
						"url": {
							"raw": "admin:admin@127.0.0.1:8080/students",
							"auth": {
								"user": "admin",
								"password": "admin"
							},
							"host": [
								"127",
								"0",
								"0",
								"1"
							],
							"port": "8080",
							"path": [
								"students"
							]
						}
					},
					"response": []
				}
			]
		},
		{
			"name": "s04-http-basic-auth-java-config",
			"item": [
				{
					"name": "whitelist/public",
					"request": {
						"method": "GET",
						"header": [],
						"url": {
							"raw": "127.0.0.1:8080/whitelist/public",
							"host": [
								"127",
								"0",
								"0",
								"1"
							],
							"port": "8080",
							"path": [
								"whitelist",
								"public"
							]
						}
					},
					"response": []
				},
				{
					"name": "whitelist/get",
					"request": {
						"method": "GET",
						"header": [],
						"url": {
							"raw": "127.0.0.1:8080/whitelist/get",
							"host": [
								"127",
								"0",
								"0",
								"1"
							],
							"port": "8080",
							"path": [
								"whitelist",
								"get"
							]
						}
					},
					"response": []
				},
				{
					"name": "whitelist/{path}",
					"request": {
						"method": "GET",
						"header": [],
						"url": {
							"raw": "127.0.0.1:8080/whitelist/1234",
							"host": [
								"127",
								"0",
								"0",
								"1"
							],
							"port": "8080",
							"path": [
								"whitelist",
								"1234"
							]
						}
					},
					"response": []
				},
				{
					"name": "[NOTWORKING]whitelist/post",
					"request": {
						"auth": {
							"type": "basic",
							"basic": [
								{
									"key": "password",
									"value": "admin",
									"type": "string"
								},
								{
									"key": "username",
									"value": "admin",
									"type": "string"
								}
							]
						},
						"method": "POST",
						"header": [],
						"url": {
							"raw": "admin:admin@127.0.0.1:8080/whitelist/get",
							"auth": {
								"user": "admin",
								"password": "admin"
							},
							"host": [
								"127",
								"0",
								"0",
								"1"
							],
							"port": "8080",
							"path": [
								"whitelist",
								"get"
							]
						}
					},
					"response": []
				}
			]
		}
	]
}