{
  "HF_MAX": 10000,
  "date": "2022-02-18 15:10:06",
  "SWEEP_AMP": 0.3974999785423279,
  "LF_MAX": 315,
  "remark": "target sweep",
  "SWEEP_POINTS": 34,
  "SWEEP_DWELL": 500,
  "FREQ_MAX": 22050,
  "FREQ_STEP": 0.21228289604187012,
  "points": [
    {
      "amp": 66.5999984741211,
      "freq": 10
    },
    {
      "amp": 71.9000015258789,
      "freq": 12.5
    },
    {
      "amp": 76.30000305175781,
      "freq": 16
    },
    {
      "amp": 79.4000015258789,
      "freq": 20
    },
    {
      "amp": 82.30000305175781,
      "freq": 25
    },
    {
      "amp": 84.69999694824219,
      "freq": 31.5
    },
    {
      "amp": 86.9000015258789,
      "freq": 40
    },
    {
      "amp": 88.69999694824219,
      "freq": 50
    },
    {
      "amp": 90.30000305175781,
      "freq": 63
    },
    {
      "amp": 91.5999984741211,
      "freq": 80
    },
    {
      "amp": 92.5,
      "freq": 100
    },
    {
      "amp": 93.30000305175781,
      "freq": 125
    },
    {
      "amp": 93.69999694824219,
      "freq": 160
    },
    {
      "amp": 93.9000015258789,
      "freq": 200
    },
    {
      "amp": 93.9000015258789,
      "freq": 250
    },
    {
      "amp": 93.69999694824219,
      "freq": 315
    },
    {
      "amp": 93.5,
      "freq": 400
    },
    {
      "amp": 93.4000015258789,
      "freq": 500
    },
    {
      "amp": 93.30000305175781,
      "freq": 630
    },
    {
      "amp": 93.4000015258789,
      "freq": 800
    },
    {
      "amp": 94,
      "freq": 1000
    },
    {
      "amp": 95,
      "freq": 1250
    },
    {
      "amp": 95.9000015258789,
      "freq": 1600
    },
    {
      "amp": 95.5999984741211,
      "freq": 2000
    },
    {
      "amp": 94.5999984741211,
      "freq": 2500
    },
    {
      "amp": 94,
      "freq": 3150
    },
    {
      "amp": 91.80000305175781,
      "freq": 4000
    },
    {
      "amp": 86.69999694824219,
      "freq": 5000
    },
    {
      "amp": 82.5,
      "freq": 6300
    },
    {
      "amp": 79.9000015258789,
      "freq": 8000
    },
    {
      "amp": 71.19999694824219,
      "freq": 10000
    },
    {
      "amp": 71.0999984741211,
      "freq": 12500
    },
    {
      "amp": 63.900001525878906,
      "freq": 16000
    },
    {
      "amp": 61.599998474121094,
      "freq": 20000
    }
  ],
  "HF_MIN": 4000,
  "FREQ_MIN": 20,
  "LF_MIN": 100
}