{
  "dockerTasks":[
    {
      "master": "node-1.integration",
      "name": "gateway",
      "whispererMesh": "integration.json",
      "version": "5.6.0"
    },
    {
      "master": "node-1.perf",
      "name": "gateway",
      "whisperers": [
        "perf1.json",
        "perf2.json",
        "perf3.json"
      ]
    }
  ]
}
