# Generate key for CA
openssl genrsa -out localCA.key 2048

# Generate PEM for CA
openssl req -x509 -new -nodes -key localCA.key -sha256 -days 1825 -out localCA.pem

# Generate key for localhost
openssl genrsa -out localhost.key 2048

# Generate CSR for localhost
openssl req -new -key localhost.key -out localhost.csr

# Sign CSR to get CRT
openssl x509 -req -in localhost.csr -CA localCA.pem -CAkey localCA.key -CAcreateserial -out localhost.crt -days 825 -sha256 -extfile localhost.ext
