<?xml version="1.0" encoding="UTF-8" standalone="no"?>
<!-- Created with Inkscape (http://www.inkscape.org/) -->

<svg
   xmlns:osb="http://www.openswatchbook.org/uri/2009/osb"
   xmlns:dc="http://purl.org/dc/elements/1.1/"
   xmlns:cc="http://creativecommons.org/ns#"
   xmlns:rdf="http://www.w3.org/1999/02/22-rdf-syntax-ns#"
   xmlns:svg="http://www.w3.org/2000/svg"
   xmlns="http://www.w3.org/2000/svg"
   xmlns:xlink="http://www.w3.org/1999/xlink"
   xmlns:sodipodi="http://sodipodi.sourceforge.net/DTD/sodipodi-0.dtd"
   xmlns:inkscape="http://www.inkscape.org/namespaces/inkscape"
   width="96"
   height="96"
   id="svg6517"
   version="1.1"
   inkscape:version="0.92.2 5c3e80d, 2017-08-06"
   sodipodi:docname="icon.svg"
   inkscape:export-filename="/home/acollard/src/landscape-charm/update-landscape-logo/icon.png"
   inkscape:export-xdpi="39.380001"
   inkscape:export-ydpi="39.380001"
   viewBox="0 0 96 96">
  <sodipodi:namedview
     id="base"
     pagecolor="#ffffff"
     bordercolor="#666666"
     borderopacity="1.0"
     inkscape:pageopacity="0.0"
     inkscape:pageshadow="2"
     inkscape:zoom="4"
     inkscape:cx="33.171828"
     inkscape:cy="34.065265"
     inkscape:document-units="px"
     inkscape:current-layer="layer1"
     showgrid="false"
     fit-margin-top="0"
     fit-margin-left="0"
     fit-margin-right="0"
     fit-margin-bottom="0"
     inkscape:window-width="1440"
     inkscape:window-height="804"
     inkscape:window-x="0"
     inkscape:window-y="1"
     inkscape:window-maximized="0"
     showborder="false"
     showguides="false"
     inkscape:guide-bbox="true"
     inkscape:showpageshadow="false"
     inkscape:snap-page="true"
     inkscape:measure-start="-5.76717,75.2353"
     inkscape:measure-end="-52.822,41.1566">
    <inkscape:grid
       snapvisiblegridlinesonly="true"
       enabled="true"
       visible="true"
       empspacing="5"
       id="grid821"
       type="xygrid" />
    <sodipodi:guide
       inkscape:locked="false"
       id="guide823"
       position="16,48"
       orientation="1,0" />
    <sodipodi:guide
       inkscape:locked="false"
       id="guide825"
       position="64,80"
       orientation="0,1" />
    <sodipodi:guide
       inkscape:locked="false"
       id="guide827"
       position="80,40"
       orientation="1,0" />
    <sodipodi:guide
       inkscape:locked="false"
       id="guide829"
       position="64,16"
       orientation="0,1" />
  </sodipodi:namedview>
  <defs
     id="defs6519">
    <linearGradient
       id="Background">
      <stop
         style="stop-color:#b8b8b8;stop-opacity:1"
         offset="0"
         id="stop4178" />
      <stop
         style="stop-color:#c9c9c9;stop-opacity:1"
         offset="1"
         id="stop4180" />
    </linearGradient>
    <filter
       id="filter1121"
       inkscape:label="Inner Shadow"
       style="color-interpolation-filters:sRGB;">
      <feFlood
         id="feFlood1123"
         result="flood"
         flood-color="rgb(0,0,0)"
         flood-opacity="0.59999999999999998" />
      <feComposite
         id="feComposite1125"
         result="composite1"
         operator="out"
         in2="SourceGraphic"
         in="flood" />
      <feGaussianBlur
         id="feGaussianBlur1127"
         result="blur"
         stdDeviation="1"
         in="composite1" />
      <feOffset
         id="feOffset1129"
         result="offset"
         dy="2"
         dx="0" />
      <feComposite
         id="feComposite1131"
         result="composite2"
         operator="atop"
         in2="SourceGraphic"
         in="offset" />
    </filter>
    <filter
       id="filter950"
       inkscape:label="Drop Shadow"
       style="color-interpolation-filters:sRGB;">
      <feFlood
         id="feFlood952"
         result="flood"
         flood-color="rgb(0,0,0)"
         flood-opacity="0.25" />
      <feComposite
         id="feComposite954"
         result="composite1"
         operator="in"
         in2="SourceGraphic"
         in="flood" />
      <feGaussianBlur
         id="feGaussianBlur956"
         result="blur"
         stdDeviation="1"
         in="composite1" />
      <feOffset
         id="feOffset958"
         result="offset"
         dy="1"
         dx="0" />
      <feComposite
         id="feComposite960"
         result="composite2"
         operator="over"
         in2="offset"
         in="SourceGraphic" />
    </filter>
    <clipPath
       id="clipPath873"
       clipPathUnits="userSpaceOnUse">
      <g
         style="fill:#ff00ff;fill-opacity:1;stroke:none;display:inline"
         inkscape:label="Layer 1"
         id="g875"
         transform="matrix(0,-0.66666667,0.66604479,0,-258.25992,677.00001)">
        <path
           sodipodi:nodetypes="sssssssss"
           inkscape:connector-curvature="0"
           id="path877"
           d="m 46.702703,898.22775 50.594594,0 C 138.16216,898.22775 144,904.06497 144,944.92583 l 0,50.73846 c 0,40.86071 -5.83784,46.69791 -46.702703,46.69791 l -50.594594,0 C 5.8378378,1042.3622 0,1036.525 0,995.66429 L 0,944.92583 C 0,904.06497 5.8378378,898.22775 46.702703,898.22775 Z"
           style="fill:#ff00ff;fill-opacity:1;stroke:none;display:inline" />
      </g>
    </clipPath>
    <linearGradient
       id="linearGradient4617"
       osb:paint="solid">
      <stop
         style="stop-color:#000000;stop-opacity:1;"
         offset="0"
         id="stop4615" />
    </linearGradient>
    <path
       d="M50.0004412,4.04252804e-14 C22.3871247,4.04252804e-14 0,22.3848726 0,49.9995588 C0,77.6133626 22.3871247,100 50.0004412,100 C77.6137577,100 100,77.6133626 100,49.9995588 C100,22.3848726 77.6128753,3.55271368e-14 50.0004412,4.04252804e-14 Z"
       id="path-1" />
    <clipPath
       clipPathUnits="userSpaceOnUse"
       id="clipPath3804">
      <path
         style="fill:none;stroke:#000000;stroke-width:1px;stroke-linecap:butt;stroke-linejoin:miter;stroke-opacity:1"
         d="m -97.351695,52.542373 0.423729,-4.131356 1.059322,-4.449153 1.800847,-4.872881 2.330509,-4.555085 2.330508,-3.38983 2.966102,-3.495763 3.283898,-3.072034 4.872882,-3.813559 3.601695,-2.224576 4.661017,-2.330509 4.34322,-1.483051 4.34322,-1.165254 4.449153,-0.95339 4.449152,-0.317796 5.29661,-0.105933 4.237289,0.317797 5.084745,0.95339 6.144068,1.800847 4.555085,2.118644 3.38983,2.224577 4.555085,3.283898 4.449153,3.601695 4.7669489,6.038135 2.4364407,7.733051 1.4830508,5.084746 0.6355932,4.131356 0.3177966,3.601695 v 3.919491 L -5.4025424,61.016949 -6.25,65.042373 l -1.5889831,4.766949 -2.5423729,5.402542 -2.330508,3.601695 -3.072034,4.025424 -0.635594,0.635593 -68.326271,-0.105932 -3.072034,-3.177966 -2.648305,-3.283898 -2.224576,-3.707627 -1.90678,-4.025424 -1.059322,-3.283899 -1.165254,-4.661016 -0.317797,-3.601695 z"
         id="path3806"
         inkscape:connector-curvature="0" />
    </clipPath>
    <clipPath
       clipPathUnits="userSpaceOnUse"
       id="clipPath1302">
      <path
         style="fill:none;stroke:#000000;stroke-width:1px;stroke-linecap:butt;stroke-linejoin:miter;stroke-opacity:1"
         d="m -300.80939,657.14524 v 79.52107 c 18.65142,-8.3608 28.74461,-21.85652 27.63205,-42.07571 -0.99312,-17.46213 -10.32711,-29.86919 -27.63205,-37.44536 z"
         id="path1304"
         inkscape:connector-curvature="0"
         sodipodi:nodetypes="cccc" />
    </clipPath>
    <clipPath
       clipPathUnits="userSpaceOnUse"
       id="clipPath1376">
      <path
         style="fill:none;stroke:#000000;stroke-width:1px;stroke-linecap:butt;stroke-linejoin:miter;stroke-opacity:1"
         d="m -302.07872,658.93902 v 75.10425 c 12.79469,-6.17392 21.23541,-17.45902 22.67546,-36.9623 -0.15882,-13.68762 -3.90213,-26.9036 -22.67546,-38.14195 z"
         id="path1378"
         inkscape:connector-curvature="0"
         sodipodi:nodetypes="cccc" />
    </clipPath>
    <clipPath
       clipPathUnits="userSpaceOnUse"
       id="clipPath1562">
      <path
         style="fill:none;stroke:#000000;stroke-width:1px;stroke-linecap:butt;stroke-linejoin:miter;stroke-opacity:1"
         d="m -379.68169,797.97538 v -21.03879 h -25.76557 c 2.89844,11.63145 7.1247,15.9599 11.21451,21.03879 z"
         id="path1564"
         inkscape:connector-curvature="0"
         sodipodi:nodetypes="ccccc" />
    </clipPath>
    <clipPath
       clipPathUnits="userSpaceOnUse"
       id="clipPath1648">
      <path
         style="fill:none;stroke:#000000;stroke-width:1px;stroke-linecap:butt;stroke-linejoin:miter;stroke-opacity:1"
         d="m -318.97505,736.99069 v -23.58754 c -5.08076,0.2549 -10.56406,1.5407 -15.39768,3.27848 -6.38976,6.82685 -8.21058,13.45346 -10.22886,20.40174 z"
         id="path1650"
         inkscape:connector-curvature="0"
         sodipodi:nodetypes="ccccc" />
    </clipPath>
    <clipPath
       clipPathUnits="userSpaceOnUse"
       id="clipPath1828">
      <path
         style="fill:none;stroke:#000000;stroke-width:1px;stroke-linecap:butt;stroke-linejoin:miter;stroke-opacity:1"
         d="m -321.57241,756.17457 0.17678,31.20108 3.0052,-0.79549 c 4.69791,-2.03156 10.18105,-25.81134 -3.18198,-30.40559 z"
         id="path1830"
         inkscape:connector-curvature="0"
         sodipodi:nodetypes="cccc" />
    </clipPath>
    <clipPath
       clipPathUnits="userSpaceOnUse"
       id="clipPath1836">
      <path
         style="fill:none;stroke:#000000;stroke-width:1px;stroke-linecap:butt;stroke-linejoin:miter;stroke-opacity:1"
         d="m -330.75573,765.98318 h -1.41421 v -1.41421 l 2.12132,-7.07107 13.03728,-1.5468 -0.39775,-4.33102 15.71103,-1.48051 0.44194,5.21491 3.7565,0.0332 0.0111,1.77882 -3.56868,-0.0663 0.69635,5.24652 -16.03125,1.65625 -0.5,-6.34375 -11.84375,1.40625 z"
         id="path1838"
         inkscape:connector-curvature="0" />
    </clipPath>
  </defs>
  <metadata
     id="metadata6522">
    <rdf:RDF>
      <cc:Work
         rdf:about="">
        <dc:format>image/svg+xml</dc:format>
        <dc:type
           rdf:resource="http://purl.org/dc/dcmitype/StillImage" />
        <dc:title />
      </cc:Work>
    </rdf:RDF>
  </metadata>
  <g
     style="display:inline"
     transform="translate(268,-635.29076)"
     id="layer1"
     inkscape:groupmode="layer"
     inkscape:label="BACKGROUND">
    <g
       style="fill:#e6e6e6;fill-opacity:1"
       transform="translate(-140.81466,18.64047)"
       id="g4799">
      <path
         inkscape:connector-curvature="0"
         d="M 48,0 A 48,48 0 0 0 0,48 48,48 0 0 0 48,96 48,48 0 0 0 96,48 48,48 0 0 0 48,0 Z"
         style="color:#000000;display:inline;overflow:visible;visibility:visible;fill:#e6e6e6;fill-opacity:1;fill-rule:nonzero;stroke:none;stroke-width:0.27819771;marker:none;enable-background:accumulate"
         transform="translate(-127.18534,616.65029)"
         id="path4784" />
    </g>
    <image
       y="-0.044536799"
       x="-101.61276"
       id="image3799"
       xlink:href="/Users/timyouell/none.png"
       style="display:inline;image-rendering:optimizeQuality"
       preserveAspectRatio="none"
       height="100"
       width="100"
       clip-path="url(#clipPath3804)"
       transform="matrix(0.92123995,0,0,0.98187221,-273.94441,629.77348)" />
    <g
       id="g1785">
      <rect
         transform="rotate(-76.447103)"
         y="-83.724342"
         x="-702.50922"
         height="0.22591214"
         width="0.3707276"
         id="rect1779"
         style="fill:#287dbd;fill-opacity:1" />
      <rect
         transform="rotate(8.0095544)"
         y="690.93945"
         x="-151.04985"
         height="0.26516503"
         width="0.093912616"
         id="rect1781"
         style="fill:#287dbd;fill-opacity:1" />
    </g>
    <rect
       style="fill:#e6e6e6;fill-opacity:1;stroke-width:1.87718129"
       id="rect1787"
       width="6.9375"
       height="1.015625"
       x="-245.46875"
       y="662.5564" />
    <g
       id="g1986"
       transform="matrix(0.81287308,0,0,0.81111774,-41.44872,129.84308)">
      <g
         id="g1945">
        <g
           id="g1908">
          <g
             id="g1777">
            <g
               id="g1742">
              <g
                 id="g1709">
                <g
                   id="g1638">
                  <g
                     id="g1610">
                    <g
                       id="g1510">
                      <g
                         id="g1468">
                        <g
                           id="g1430">
                          <g
                             id="g1414">
                            <g
                               id="g1370">
                              <g
                                 id="g1352">
                                <g
                                   id="g1338">
                                <g
                                   transform="translate(0.262144,0.262144)"
                                   id="g1326">
                                <g
                                   id="g1316">
                                <g
                                   transform="translate(193.72442,-8.4925339)"
                                   id="g1308">
                                <circle
                                   style="fill:#287dbd;fill-opacity:1;stroke-width:1.16564047"
                                   id="path487"
                                   cx="-414.50583"
                                   cy="691.15002"
                                   r="42.5" />
                                <circle
                                   style="fill:#e6e6e6;fill-opacity:1;stroke-width:1.85893524"
                                   id="path1294"
                                   cx="-315.58679"
                                   cy="696.77997"
                                   r="42.5"
                                   clip-path="url(#clipPath1302)"
                                   transform="translate(-98.242814,-5.7959121)" />
                                </g>
                                <rect
                                   y="717.6593"
                                   x="-204.69223"
                                   height="4.4564481"
                                   width="8.9128962"
                                   id="rect1310"
                                   style="fill:#e6e6e6;fill-opacity:1" />
                                </g>
                                <rect
                                   style="fill:#e6e6e6;fill-opacity:1"
                                   id="rect1318"
                                   width="9.8105965"
                                   height="9.2665062"
                                   x="-205.32779"
                                   y="642.85681" />
                                </g>
                                <rect
                                   y="710.71246"
                                   x="-254.36852"
                                   height="4.8496642"
                                   width="50.069504"
                                   id="rect1328"
                                   style="fill:#e6e6e6;fill-opacity:1" />
                                </g>
                                <rect
                                   style="fill:#e6e6e6;fill-opacity:1"
                                   id="rect1340"
                                   width="46.137344"
                                   height="5.767168"
                                   x="-247.94598"
                                   y="715.29999" />
                              </g>
                              <rect
                                 y="720.80499"
                                 x="-239.68845"
                                 height="4.9807363"
                                 width="35.651585"
                                 id="rect1356"
                                 style="fill:#e6e6e6;fill-opacity:1" />
                            </g>
                          </g>
                        </g>
                        <circle
                           style="fill:#a585b9;fill-opacity:1;stroke-width:1.51804471"
                           id="path1372"
                           cx="-321.88919"
                           cy="696.36548"
                           r="42.5"
                           clip-path="url(#clipPath1376)"
                           transform="translate(102.4983,-13.762563)" />
                      </g>
                      <rect
                         y="715.29999"
                         x="-247.68384"
                         height="5.5050049"
                         width="43.646973"
                         id="rect1380"
                         style="fill:#e6e6e6;fill-opacity:1" />
                      <rect
                         y="710.71246"
                         x="-204.29901"
                         height="6.1603765"
                         width="17.498116"
                         id="rect1382"
                         style="fill:#e6e6e6;fill-opacity:1" />
                      <rect
                         y="716.18359"
                         x="-200.06416"
                         height="4.9121408"
                         width="6.4877329"
                         id="rect1432"
                         style="fill:#e6e6e6;fill-opacity:1" />
                    </g>
                    <circle
                       style="fill:#e6e6e6;fill-opacity:1;stroke-width:1.75267315"
                       id="path1560"
                       cx="-380.46411"
                       cy="769.23865"
                       r="42.5"
                       clip-path="url(#clipPath1562)"
                       transform="translate(159.41287,-87.120986)" />
                  </g>
                  <rect
                     y="707.44647"
                     x="-234.7077"
                     height="7.3291368"
                     width="14.438878"
                     id="rect1612"
                     style="fill:#e6e6e6;fill-opacity:1" />
                </g>
                <circle
                   style="fill:#e6e6e6;fill-opacity:1;stroke-width:1.93966591"
                   id="path1640"
                   cx="-323.01755"
                   cy="744.3653"
                   r="42.5"
                   clip-path="url(#clipPath1648)"
                   transform="translate(98.843978,-73.918086)" />
                <rect
                   style="fill:#e6e6e6;fill-opacity:1;stroke-width:1.00001085"
                   id="rect1652"
                   width="25.664431"
                   height="1.2787836"
                   x="-245.7955"
                   y="663.07263" />
              </g>
              <rect
                 y="662.97357"
                 x="-222.39104"
                 height="0.249856"
                 width="2.256896"
                 id="rect1711"
                 style="fill:#e6e6e6;fill-opacity:1" />
            </g>
            <rect
               style="fill:#e6e6e6;fill-opacity:1"
               id="rect1744"
               width="22.93877"
               height="1.899979"
               x="-244.4588"
               y="661.73297" />
          </g>
          <circle
             transform="translate(121.63128,-75.792893)"
             clip-path="url(#clipPath1828)"
             r="42.5"
             cy="788.04077"
             cx="-313.75"
             id="path1826"
             style="fill:#e6e6e6;fill-opacity:1;stroke-width:2.59731245" />
        </g>
        <circle
           style="fill:#000000;fill-opacity:1;stroke-width:2.69841266"
           id="path1832"
           cx="-322"
           cy="777.79077"
           r="42.5"
           clip-path="url(#clipPath1836)"
           transform="translate(114.64154,-96.406218)" />
      </g>
      <rect
         y="680.69586"
         x="-201.90239"
         height="38.183765"
         width="2.6516485"
         id="rect1947"
         style="fill:#e6e6e6;fill-opacity:1;stroke-width:0.27662852" />
    </g>
  </g>
</svg>
